{"text_format":"3","workbook":"xlsx","n_sheets":23,"sheets":["Control","Page1","Page2","Alt_Page1","Alt_Page2","Chapter","data","adv","gear","cust_groups","cust_chap","adv_lst","groups_lst","elite_adv","distinctions","wargear","weapons","armour","force_fld","result","d","Issues","Content"],"not_rendered":{"images":13,"macros":1,"defined_names":302},"read":"whole","date_system":"1900"}

{"sheet":"Control","index":0,"n_rows":39,"n_cols":45,"rows_kept":39,"merged":[[1,1,2,44],[16,10,16,14],[31,10,31,14]]}
[]
[null,"DEATHWATCH™ CHARACTER SHEET TOOL"]
[]
[]
[{"$nulls":10},{"$f":"\"Name: \"&IF(char_name=\"\",\"\",char_name)","v":"Name: "},{"$nulls":21},{"$f":"\"Name: \"&IF(strChapterName=\"\",\"\",strChapterName)","v":"Name: "}]
[{"$nulls":10},{"$f":"\"Chapter: \"&IF(chapter=\"\",\"\",chapter)","v":"Chapter: "},{"$nulls":21},{"$f":"\"Progenitor: \"&IF(progenitor=\"\",\"\",progenitor)","v":"Progenitor: "}]
[{"$nulls":10},{"$f":"\"Specialty: \"&IF(specialty=\"\",\"\",specialty)","v":"Specialty: "},{"$nulls":21},{"$f":"\"Demeanour: \"&IF(Chapter!D7=\"N/A\",\"Same as Progenitor\",Chapter!D7)","v":"Demeanour: "}]
[{"$nulls":10},{"$f":"IF(specialty<>\"\",\"Rank: \"&IF(rank<1,1,rank),\"Rank: \")","v":"Rank: "},{"$nulls":21},{"$f":"\"Characteristics: \"&IF(res10_91_1=\"\",\"\",IF(res10_91_2=\"\",res10_91_1,res10_91_1&\", \"&res10_91_2))","v":"Characteristics: "}]
[{"$nulls":10},{"$f":"IF(specialty<>\"\",\"XP Left: \"&xpr,\"XP Left: \")","v":"XP Left: "},{"$nulls":21},{"$f":"\"Restrictions: \"&IF(strChapterName=\"\",\"\",IF(res22_98_1=\"\",\"None\",IF(res22_98_2=\"\",res22_98_1,res22_98_1&\", \"&res22_98_2)))","v":"Restrictions: "}]
[{"$nulls":32},{"$f":"\"Advances: \"&Chapter!D32","v":"Advances: "}]
[]
[]
[]
[]
[]
[{"$nulls":10},"Saved:"]
[{"$nulls":10},true]
[]
[]
[]
[{"$nulls":32},"< This will add the current custom"]
[{"$nulls":32},"Chapter to the Generator."]
{"$rows_empty":8}
[{"$nulls":10},"Paper Size:"]
[{"$nulls":10},"A4"]
[]
[]
[]
[]
[]
[]
[{"$nulls":44},{"$f":"strversion","v":"Version: 0.5 r7 [16/12/2013]"}]

{"sheet":"Page1","index":1,"n_rows":85,"n_cols":60,"rows_kept":85,"merged":[[1,7,1,30],[1,37,1,60],[2,4,2,30],[2,36,2,60],[3,8,3,30],[3,40,3,60],[4,5,4,20],[4,23,4,25],[4,34,4,60],[5,6,5,60],[6,1,8,60],[9,1,9,5],[9,7,9,11],[9,13,9,18],[9,20,9,25],[9,27,9,32],[9,34,9,39],[9,41,9,46],[9,48,9,53],[9,55,9,60],[10,1,10,5],[10,7,10,11],[10,13,10,18],[10,20,10,25],[10,27,10,32],[10,34,10,39],[10,41,10,46],[10,48,10,53],[10,55,10,60],[11,1,14,5],[11,7,14,11],[11,13,12,14],[11,16,14,18],[11,20,12,21],[11,23,14,25],[11,27,14,29],[11,30,14,32],[11,34,14,36],[11,37,14,39],[11,41,14,43],[11,44,14,46],[11,48,14,50],[11,51,14,53],[11,55,14,57],[11,58,14,60],[13,13,14,15],[13,20,14,22],[16,13,18,13],[16,15,18,15],[16,17,18,17],[16,19,18,19],[16,33,18,33],[16,35,18,35],[16,37,18,37],[16,39,18,39],[16,53,18,53],[16,55,18,55],[16,57,18,57],[16,59,18,59],[65,42,67,49],[65,55,65,57],[73,1,85,19],[73,20,85,38],[73,42,74,48],[73,56,73,57],[76,48,76,59],[78,42,79,49],[78,52,78,53],[78,58,78,59],[79,52,79,53],[79,58,79,59],[81,42,82,51],[81,56,81,57],[82,56,82,57],[84,42,85,50],[84,56,84,57]]}
[]
[null,"Character Name",{"$nulls":5},{"$f":"IF(char_name=\"\",\"\",char_name)","v":""},{"$nulls":24},"Player Name",{"$nulls":4},{"$f":"IF(play_name=\"\",\"\",play_name)","v":""}]
[null,"Chapter",null,null,{"$f":"IF(successorchapter=\"\",IF(chapter=\"\",\"\",chapter),successorchapter)","v":""},{"$nulls":27},"Past Event",{"$nulls":3},{"$f":"IF(past_event=\"\",\"\",past_event)","v":""}]
[null,"Chapter Demeanour",{"$nulls":6},{"$f":"IF(chapdemeanour=\"\",\"\",chapdemeanour)","v":""},{"$nulls":23},"Personal Demeanour",{"$nulls":7},{"$f":"IF(persdemeanour=\"\",\"\",persdemeanour)","v":""}]
[null,"Specialty",{"$nulls":3},{"$f":"IF(specialty=\"\",\"\",specialty)","v":""},{"$nulls":15},"Rank",null,{"$f":"IF(rank=0,1,rank)","v":1},null,null,"Power Armour History",{"$nulls":7},{"$f":"IF(pa_history1=\"\",\"\",pa_history1)&IF(pa_history2=\"\",\"\",\", \"&pa_history2)&IF(pa_history3=\"\",\"\",\", \"&pa_history3)","v":""}]
[null,"Description",{"$nulls":4},{"$f":"IF(description=\"\",\"\",description)","v":""}]
[null,"CHARACTERISTICS"]
[]
[]
[null,"Weapon Skill",{"$nulls":5},"Ballistic Skill",{"$nulls":5},"Strength",{"$nulls":6},"Toughness",{"$nulls":6},"Agility",{"$nulls":6},"Intelligence",{"$nulls":6},"Perception",{"$nulls":6},"Will Power",{"$nulls":6},"Fellowship"]
[null,"(WS)",{"$nulls":5},"(BS)",{"$nulls":5},"(S)",{"$nulls":6},"(T)",{"$nulls":6},"(Ag)",{"$nulls":6},"(Int)",{"$nulls":6},"(Per)",{"$nulls":6},"(WP)",{"$nulls":6},"(Fel)"]
[null,{"$f":"cha_ws","v":30},{"$nulls":5},{"$f":"cha_bs","v":30},{"$nulls":5},{"$f":"s_bon","v":3},null,null,{"$f":"MOD(cha_s,10)","v":0},{"$nulls":3},{"$f":"t_bon","v":3},null,null,{"$f":"MOD(cha_t,10)","v":0},{"$nulls":3},{"$f":"(cha_ag-AE12)/10","v":3},null,null,{"$f":"MOD(cha_ag,10)","v":0},{"$nulls":3},{"$f":"(cha_int-AL12)/10","v":3},null,null,{"$f":"MOD(cha_int,10)","v":0},{"$nulls":3},{"$f":"(cha_per-AS12)/10","v":3},null,null,{"$f":"MOD(cha_per,10)","v":0},{"$nulls":3},{"$f":"(cha_wp-AZ12)/10","v":3},null,null,{"$f":"MOD(cha_wp,10)","v":0},{"$nulls":3},{"$f":"(cha_fel-BG12)/10","v":3},null,null,{"$f":"MOD(cha_fel,10)","v":0}]
[]
[{"$nulls":13},{"$f":"((cha_s-Q12)/10)","v":3},{"$nulls":6},{"$f":"(cha_t-X12)/10","v":3}]
[]
[]
[{"$nulls":13},"Basic",null,"Trained",null,"+10%",null,"+20%",{"$nulls":13},"Basic",null,"Trained",null,"+10%",null,"+20%",{"$nulls":13},"Basic",null,"Trained",null,"+10%",null,"+20%"]
[]
[]
[null,null,"Acrobatics (Ag)",{"$nulls":12},{"$f":"AND(COUNTIF(adv!$A:$A,LEFT(C20,SEARCH(\"(\",C20)-2)))","v":false},null,{"$f":"AND(COUNTIF(adv!$A:$A,LEFT(C20,SEARCH(\"(\",C20)-2)&\" +10\"))","v":false},null,{"$f":"AND(COUNTIF(adv!$A:$A,LEFT(C20,SEARCH(\"(\",C20)-2)&\" +20\"))","v":false},null,null,"Evaluate (int)",{"$nulls":12},{"$f":"AND(COUNTIF(adv!$A:$A,LEFT(W20,SEARCH(\"(\",W20)-2)))","v":false},null,{"$f":"AND(COUNTIF(adv!$A:$A,LEFT(W20,SEARCH(\"(\",W20)-2)&\" +10\"))","v":false},null,{"$f":"AND(COUNTIF(adv!$A:$A,LEFT(W20,SEARCH(\"(\",W20)-2)&\" +20\"))","v":false},null,null,"Scrutiny (Per)",{"$nulls":10},"x",null,{"$f":"AND(COUNTIF(adv!$A:$A,LEFT(AQ20,SEARCH(\"(\",AQ20)-2)))","v":false},null,{"$f":"AND(COUNTIF(adv!$A:$A,LEFT(AQ20,SEARCH(\"(\",AQ20)-2)&\" +10\"))","v":false},null,{"$f":"AND(COUNTIF(adv!$A:$A,LEFT(AQ20,SEARCH(\"(\",AQ20)-2)&\" +20\"))","v":false}]
[]
[null,null,"Awareness (Per)",{"$nulls":10},"x",null,{"$f":"AND(COUNTIF(adv!$A:$A,LEFT(C22,SEARCH(\"(\",C22)-2)))","v":false},null,{"$f":"AND(COUNTIF(adv!$A:$A,LEFT(C22,SEARCH(\"(\",C22)-2)&\" +10\"))","v":false},null,{"$f":"AND(COUNTIF(adv!$A:$A,LEFT(C22,SEARCH(\"(\",C22)-2)&\" +20\"))","v":false},null,null,"Forbidden Lore (Int)",{"$nulls":12},{"$f":"AND(COUNTIF(adv!$A:$A,LEFT(W22,SEARCH(\"(\",W22)-2)))","v":false},null,{"$f":"AND(COUNTIF(adv!$A:$A,LEFT(W22,SEARCH(\"(\",W22)-2)&\" +10\"))","v":false},null,{"$f":"AND(COUNTIF(adv!$A:$A,LEFT(W22,SEARCH(\"(\",W22)-2)&\" +20\"))","v":false},null,null,"Search (Per)",{"$nulls":10},"x",null,{"$f":"AND(COUNTIF(adv!$A:$A,LEFT(AQ22,SEARCH(\"(\",AQ22)-2)))","v":false},null,{"$f":"AND(COUNTIF(adv!$A:$A,LEFT(AQ22,SEARCH(\"(\",AQ22)-2)&\" +10\"))","v":false},null,{"$f":"AND(COUNTIF(adv!$A:$A,LEFT(AQ22,SEARCH(\"(\",AQ22)-2)&\" +20\"))","v":false}]
[]
[null,null,"Barter (Fel)",{"$nulls":12},{"$f":"AND(COUNTIF(adv!$A:$A,LEFT(C24,SEARCH(\"(\",C24)-2)))","v":false},null,{"$f":"AND(COUNTIF(adv!$A:$A,LEFT(C24,SEARCH(\"(\",C24)-2)&\" +10\"))","v":false},null,{"$f":"AND(COUNTIF(adv!$A:$A,LEFT(C24,SEARCH(\"(\",C24)-2)&\" +20\"))","v":false},null,null,"Lore: Forbidden (any)","Xenos",{"$nulls":11},{"$f":"AND(COUNTIF(adv!$A:$A,LEFT(W24,SEARCH(\"(\",W24)-2)&\" (\"&X24&\")\"))","v":false},null,{"$f":"AND(COUNTIF(adv!$A:$A,LEFT(W24,SEARCH(\"(\",W24)-2)&\" (\"&X24&\")\"&\" +10\"))","v":false},null,{"$f":"AND(COUNTIF(adv!$A:$A,LEFT(W24,SEARCH(\"(\",W24)-2)&\" (\"&X24&\")\"&\" +20\"))","v":false},null,null,"Secret Tongue (Int)",{"$nulls":12},{"$f":"AND(COUNTIF(adv!$A:$A,LEFT(AQ24,SEARCH(\"(\",AQ24)-2)&\" (\"&AR24&\")\"))","v":false},null,{"$f":"AND(COUNTIF(adv!$A:$A,LEFT(AQ24,SEARCH(\"(\",AQ24)-2)&\" (\"&AR24&\")\"&\" +10\"))","v":false},null,{"$f":"AND(COUNTIF(adv!$A:$A,LEFT(AQ24,SEARCH(\"(\",AQ24)-2)&\" (\"&AR24&\")\"&\" +20\"))","v":false}]
[]
[null,null,"Blather (Fel)",{"$nulls":12},{"$f":"AND(COUNTIF(adv!$A:$A,LEFT(C26,SEARCH(\"(\",C26)-2)))","v":false},null,{"$f":"AND(COUNTIF(adv!$A:$A,LEFT(C26,SEARCH(\"(\",C26)-2)&\" +10\"))","v":false},null,{"$f":"AND(COUNTIF(adv!$A:$A,LEFT(C26,SEARCH(\"(\",C26)-2)&\" +20\"))","v":false},null,null,"Lore: Forbidden (any)",{"$nulls":12},{"$f":"AND(COUNTIF(adv!$A:$A,LEFT(W26,SEARCH(\"(\",W26)-2)&\" (\"&X26&\")\"))","v":false},null,{"$f":"AND(COUNTIF(adv!$A:$A,LEFT(W26,SEARCH(\"(\",W26)-2)&\" (\"&X26&\")\"&\" +10\"))","v":false},null,{"$f":"AND(COUNTIF(adv!$A:$A,LEFT(W26,SEARCH(\"(\",W26)-2)&\" (\"&X26&\")\"&\" +20\"))","v":false},null,null,"Secret Tongue (any)",{"$nulls":12},{"$f":"AND(COUNTIF(adv!$A:$A,LEFT(AQ26,SEARCH(\"(\",AQ26)-2)&\" (\"&AR26&\")\"))","v":false},null,{"$f":"AND(COUNTIF(adv!$A:$A,LEFT(AQ26,SEARCH(\"(\",AQ26)-2)&\" (\"&AR26&\")\"&\" +10\"))","v":false},null,{"$f":"AND(COUNTIF(adv!$A:$A,LEFT(AQ26,SEARCH(\"(\",AQ26)-2)&\" (\"&AR26&\")\"&\" +20\"))","v":false}]
[]
[null,null,"Carouse (T)",{"$nulls":10},"x",null,{"$f":"AND(COUNTIF(adv!$A:$A,LEFT(C28,SEARCH(\"(\",C28)-2)))","v":false},null,{"$f":"AND(COUNTIF(adv!$A:$A,LEFT(C28,SEARCH(\"(\",C28)-2)&\" +10\"))","v":false},null,{"$f":"AND(COUNTIF(adv!$A:$A,LEFT(C28,SEARCH(\"(\",C28)-2)&\" +20\"))","v":false},null,null,"Lore: Forbidden (any)",{"$nulls":12},{"$f":"AND(COUNTIF(adv!$A:$A,LEFT(W28,SEARCH(\"(\",W28)-2)&\" (\"&X28&\")\"))","v":false},null,{"$f":"AND(COUNTIF(adv!$A:$A,LEFT(W28,SEARCH(\"(\",W28)-2)&\" (\"&X28&\")\"&\" +10\"))","v":false},null,{"$f":"AND(COUNTIF(adv!$A:$A,LEFT(W28,SEARCH(\"(\",W28)-2)&\" (\"&X28&\")\"&\" +20\"))","v":false},null,null,"Secret Tongue (any)",{"$nulls":12},{"$f":"AND(COUNTIF(adv!$A:$A,LEFT(AQ28,SEARCH(\"(\",AQ28)-2)&\" (\"&AR28&\")\"))","v":false},null,{"$f":"AND(COUNTIF(adv!$A:$A,LEFT(AQ28,SEARCH(\"(\",AQ28)-2)&\" (\"&AR28&\")\"&\" +10\"))","v":false},null,{"$f":"AND(COUNTIF(adv!$A:$A,LEFT(AQ28,SEARCH(\"(\",AQ28)-2)&\" (\"&AR28&\")\"&\" +20\"))","v":false}]
[]
[null,null,"Charm (Fel)",{"$nulls":10},"x",null,{"$f":"AND(COUNTIF(adv!$A:$A,LEFT(C30,SEARCH(\"(\",C30)-2)))","v":false},null,{"$f":"AND(COUNTIF(adv!$A:$A,LEFT(C30,SEARCH(\"(\",C30)-2)&\" +10\"))","v":false},null,{"$f":"AND(COUNTIF(adv!$A:$A,LEFT(C30,SEARCH(\"(\",C30)-2)&\" +20\"))","v":false},null,null,"Gamble (Int)",{"$nulls":10},"x",null,{"$f":"AND(COUNTIF(adv!$A:$A,LEFT(W30,SEARCH(\"(\",W30)-2)))","v":false},null,{"$f":"AND(COUNTIF(adv!$A:$A,LEFT(W30,SEARCH(\"(\",W30)-2)&\" +10\"))","v":false},null,{"$f":"AND(COUNTIF(adv!$A:$A,LEFT(W30,SEARCH(\"(\",W30)-2)&\" +20\"))","v":false},null,null,"Security (Ag)",{"$nulls":12},{"$f":"AND(COUNTIF(adv!$A:$A,LEFT(AQ30,SEARCH(\"(\",AQ30)-2)))","v":false},null,{"$f":"AND(COUNTIF(adv!$A:$A,LEFT(AQ30,SEARCH(\"(\",AQ30)-2)&\" +10\"))","v":false},null,{"$f":"AND(COUNTIF(adv!$A:$A,LEFT(AQ30,SEARCH(\"(\",AQ30)-2)&\" +20\"))","v":false}]
[]
[null,null,"Chem-Use (Int)",{"$nulls":12},{"$f":"AND(COUNTIF(adv!$A:$A,LEFT(C32,SEARCH(\"(\",C32)-2)))","v":false},null,{"$f":"AND(COUNTIF(adv!$A:$A,LEFT(C32,SEARCH(\"(\",C32)-2)&\" +10\"))","v":false},null,{"$f":"AND(COUNTIF(adv!$A:$A,LEFT(C32,SEARCH(\"(\",C32)-2)&\" +20\"))","v":false},null,null,"Inquiry (Fel)",{"$nulls":10},"x",null,{"$f":"AND(COUNTIF(adv!$A:$A,LEFT(W32,SEARCH(\"(\",W32)-2)))","v":false},null,{"$f":"AND(COUNTIF(adv!$A:$A,LEFT(W32,SEARCH(\"(\",W32)-2)&\" +10\"))","v":false},null,{"$f":"AND(COUNTIF(adv!$A:$A,LEFT(W32,SEARCH(\"(\",W32)-2)&\" +20\"))","v":false},null,null,"Shadowing (Ag)",{"$nulls":12},{"$f":"AND(COUNTIF(adv!$A:$A,LEFT(AQ32,SEARCH(\"(\",AQ32)-2)))","v":false},null,{"$f":"AND(COUNTIF(adv!$A:$A,LEFT(AQ32,SEARCH(\"(\",AQ32)-2)&\" +10\"))","v":false},null,{"$f":"AND(COUNTIF(adv!$A:$A,LEFT(AQ32,SEARCH(\"(\",AQ32)-2)&\" +20\"))","v":false}]
[]
[null,null,"Ciphers (Int)",{"$nulls":12},{"$f":"AND(COUNTIF(adv!$A:$A,LEFT(C34,SEARCH(\"(\",C34)-2)))","v":false},null,{"$f":"AND(COUNTIF(adv!$A:$A,LEFT(C34,SEARCH(\"(\",C34)-2)&\" +10\"))","v":false},null,{"$f":"AND(COUNTIF(adv!$A:$A,LEFT(C34,SEARCH(\"(\",C34)-2)&\" +20\"))","v":false},null,null,"Interrogation (WP)",{"$nulls":12},{"$f":"AND(COUNTIF(adv!$A:$A,LEFT(W34,SEARCH(\"(\",W34)-2)))","v":false},null,{"$f":"AND(COUNTIF(adv!$A:$A,LEFT(W34,SEARCH(\"(\",W34)-2)&\" +10\"))","v":false},null,{"$f":"AND(COUNTIF(adv!$A:$A,LEFT(W34,SEARCH(\"(\",W34)-2)&\" +20\"))","v":false},null,null,"Silent Move (Ag)",{"$nulls":10},"x",null,{"$f":"AND(COUNTIF(adv!$A:$A,LEFT(AQ34,SEARCH(\"(\",AQ34)-2)))","v":false},null,{"$f":"AND(COUNTIF(adv!$A:$A,LEFT(AQ34,SEARCH(\"(\",AQ34)-2)&\" +10\"))","v":false},null,{"$f":"AND(COUNTIF(adv!$A:$A,LEFT(AQ34,SEARCH(\"(\",AQ34)-2)&\" +20\"))","v":false}]
[]
[null,null,"Ciphers (any)","Chapter Runes",{"$nulls":11},{"$f":"AND(COUNTIF(adv!$A:$A,LEFT(C36,SEARCH(\"(\",C36)-2)&\" (\"&D36&\")\"))","v":false},null,{"$f":"AND(COUNTIF(adv!$A:$A,LEFT(C36,SEARCH(\"(\",C36)-2)&\" (\"&D36&\")\"&\" +10\"))","v":false},null,{"$f":"AND(COUNTIF(adv!$A:$A,LEFT(C36,SEARCH(\"(\",C36)-2)&\" (\"&D36&\")\"&\" +20\"))","v":false},null,null,"Intimidate (S)",{"$nulls":10},"x",null,{"$f":"AND(COUNTIF(adv!$A:$A,LEFT(W36,SEARCH(\"(\",W36)-2)))","v":false},null,{"$f":"AND(COUNTIF(adv!$A:$A,LEFT(W36,SEARCH(\"(\",W36)-2)&\" +10\"))","v":false},null,{"$f":"AND(COUNTIF(adv!$A:$A,LEFT(W36,SEARCH(\"(\",W36)-2)&\" +20\"))","v":false},null,null,"Sleight of Hand (Ag)",{"$nulls":12},{"$f":"AND(COUNTIF(adv!$A:$A,LEFT(AQ36,SEARCH(\"(\",AQ36)-2)))","v":false},null,{"$f":"AND(COUNTIF(adv!$A:$A,LEFT(AQ36,SEARCH(\"(\",AQ36)-2)&\" +10\"))","v":false},null,{"$f":"AND(COUNTIF(adv!$A:$A,LEFT(AQ36,SEARCH(\"(\",AQ36)-2)&\" +20\"))","v":false}]
[]
[null,null,"Ciphers (any)",{"$nulls":12},{"$f":"AND(COUNTIF(adv!$A:$A,LEFT(C38,SEARCH(\"(\",C38)-2)&\" (\"&D38&\")\"))","v":false},null,{"$f":"AND(COUNTIF(adv!$A:$A,LEFT(C38,SEARCH(\"(\",C38)-2)&\" (\"&D38&\")\"&\" +10\"))","v":false},null,{"$f":"AND(COUNTIF(adv!$A:$A,LEFT(C38,SEARCH(\"(\",C38)-2)&\" (\"&D38&\")\"&\" +20\"))","v":false},null,null,"Invocation (WP)",{"$nulls":12},{"$f":"AND(COUNTIF(adv!$A:$A,LEFT(W38,SEARCH(\"(\",W38)-2)))","v":false},null,{"$f":"AND(COUNTIF(adv!$A:$A,LEFT(W38,SEARCH(\"(\",W38)-2)&\" +10\"))","v":false},null,{"$f":"AND(COUNTIF(adv!$A:$A,LEFT(W38,SEARCH(\"(\",W38)-2)&\" +20\"))","v":false},null,null,"Speak Language (Ag)",{"$nulls":12},{"$f":"AND(COUNTIF(adv!$A:$A,LEFT(AQ38,SEARCH(\"(\",AQ38)-2)))","v":false},null,{"$f":"AND(COUNTIF(adv!$A:$A,LEFT(AQ38,SEARCH(\"(\",AQ38)-2)&\" +10\"))","v":false},null,{"$f":"AND(COUNTIF(adv!$A:$A,LEFT(AQ38,SEARCH(\"(\",AQ38)-2)&\" +20\"))","v":false}]
[]
[null,null,"Climb (S)",{"$nulls":10},"x",null,{"$f":"AND(COUNTIF(adv!$A:$A,LEFT(C40,SEARCH(\"(\",C40)-2)))","v":false},null,{"$f":"AND(COUNTIF(adv!$A:$A,LEFT(C40,SEARCH(\"(\",C40)-2)&\" +10\"))","v":false},null,{"$f":"AND(COUNTIF(adv!$A:$A,LEFT(C40,SEARCH(\"(\",C40)-2)&\" +20\"))","v":false},null,null,"Lip Reading (Per)",{"$nulls":12},{"$f":"AND(COUNTIF(adv!$A:$A,LEFT(W40,SEARCH(\"(\",W40)-2)))","v":false},null,{"$f":"AND(COUNTIF(adv!$A:$A,LEFT(W40,SEARCH(\"(\",W40)-2)&\" +10\"))","v":false},null,{"$f":"AND(COUNTIF(adv!$A:$A,LEFT(W40,SEARCH(\"(\",W40)-2)&\" +20\"))","v":false},null,null,"Speak Language (any)","High Gothic",{"$nulls":11},{"$f":"AND(COUNTIF(adv!$A:$A,LEFT(AQ40,SEARCH(\"(\",AQ40)-2)&\" (\"&AR40&\")\"))","v":false},null,{"$f":"AND(COUNTIF(adv!$A:$A,LEFT(AQ40,SEARCH(\"(\",AQ40)-2)&\" (\"&AR40&\")\"&\" +10\"))","v":false},null,{"$f":"AND(COUNTIF(adv!$A:$A,LEFT(AQ40,SEARCH(\"(\",AQ40)-2)&\" (\"&AR40&\")\"&\" +20\"))","v":false}]
[]
[null,null,"Command (Fel)",{"$nulls":10},"x",null,{"$f":"AND(COUNTIF(adv!$A:$A,LEFT(C42,SEARCH(\"(\",C42)-2)))","v":false},null,{"$f":"AND(COUNTIF(adv!$A:$A,LEFT(C42,SEARCH(\"(\",C42)-2)&\" +10\"))","v":false},null,{"$f":"AND(COUNTIF(adv!$A:$A,LEFT(C42,SEARCH(\"(\",C42)-2)&\" +20\"))","v":false},null,null,"Literacy (Int)",{"$nulls":12},{"$f":"AND(COUNTIF(adv!$A:$A,LEFT(W42,SEARCH(\"(\",W42)-2)))","v":false},null,{"$f":"AND(COUNTIF(adv!$A:$A,LEFT(W42,SEARCH(\"(\",W42)-2)&\" +10\"))","v":false},null,{"$f":"AND(COUNTIF(adv!$A:$A,LEFT(W42,SEARCH(\"(\",W42)-2)&\" +20\"))","v":false},null,null,"Speak Language (any)","Low Gothic",{"$nulls":11},{"$f":"AND(COUNTIF(adv!$A:$A,LEFT(AQ42,SEARCH(\"(\",AQ42)-2)&\" (\"&AR42&\")\"))","v":false},null,{"$f":"AND(COUNTIF(adv!$A:$A,LEFT(AQ42,SEARCH(\"(\",AQ42)-2)&\" (\"&AR42&\")\"&\" +10\"))","v":false},null,{"$f":"AND(COUNTIF(adv!$A:$A,LEFT(AQ42,SEARCH(\"(\",AQ42)-2)&\" (\"&AR42&\")\"&\" +20\"))","v":false}]
[]
[null,null,"Common Lore (Int)",{"$nulls":12},{"$f":"AND(COUNTIF(adv!$A:$A,LEFT(C44,SEARCH(\"(\",C44)-2)))","v":false},null,{"$f":"AND(COUNTIF(adv!$A:$A,LEFT(C44,SEARCH(\"(\",C44)-2)&\" +10\"))","v":false},null,{"$f":"AND(COUNTIF(adv!$A:$A,LEFT(C44,SEARCH(\"(\",C44)-2)&\" +20\"))","v":false},null,null,"Logic (Int)",{"$nulls":10},"x",null,{"$f":"AND(COUNTIF(adv!$A:$A,LEFT(W44,SEARCH(\"(\",W44)-2)))","v":false},null,{"$f":"AND(COUNTIF(adv!$A:$A,LEFT(W44,SEARCH(\"(\",W44)-2)&\" +10\"))","v":false},null,{"$f":"AND(COUNTIF(adv!$A:$A,LEFT(W44,SEARCH(\"(\",W44)-2)&\" +20\"))","v":false},null,null,"Speak Language (any)",{"$nulls":12},{"$f":"AND(COUNTIF(adv!$A:$A,LEFT(AQ44,SEARCH(\"(\",AQ44)-2)&\" (\"&AR44&\")\"))","v":false},null,{"$f":"AND(COUNTIF(adv!$A:$A,LEFT(AQ44,SEARCH(\"(\",AQ44)-2)&\" (\"&AR44&\")\"&\" +10\"))","v":false},null,{"$f":"AND(COUNTIF(adv!$A:$A,LEFT(AQ44,SEARCH(\"(\",AQ44)-2)&\" (\"&AR44&\")\"&\" +20\"))","v":false}]
[]
[null,null,"Lore: Common (any)","Adeptus Astartes",{"$nulls":11},{"$f":"AND(COUNTIF(adv!$A:$A,LEFT(C46,SEARCH(\"(\",C46)-2)&\" (\"&D46&\")\"))","v":false},null,{"$f":"AND(COUNTIF(adv!$A:$A,LEFT(C46,SEARCH(\"(\",C46)-2)&\" (\"&D46&\")\"&\" +10\"))","v":false},null,{"$f":"AND(COUNTIF(adv!$A:$A,LEFT(C46,SEARCH(\"(\",C46)-2)&\" (\"&D46&\")\"&\" +20\"))","v":false},null,null,"Medicae (Int)",{"$nulls":12},{"$f":"AND(COUNTIF(adv!$A:$A,LEFT(W46,SEARCH(\"(\",W46)-2)))","v":false},null,{"$f":"AND(COUNTIF(adv!$A:$A,LEFT(W46,SEARCH(\"(\",W46)-2)&\" +10\"))","v":false},null,{"$f":"AND(COUNTIF(adv!$A:$A,LEFT(W46,SEARCH(\"(\",W46)-2)&\" +20\"))","v":false},null,null,"Survival (Int)",{"$nulls":12},{"$f":"AND(COUNTIF(adv!$A:$A,LEFT(AQ46,SEARCH(\"(\",AQ46)-2)))","v":false},null,{"$f":"AND(COUNTIF(adv!$A:$A,LEFT(AQ46,SEARCH(\"(\",AQ46)-2)&\" +10\"))","v":false},null,{"$f":"AND(COUNTIF(adv!$A:$A,LEFT(AQ46,SEARCH(\"(\",AQ46)-2)&\" +20\"))","v":false}]
[]
[null,null,"Lore: Common (any)","Deathwatch",{"$nulls":11},{"$f":"AND(COUNTIF(adv!$A:$A,LEFT(C48,SEARCH(\"(\",C48)-2)&\" (\"&D48&\")\"))","v":false},null,{"$f":"AND(COUNTIF(adv!$A:$A,LEFT(C48,SEARCH(\"(\",C48)-2)&\" (\"&D48&\")\"&\" +10\"))","v":false},null,{"$f":"AND(COUNTIF(adv!$A:$A,LEFT(C48,SEARCH(\"(\",C48)-2)&\" (\"&D48&\")\"&\" +20\"))","v":false},null,null,"Navigation (Int)",{"$nulls":12},{"$f":"AND(COUNTIF(adv!$A:$A,LEFT(W48,SEARCH(\"(\",W48)-2)))","v":false},null,{"$f":"AND(COUNTIF(adv!$A:$A,LEFT(W48,SEARCH(\"(\",W48)-2)&\" +10\"))","v":false},null,{"$f":"AND(COUNTIF(adv!$A:$A,LEFT(W48,SEARCH(\"(\",W48)-2)&\" +20\"))","v":false},null,null,"Swim (S)",{"$nulls":10},"x",null,{"$f":"AND(COUNTIF(adv!$A:$A,LEFT(AQ48,SEARCH(\"(\",AQ48)-2)))","v":false},null,{"$f":"AND(COUNTIF(adv!$A:$A,LEFT(AQ48,SEARCH(\"(\",AQ48)-2)&\" +10\"))","v":false},null,{"$f":"AND(COUNTIF(adv!$A:$A,LEFT(AQ48,SEARCH(\"(\",AQ48)-2)&\" +20\"))","v":false}]
[]
[null,null,"Lore: Common (any)","Imperium",{"$nulls":11},{"$f":"AND(COUNTIF(adv!$A:$A,LEFT(C50,SEARCH(\"(\",C50)-2)&\" (\"&D50&\")\"))","v":false},null,{"$f":"AND(COUNTIF(adv!$A:$A,LEFT(C50,SEARCH(\"(\",C50)-2)&\" (\"&D50&\")\"&\" +10\"))","v":false},null,{"$f":"AND(COUNTIF(adv!$A:$A,LEFT(C50,SEARCH(\"(\",C50)-2)&\" (\"&D50&\")\"&\" +20\"))","v":false},null,null,"Navigation (any)","Surface",{"$nulls":11},{"$f":"AND(COUNTIF(adv!$A:$A,LEFT(W50,SEARCH(\"(\",W50)-2)&\" (\"&X50&\")\"))","v":false},null,{"$f":"AND(COUNTIF(adv!$A:$A,LEFT(W50,SEARCH(\"(\",W50)-2)&\" (\"&X50&\")\"&\" +10\"))","v":false},null,{"$f":"AND(COUNTIF(adv!$A:$A,LEFT(W50,SEARCH(\"(\",W50)-2)&\" (\"&X50&\")\"&\" +20\"))","v":false},null,null,"Tactics (Int)",{"$nulls":12},{"$f":"AND(COUNTIF(adv!$A:$A,LEFT(AQ50,SEARCH(\"(\",AQ50)-2)))","v":false},null,{"$f":"AND(COUNTIF(adv!$A:$A,LEFT(AQ50,SEARCH(\"(\",AQ50)-2)&\" +10\"))","v":false},null,{"$f":"AND(COUNTIF(adv!$A:$A,LEFT(AQ50,SEARCH(\"(\",AQ50)-2)&\" +20\"))","v":false}]
[]
[null,null,"Lore: Common (any)","War",{"$nulls":11},{"$f":"AND(COUNTIF(adv!$A:$A,LEFT(C52,SEARCH(\"(\",C52)-2)&\" (\"&D52&\")\"))","v":false},null,{"$f":"AND(COUNTIF(adv!$A:$A,LEFT(C52,SEARCH(\"(\",C52)-2)&\" (\"&D52&\")\"&\" +10\"))","v":false},null,{"$f":"AND(COUNTIF(adv!$A:$A,LEFT(C52,SEARCH(\"(\",C52)-2)&\" (\"&D52&\")\"&\" +20\"))","v":false},null,null,"Navigation (any)",{"$nulls":12},{"$f":"AND(COUNTIF(adv!$A:$A,LEFT(W52,SEARCH(\"(\",W52)-2)&\" (\"&X52&\")\"))","v":false},null,{"$f":"AND(COUNTIF(adv!$A:$A,LEFT(W52,SEARCH(\"(\",W52)-2)&\" (\"&X52&\")\"&\" +10\"))","v":false},null,{"$f":"AND(COUNTIF(adv!$A:$A,LEFT(W52,SEARCH(\"(\",W52)-2)&\" (\"&X52&\")\"&\" +20\"))","v":false},null,null,"Tactics (any)",{"$nulls":12},{"$f":"AND(COUNTIF(adv!$A:$A,LEFT(AQ52,SEARCH(\"(\",AQ52)-2)&\" (\"&AR52&\")\"))","v":false},null,{"$f":"AND(COUNTIF(adv!$A:$A,LEFT(AQ52,SEARCH(\"(\",AQ52)-2)&\" (\"&AR52&\")\"&\" +10\"))","v":false},null,{"$f":"AND(COUNTIF(adv!$A:$A,LEFT(AQ52,SEARCH(\"(\",AQ52)-2)&\" (\"&AR52&\")\"&\" +20\"))","v":false}]
[]
[null,null,"Lore: Common (any)",{"$nulls":12},{"$f":"AND(COUNTIF(adv!$A:$A,LEFT(C54,SEARCH(\"(\",C54)-2)&\" (\"&D54&\")\"))","v":false},null,{"$f":"AND(COUNTIF(adv!$A:$A,LEFT(C54,SEARCH(\"(\",C54)-2)&\" (\"&D54&\")\"&\" +10\"))","v":false},null,{"$f":"AND(COUNTIF(adv!$A:$A,LEFT(C54,SEARCH(\"(\",C54)-2)&\" (\"&D54&\")\"&\" +20\"))","v":false},null,null,"Performer (Fel)",{"$nulls":12},{"$f":"AND(COUNTIF(adv!$A:$A,LEFT(W54,SEARCH(\"(\",W54)-2)))","v":false},null,{"$f":"AND(COUNTIF(adv!$A:$A,LEFT(W54,SEARCH(\"(\",W54)-2)&\" +10\"))","v":false},null,{"$f":"AND(COUNTIF(adv!$A:$A,LEFT(W54,SEARCH(\"(\",W54)-2)&\" +20\"))","v":false},null,null,"Tech-Use (Int)",{"$nulls":12},{"$f":"AND(COUNTIF(adv!$A:$A,LEFT(AQ54,SEARCH(\"(\",AQ54)-2)))","v":false},null,{"$f":"AND(COUNTIF(adv!$A:$A,LEFT(AQ54,SEARCH(\"(\",AQ54)-2)&\" +10\"))","v":false},null,{"$f":"AND(COUNTIF(adv!$A:$A,LEFT(AQ54,SEARCH(\"(\",AQ54)-2)&\" +20\"))","v":false}]
[]
[null,null,"Concealment (Ag)",{"$nulls":10},"x",null,{"$f":"AND(COUNTIF(adv!$A:$A,LEFT(C56,SEARCH(\"(\",C56)-2)))","v":false},null,{"$f":"AND(COUNTIF(adv!$A:$A,LEFT(C56,SEARCH(\"(\",C56)-2)&\" +10\"))","v":false},null,{"$f":"AND(COUNTIF(adv!$A:$A,LEFT(C56,SEARCH(\"(\",C56)-2)&\" +20\"))","v":false},null,null,"Performaner (any)",{"$nulls":12},{"$f":"AND(COUNTIF(adv!$A:$A,LEFT(W56,SEARCH(\"(\",W56)-2)&\" (\"&X56&\")\"))","v":false},null,{"$f":"AND(COUNTIF(adv!$A:$A,LEFT(W56,SEARCH(\"(\",W56)-2)&\" (\"&X56&\")\"&\" +10\"))","v":false},null,{"$f":"AND(COUNTIF(adv!$A:$A,LEFT(W56,SEARCH(\"(\",W56)-2)&\" (\"&X56&\")\"&\" +20\"))","v":false},null,null,"Tracking (Int)",{"$nulls":12},{"$f":"AND(COUNTIF(adv!$A:$A,LEFT(AQ56,SEARCH(\"(\",AQ56)-2)))","v":false},null,{"$f":"AND(COUNTIF(adv!$A:$A,LEFT(AQ56,SEARCH(\"(\",AQ56)-2)&\" +10\"))","v":false},null,{"$f":"AND(COUNTIF(adv!$A:$A,LEFT(AQ56,SEARCH(\"(\",AQ56)-2)&\" +20\"))","v":false}]
[]
[null,null,"Contortionist (Ag)",{"$nulls":10},"x",null,{"$f":"AND(COUNTIF(adv!$A:$A,LEFT(C58,SEARCH(\"(\",C58)-2)))","v":false},null,{"$f":"AND(COUNTIF(adv!$A:$A,LEFT(C58,SEARCH(\"(\",C58)-2)&\" +10\"))","v":false},null,{"$f":"AND(COUNTIF(adv!$A:$A,LEFT(C58,SEARCH(\"(\",C58)-2)&\" +20\"))","v":false},null,null,"Pilot (Ag)",{"$nulls":12},{"$f":"AND(COUNTIF(adv!$A:$A,LEFT(W58,SEARCH(\"(\",W58)-2)))","v":false},null,{"$f":"AND(COUNTIF(adv!$A:$A,LEFT(W58,SEARCH(\"(\",W58)-2)&\" +10\"))","v":false},null,{"$f":"AND(COUNTIF(adv!$A:$A,LEFT(W58,SEARCH(\"(\",W58)-2)&\" +20\"))","v":false},null,null,"Trade (Int)",{"$nulls":12},{"$f":"AND(COUNTIF(adv!$A:$A,LEFT(AQ58,SEARCH(\"(\",AQ58)-2)))","v":false},null,{"$f":"AND(COUNTIF(adv!$A:$A,LEFT(AQ58,SEARCH(\"(\",AQ58)-2)&\" +10\"))","v":false},null,{"$f":"AND(COUNTIF(adv!$A:$A,LEFT(AQ58,SEARCH(\"(\",AQ58)-2)&\" +20\"))","v":false}]
[]
[null,null,"Deceive (Fel)",{"$nulls":10},"x",null,{"$f":"AND(COUNTIF(adv!$A:$A,LEFT(C60,SEARCH(\"(\",C60)-2)))","v":false},null,{"$f":"AND(COUNTIF(adv!$A:$A,LEFT(C60,SEARCH(\"(\",C60)-2)&\" +10\"))","v":false},null,{"$f":"AND(COUNTIF(adv!$A:$A,LEFT(C60,SEARCH(\"(\",C60)-2)&\" +20\"))","v":false},null,null,"Pilot (any)",{"$nulls":12},{"$f":"AND(COUNTIF(adv!$A:$A,LEFT(W60,SEARCH(\"(\",W60)-2)&\" (\"&X60&\")\"))","v":false},null,{"$f":"AND(COUNTIF(adv!$A:$A,LEFT(W60,SEARCH(\"(\",W60)-2)&\" (\"&X60&\")\"&\" +10\"))","v":false},null,{"$f":"AND(COUNTIF(adv!$A:$A,LEFT(W60,SEARCH(\"(\",W60)-2)&\" (\"&X60&\")\"&\" +20\"))","v":false},null,null,"Trade (any)",{"$nulls":12},{"$f":"AND(COUNTIF(adv!$A:$A,LEFT(AQ60,SEARCH(\"(\",AQ60)-2)&\" (\"&AR60&\")\"))","v":false},null,{"$f":"AND(COUNTIF(adv!$A:$A,LEFT(AQ60,SEARCH(\"(\",AQ60)-2)&\" (\"&AR60&\")\"&\" +10\"))","v":false},null,{"$f":"AND(COUNTIF(adv!$A:$A,LEFT(AQ60,SEARCH(\"(\",AQ60)-2)&\" (\"&AR60&\")\"&\" +20\"))","v":false}]
[]
[null,null,"Demolition (Int)",{"$nulls":12},{"$f":"AND(COUNTIF(adv!$A:$A,LEFT(C62,SEARCH(\"(\",C62)-2)))","v":false},null,{"$f":"AND(COUNTIF(adv!$A:$A,LEFT(C62,SEARCH(\"(\",C62)-2)&\" +10\"))","v":false},null,{"$f":"AND(COUNTIF(adv!$A:$A,LEFT(C62,SEARCH(\"(\",C62)-2)&\" +20\"))","v":false},null,null,"Pilot (any)",{"$nulls":12},{"$f":"AND(COUNTIF(adv!$A:$A,LEFT(W62,SEARCH(\"(\",W62)-2)&\" (\"&X62&\")\"))","v":false},null,{"$f":"AND(COUNTIF(adv!$A:$A,LEFT(W62,SEARCH(\"(\",W62)-2)&\" (\"&X62&\")\"&\" +10\"))","v":false},null,{"$f":"AND(COUNTIF(adv!$A:$A,LEFT(W62,SEARCH(\"(\",W62)-2)&\" (\"&X62&\")\"&\" +20\"))","v":false},null,null,"Wrangling (Int)",{"$nulls":12},{"$f":"AND(COUNTIF(adv!$A:$A,LEFT(AQ62,SEARCH(\"(\",AQ62)-2)))","v":false},null,{"$f":"AND(COUNTIF(adv!$A:$A,LEFT(AQ62,SEARCH(\"(\",AQ62)-2)&\" +10\"))","v":false},null,{"$f":"AND(COUNTIF(adv!$A:$A,LEFT(AQ62,SEARCH(\"(\",AQ62)-2)&\" +20\"))","v":false}]
[]
[null,null,"Disguise (Fel)",{"$nulls":12},{"$f":"AND(COUNTIF(adv!$A:$A,LEFT(C64,SEARCH(\"(\",C64)-2)))","v":false},null,{"$f":"AND(COUNTIF(adv!$A:$A,LEFT(C64,SEARCH(\"(\",C64)-2)&\" +10\"))","v":false},null,{"$f":"AND(COUNTIF(adv!$A:$A,LEFT(C64,SEARCH(\"(\",C64)-2)&\" +20\"))","v":false},null,null,"Psyniscience (Per)",{"$nulls":12},{"$f":"AND(COUNTIF(adv!$A:$A,LEFT(W64,SEARCH(\"(\",W64)-2)))","v":false},null,{"$f":"AND(COUNTIF(adv!$A:$A,LEFT(W64,SEARCH(\"(\",W64)-2)&\" +10\"))","v":false},null,{"$f":"AND(COUNTIF(adv!$A:$A,LEFT(W64,SEARCH(\"(\",W64)-2)&\" +20\"))","v":false},{"$nulls":15},{"$f":"AND(COUNTIF(adv!$A:$A,LEFT(AQ64,SEARCH(\"(\",AQ64)-2)))","v":false},null,{"$f":"AND(COUNTIF(adv!$A:$A,LEFT(AQ64,SEARCH(\"(\",AQ64)-2)&\" +10\"))","v":false},null,{"$f":"AND(COUNTIF(adv!$A:$A,LEFT(AQ64,SEARCH(\"(\",AQ64)-2)&\" +20\"))","v":false}]
[]
[null,null,"Dodge (Ag)",{"$nulls":10},"x",null,{"$f":"AND(COUNTIF(adv!$A:$A,LEFT(C66,SEARCH(\"(\",C66)-2)))","v":false},null,{"$f":"AND(COUNTIF(adv!$A:$A,LEFT(C66,SEARCH(\"(\",C66)-2)&\" +10\"))","v":false},null,{"$f":"AND(COUNTIF(adv!$A:$A,LEFT(C66,SEARCH(\"(\",C66)-2)&\" +20\"))","v":false},null,null,"Scholastic Lore (Int)",{"$nulls":12},{"$f":"AND(COUNTIF(adv!$A:$A,LEFT(W66,SEARCH(\"(\",W66)-2)))","v":false},null,{"$f":"AND(COUNTIF(adv!$A:$A,LEFT(W66,SEARCH(\"(\",W66)-2)&\" +10\"))","v":false},null,{"$f":"AND(COUNTIF(adv!$A:$A,LEFT(W66,SEARCH(\"(\",W66)-2)&\" +20\"))","v":false},null,null,"WOUNDS:",{"$nulls":11},"Total",{"$f":"wounds","v":18}]
[{"$nulls":54},"Current"]
[null,null,"Drive (Ag)",{"$nulls":12},{"$f":"AND(COUNTIF(adv!$A:$A,LEFT(C68,SEARCH(\"(\",C68)-2)))","v":false},null,{"$f":"AND(COUNTIF(adv!$A:$A,LEFT(C68,SEARCH(\"(\",C68)-2)&\" +10\"))","v":false},null,{"$f":"AND(COUNTIF(adv!$A:$A,LEFT(C68,SEARCH(\"(\",C68)-2)&\" +20\"))","v":false},null,null,"Lore: Scholastic (any)","Codex Astartes",{"$nulls":11},{"$f":"AND(COUNTIF(adv!$A:$A,LEFT(W68,SEARCH(\"(\",W68)-2)&\" (\"&X68&\")\"))","v":false},null,{"$f":"AND(COUNTIF(adv!$A:$A,LEFT(W68,SEARCH(\"(\",W68)-2)&\" (\"&X68&\")\"&\" +10\"))","v":false},null,{"$f":"AND(COUNTIF(adv!$A:$A,LEFT(W68,SEARCH(\"(\",W68)-2)&\" (\"&X68&\")\"&\" +20\"))","v":false},{"$nulls":14},"Fatigue"]
[]
[null,null,"Drive (any)","Ground Vehicles",{"$nulls":11},{"$f":"AND(COUNTIF(adv!$A:$A,LEFT(C70,SEARCH(\"(\",C70)-2)&\" (\"&D70&\")\"))","v":false},null,{"$f":"AND(COUNTIF(adv!$A:$A,LEFT(C70,SEARCH(\"(\",C70)-2)&\" (\"&D70&\")\"&\" +10\"))","v":false},null,{"$f":"AND(COUNTIF(adv!$A:$A,LEFT(C70,SEARCH(\"(\",C70)-2)&\" (\"&D70&\")\"&\" +20\"))","v":false},null,null,"Lore: Scholastic (any)",{"$nulls":12},{"$f":"AND(COUNTIF(adv!$A:$A,LEFT(W70,SEARCH(\"(\",W70)-2)&\" (\"&X70&\")\"))","v":false},null,{"$f":"AND(COUNTIF(adv!$A:$A,LEFT(W70,SEARCH(\"(\",W70)-2)&\" (\"&X70&\")\"&\" +10\"))","v":false},null,{"$f":"AND(COUNTIF(adv!$A:$A,LEFT(W70,SEARCH(\"(\",W70)-2)&\" (\"&X70&\")\"&\" +20\"))","v":false},null,null,"Critical Damage"]
[]
[null,null,"Drive (any)",{"$nulls":12},{"$f":"AND(COUNTIF(adv!$A:$A,LEFT(C72,SEARCH(\"(\",C72)-2)&\" (\"&D72&\")\"))","v":false},null,{"$f":"AND(COUNTIF(adv!$A:$A,LEFT(C72,SEARCH(\"(\",C72)-2)&\" (\"&D72&\")\"&\" +10\"))","v":false},null,{"$f":"AND(COUNTIF(adv!$A:$A,LEFT(C72,SEARCH(\"(\",C72)-2)&\" (\"&D72&\")\"&\" +20\"))","v":false},null,null,"Lore: Scholastic (any)",{"$nulls":12},{"$f":"AND(COUNTIF(adv!$A:$A,LEFT(W72,SEARCH(\"(\",W72)-2)&\" (\"&X72&\")\"))","v":false},null,{"$f":"AND(COUNTIF(adv!$A:$A,LEFT(W72,SEARCH(\"(\",W72)-2)&\" (\"&X72&\")\"&\" +10\"))","v":false},null,{"$f":"AND(COUNTIF(adv!$A:$A,LEFT(W72,SEARCH(\"(\",W72)-2)&\" (\"&X72&\")\"&\" +20\"))","v":false}]
[]
[null,"SPACE MARINE ABILITIES\n\nSecondary Heart/Ossmodula/Biscopea/Haemastamen: You gain the Unnatural Strength and Toughness Traits.\nLarraman’s Organ: You do not suffer from Blood Loss.\nCatalepsean Node: You suffer no penalties to Perception-based Tests when awake for long periods of time.\nPreomnor: You gain +20 to Toughness Tests against ingested poisons.\nmophagea: You may gain a Skill or Skill Group by devouring a portion of an enemy.\nMulti-Lung: You may re-roll any failed Toughness Test for drowning or asphyxiation. In addition, you gain a +30 to Toughness Tests made to resist gases, and may re-roll failed results.\ncculube and Lyman’s Ear: You gain the Heightened Senses (Sight and Hearing) Talents, +10 to relevant Awareness Tests.",{"$nulls":18},"Sus-an Membrane: You may enter suspended animation.\nOolotic Kidney: You may re-roll any failed Toughness Test ro resist poisons and toxins, including attacks with the Toxic Quality.\nNeuroglottis: You may detect any poison or toxin by taste with a successful Awareness Test. You gain a +10 to Tracking Tests against a target you have tasted.\nMucranoid: You may re-roll any failed Toughness Tests caused by temperature extremes.\nBetcher’s Gland: You may spit acid as a ranged weapon with the following profile:\nRange: 3m; Damage: 1d5; Pen 4; Toxic. If you hit your target by 3 or more degrees of success, you have blinded him for 1d5 Rounds.\nProgenoids: These may be retrieved with a successful Medicae Test.\nBlack Carapace: While wearing Power Armour, enemies do not gain a bonus to hit you due to your size.",{"$nulls":21},"INSANITY:",{"$nulls":12},"Current",{"$f":"IF(insanity<1,\"\",insanity)","v":""}]
[]
[{"$nulls":42},"Battle Fatigue"]
[{"$nulls":42},"Primarch's Curse",{"$nulls":5},{"$f":"IF(primcurse=\"\",\"\",primcurse)","v":""}]
[]
[{"$nulls":42},"MOVEMENT:",{"$nulls":8},"Half",{"$f":"mv_half","v":3},{"$nulls":4},"Charge",{"$f":"mv_charge","v":9}]
[{"$nulls":51},"Full",{"$f":"mv_full","v":6},{"$nulls":4},"Run",{"$f":"mv_run","v":18}]
[]
[{"$nulls":42},"FATE POINTS:",{"$nulls":12},"Total",{"$f":"fate","v":0}]
[{"$nulls":55},"Current"]
[]
[{"$nulls":42},"CORRUPTION:",{"$nulls":12},"Current",{"$f":"IF(corruption<1,\"\",corruption)","v":""}]

{"sheet":"Page2","index":2,"n_rows":86,"n_cols":61,"rows_kept":86,"merged":[[1,1,3,60],[4,1,4,5],[4,7,4,11],[4,13,4,18],[4,20,4,25],[4,27,4,32],[4,34,4,39],[4,41,4,46],[4,48,4,53],[4,55,4,60],[5,1,5,5],[5,7,5,11],[5,13,5,18],[5,20,5,25],[5,27,5,32],[5,34,5,39],[5,41,5,46],[5,48,5,53],[5,55,5,60],[6,1,9,5],[6,7,9,11],[6,13,7,14],[6,16,9,18],[6,20,7,21],[6,23,9,25],[6,27,9,29],[6,30,9,32],[6,34,9,36],[6,37,9,39],[6,41,9,43],[6,44,9,46],[6,48,9,50],[6,51,9,53],[6,55,9,57],[6,58,9,60],[8,13,9,15],[8,20,9,22],[11,2,12,29],[11,32,12,59],[13,5,14,29],[13,35,14,59],[15,5,16,8],[15,13,16,17],[15,21,16,23],[15,26,16,29],[15,35,16,38],[15,43,16,47],[15,51,16,53],[15,56,16,59],[17,5,18,8],[17,11,18,16],[17,21,18,23],[17,26,18,29],[17,35,18,38],[17,41,18,46],[17,51,18,53],[17,56,18,59],[19,9,21,29],[19,39,21,59],[22,2,23,29],[23,33,23,37],[23,39,23,43],[23,45,23,49],[23,51,23,57],[24,5,25,29],[24,33,26,37],[24,39,24,43],[24,45,26,49],[25,40,26,42],[26,5,27,8],[26,13,27,17],[26,21,27,23],[26,26,27,29],[28,5,29,8],[28,11,29,16],[28,21,29,23],[28,26,29,29],[28,33,28,37],[28,45,28,49],[29,33,29,37],[29,45,29,49],[30,9,32,29],[30,34,31,36],[30,39,30,43],[30,46,31,48],[31,39,31,43],[32,40,33,42],[33,2,34,29],[35,5,36,29],[37,5,38,8],[37,13,38,17],[37,21,38,23],[37,26,38,29],[38,35,38,39],[38,43,38,47],[39,5,40,8],[39,11,40,16],[39,21,40,23],[39,26,40,29],[39,35,39,39],[39,43,39,47],[40,36,41,38],[40,44,41,46],[41,9,43,29],[44,32,45,59],[45,2,46,29],[46,32,58,59],[47,2,47,14],[47,17,47,29],[48,2,48,14],[48,17,48,29],[49,2,49,14],[49,17,49,29],[50,2,50,14],[50,17,50,29],[51,2,51,14],[51,17,51,29],[52,2,52,14],[52,17,52,29],[53,2,53,14],[53,17,53,29],[54,2,54,14],[54,17,54,29],[55,2,55,14],[55,17,55,29],[56,2,56,14],[56,17,56,29],[57,2,57,14],[57,17,57,29],[58,2,58,14],[58,17,58,29],[59,2,59,14],[59,17,59,29],[60,32,61,38],[61,2,62,29],[61,49,61,57],[63,9,63,10],[63,17,63,29],[63,32,64,40],[63,49,63,57],[64,2,64,14],[64,17,64,29],[64,49,64,57],[65,2,65,14],[65,17,65,29],[66,2,66,14],[66,17,66,29],[66,32,67,59],[67,2,67,14],[67,17,67,29],[68,2,68,14],[68,17,68,29],[68,32,68,45],[68,47,68,59],[69,2,69,14],[69,17,69,29],[69,32,69,45],[69,47,69,59],[70,2,70,14],[70,17,70,29],[70,32,70,45],[70,47,70,59],[71,2,71,14],[71,17,71,29],[71,32,71,45],[71,47,71,59],[72,2,72,14],[72,17,72,29],[72,32,72,45],[72,47,72,59],[73,2,73,14],[73,17,73,29],[73,32,73,45],[73,47,73,59],[74,32,74,45],[74,47,74,59],[75,2,76,29],[75,32,75,45],[75,47,75,59],[76,32,76,45],[76,47,76,59],[77,2,83,29],[77,32,77,45],[77,47,77,59],[78,32,78,45],[78,47,78,59],[79,32,79,45],[79,47,79,59],[80,32,80,45],[80,47,80,59],[81,32,81,45],[81,47,81,59],[82,32,82,45],[82,47,82,59],[83,32,83,45],[83,47,83,59]]}
[]
[null,"CHARACTERISTICS"]
[]
[]
[null,"Weapon Skill",{"$nulls":5},"Ballistic Skill",{"$nulls":5},"Strength",{"$nulls":6},"Toughness",{"$nulls":6},"Agility",{"$nulls":6},"Intelligence",{"$nulls":6},"Perception",{"$nulls":6},"Will Power",{"$nulls":6},"Fellowship"]
[null,"(WS)",{"$nulls":5},"(BS)",{"$nulls":5},"(S)",{"$nulls":6},"(T)",{"$nulls":6},"(Ag)",{"$nulls":6},"(Int)",{"$nulls":6},"(Per)",{"$nulls":6},"(WP)",{"$nulls":6},"(Fel)"]
[null,{"$f":"cha_ws","v":30},{"$nulls":5},{"$f":"cha_bs","v":30},{"$nulls":5},{"$f":"s_bon","v":3},null,null,{"$f":"MOD(cha_s,10)","v":0},{"$nulls":3},{"$f":"t_bon","v":3},null,null,{"$f":"MOD(cha_t,10)","v":0},{"$nulls":3},{"$f":"(cha_ag-AE7)/10","v":3},null,null,{"$f":"MOD(cha_ag,10)","v":0},{"$nulls":3},{"$f":"(cha_int-AL7)/10","v":3},null,null,{"$f":"MOD(cha_int,10)","v":0},{"$nulls":3},{"$f":"(cha_per-AS7)/10","v":3},null,null,{"$f":"MOD(cha_per,10)","v":0},{"$nulls":3},{"$f":"(cha_wp-AZ7)/10","v":3},null,null,{"$f":"MOD(cha_wp,10)","v":0},{"$nulls":3},{"$f":"(cha_fel-BG7)/10","v":3},null,null,{"$f":"MOD(cha_fel,10)","v":0}]
[]
[{"$nulls":13},{"$f":"((cha_s-Q7)/10)","v":3},{"$nulls":6},{"$f":"(cha_t-X7)/10","v":3}]
[]
[]
[null,null,"WEAPON",{"$nulls":29},"WEAPON"]
[]
[{"$nulls":5},{"$f":"IF(weapon1=\"\",\"\",weapon1)","v":""},{"$nulls":29},{"$f":"IF(weapon2=\"\",\"\",weapon2)","v":""}]
[null,null,"NAME",{"$nulls":29},"NAME"]
[{"$nulls":5},{"$f":"IF(OFFSET(weapon1,0,1)=\"\",\"\",OFFSET(weapon1,0,1))","v":""},{"$nulls":7},{"$f":"IF(OFFSET(weapon1,0,4)=\"\",\"\",OFFSET(weapon1,0,4))","v":""},{"$nulls":7},{"$f":"IF(OFFSET(weapon1,0,5)=\"\",\"\",OFFSET(weapon1,0,5))","v":""},{"$nulls":4},{"$f":"IF(OFFSET(weapon1,0,6)=\"\",\"\",OFFSET(weapon1,0,6))","v":""},{"$nulls":8},{"$f":"IF(OFFSET(weapon2,0,1)=\"\",\"\",OFFSET(weapon2,0,1))","v":""},{"$nulls":7},{"$f":"IF(OFFSET(weapon2,0,4)=\"\",\"\",OFFSET(weapon2,0,4))","v":""},{"$nulls":7},{"$f":"IF(OFFSET(weapon2,0,5)=\"\",\"\",OFFSET(weapon2,0,5))","v":""},{"$nulls":4},{"$f":"IF(OFFSET(weapon2,0,6)=\"\",\"\",OFFSET(weapon2,0,6))","v":""}]
[null,null,"CLASS",{"$nulls":6},"DAMAGE",{"$nulls":8},"TYPE",{"$nulls":5},"PEN",{"$nulls":7},"CLASS",{"$nulls":6},"DAMAGE",{"$nulls":8},"TYPE",{"$nulls":5},"PEN"]
[{"$nulls":5},{"$f":"IF(OFFSET(weapon1,0,2)=\"\",\"\",OFFSET(weapon1,0,2))","v":""},{"$nulls":5},{"$f":"IF(OFFSET(weapon1,0,3)=\"\",\"\",OFFSET(weapon1,0,3))","v":""},{"$nulls":9},{"$f":"IF(OFFSET(weapon1,0,7)=\"\",\"\",OFFSET(weapon1,0,7))","v":""},{"$nulls":4},{"$f":"IF(OFFSET(weapon1,0,8)=\"\",\"\",OFFSET(weapon1,0,8))","v":""},{"$nulls":8},{"$f":"IF(OFFSET(weapon2,0,2)=\"\",\"\",OFFSET(weapon2,0,2))","v":""},{"$nulls":5},{"$f":"IF(OFFSET(weapon2,0,3)=\"\",\"\",OFFSET(weapon2,0,3))","v":""},{"$nulls":9},{"$f":"IF(OFFSET(weapon2,0,7)=\"\",\"\",OFFSET(weapon2,0,7))","v":""},{"$nulls":4},{"$f":"IF(OFFSET(weapon2,0,8)=\"\",\"\",OFFSET(weapon2,0,8))","v":""}]
[null,null,"RANGE",{"$nulls":6},"ROF",{"$nulls":8},"CLIP",{"$nulls":5},"RLD",{"$nulls":7},"RANGE",{"$nulls":6},"ROF",{"$nulls":8},"CLIP",{"$nulls":5},"RLD"]
[{"$nulls":9},{"$f":"IF(OFFSET(weapon1,0,9)=\"\",\"\",OFFSET(weapon1,0,9))","v":""},{"$nulls":29},{"$f":"IF(OFFSET(weapon2,0,9)=\"\",\"\",OFFSET(weapon2,0,9))","v":""}]
[null,null,"SPECIAL RULES",{"$nulls":29},"SPECIAL RULES"]
[]
[null,null,"WEAPON"]
[{"$nulls":33},"ARMOUR",{"$nulls":5},"HEAD",{"$nulls":5},"HELMET",{"$nulls":5},"ARMOUR ADDITIONS"]
[{"$nulls":5},{"$f":"IF(weapon3=\"\",\"\",weapon3)","v":""},{"$nulls":27},{"$f":"IF(armour=\"\",\"\",armour)","v":""},{"$nulls":5},"(1-10)",{"$nulls":5},{"$f":"IF(helmet=\"\",\"\",helmet)","v":""}]
[null,null,"NAME",{"$nulls":37},{"$f":"IF(data!N3=\"\",\"\",data!N3)","v":""},{"$nulls":11},"JUMP PACK",{"$nulls":4},{"$f":"IF(COUNTIF(gear!A:A,\"Astartes Jump Pack\")>0,\"x\",\"\")","v":""}]
[{"$nulls":5},{"$f":"IF(OFFSET(weapon3,0,1)=\"\",\"\",OFFSET(weapon3,0,1))","v":""},{"$nulls":7},{"$f":"IF(OFFSET(weapon3,0,4)=\"\",\"\",OFFSET(weapon3,0,4))","v":""},{"$nulls":7},{"$f":"IF(OFFSET(weapon3,0,5)=\"\",\"\",OFFSET(weapon3,0,5))","v":""},{"$nulls":4},{"$f":"IF(OFFSET(weapon3,0,6)=\"\",\"\",OFFSET(weapon3,0,6))","v":""}]
[null,null,"CLASS",{"$nulls":6},"DAMAGE",{"$nulls":8},"TYPE",{"$nulls":5},"PEN",{"$nulls":14},"Type:",{"$nulls":12},"TERMINATOR",{"$nulls":4},{"$f":"IF(COUNTIF(gear!A:A,\"Astartes Terminator Armour\")>0,\"x\",\"\")","v":""}]
[{"$nulls":5},{"$f":"IF(OFFSET(weapon3,0,2)=\"\",\"\",OFFSET(weapon3,0,2))","v":""},{"$nulls":5},{"$f":"IF(OFFSET(weapon3,0,3)=\"\",\"\",OFFSET(weapon3,0,3))","v":""},{"$nulls":9},{"$f":"IF(OFFSET(weapon3,0,7)=\"\",\"\",OFFSET(weapon3,0,7))","v":""},{"$nulls":4},{"$f":"IF(OFFSET(weapon3,0,8)=\"\",\"\",OFFSET(weapon3,0,8))","v":""},{"$nulls":6},"RIGHT ARM",{"$nulls":11},"LEFT ARM"]
[null,null,"RANGE",{"$nulls":6},"ROF",{"$nulls":8},"CLIP",{"$nulls":5},"RLD",{"$nulls":8},"(11-20)",{"$nulls":11},"(21-30)",{"$nulls":6},"SHIELD",{"$nulls":4},{"$f":"IF(OR(COUNTIF(gear!A:A,\"Astartes Combat Shield\")>0,COUNTIF(gear!A:A,\"Astartes Storm Shield\")>0,COUNTIF(gear!A:A,\"Iron Halo\")>0,COUNTIF(gear!A:A,\"Rosarius\")>0),\"x\",\"\")","v":""}]
[{"$nulls":9},{"$f":"IF(OFFSET(weapon3,0,9)=\"\",\"\",OFFSET(weapon3,0,9))","v":""},{"$nulls":24},{"$f":"IF(data!N5=\"\",\"\",data!N5)","v":""},{"$nulls":4},"BODY",{"$nulls":6},{"$f":"IF(data!N6=\"\",\"\",data!N6)","v":""}]
[null,null,"SPECIAL RULES",{"$nulls":36},"(31-70)"]
[{"$nulls":33},"Type:",{"$nulls":6},{"$f":"IF(data!N4=\"\",\"\",data!N4)","v":""},{"$nulls":4},"Type:"]
[null,null,"WEAPON"]
[{"$nulls":39},"Type:"]
[{"$nulls":5},{"$f":"IF(weapon4=\"\",\"\",weapon4)","v":""}]
[null,null,"NAME"]
[{"$nulls":5},{"$f":"IF(OFFSET(weapon4,0,1)=\"\",\"\",OFFSET(weapon4,0,1))","v":""},{"$nulls":7},{"$f":"IF(OFFSET(weapon4,0,4)=\"\",\"\",OFFSET(weapon4,0,4))","v":""},{"$nulls":7},{"$f":"IF(OFFSET(weapon4,0,5)=\"\",\"\",OFFSET(weapon4,0,5))","v":""},{"$nulls":4},{"$f":"IF(OFFSET(weapon4,0,6)=\"\",\"\",OFFSET(weapon4,0,6))","v":""}]
[null,null,"CLASS",{"$nulls":6},"DAMAGE",{"$nulls":8},"TYPE",{"$nulls":5},"PEN",{"$nulls":10},"RIGHT LEG",{"$nulls":7},"LEFT LEG"]
[{"$nulls":5},{"$f":"IF(OFFSET(weapon4,0,2)=\"\",\"\",OFFSET(weapon4,0,2))","v":""},{"$nulls":5},{"$f":"IF(OFFSET(weapon4,0,3)=\"\",\"\",OFFSET(weapon4,0,3))","v":""},{"$nulls":9},{"$f":"IF(OFFSET(weapon4,0,7)=\"\",\"\",OFFSET(weapon4,0,7))","v":""},{"$nulls":4},{"$f":"IF(OFFSET(weapon4,0,8)=\"\",\"\",OFFSET(weapon4,0,8))","v":""},{"$nulls":8},"(71-85)",{"$nulls":7},"(71-85)"]
[null,null,"RANGE",{"$nulls":6},"ROF",{"$nulls":8},"CLIP",{"$nulls":5},"RLD",{"$nulls":11},{"$f":"IF(data!N7=\"\",\"\",data!N7)","v":""},{"$nulls":7},{"$f":"IF(data!N8=\"\",\"\",data!N8)","v":""}]
[{"$nulls":9},{"$f":"IF(OFFSET(weapon4,0,9)=\"\",\"\",OFFSET(weapon4,0,9))","v":""}]
[null,null,"SPECIAL RULES",{"$nulls":32},"Type:",{"$nulls":7},"Type:"]
[]
[{"$nulls":32},"[POWER ARMOUR ABILTIES]"]
[null,null,"SPACE MARINE TALENTS & TRAITS"]
[{"$nulls":32},"Servo-Augmented Musculature: +20 Strength\nAuto-senses: Dark Sight, immune to Photon Flash and Stun Grenades;\nCalled Shots are Half Actions; +10 to Sight and Hearing Awareness Tests (total of +20 bonus with Heightened Senses)\nBuilt-in Vox Link\nBuilt-in Magboots\nNutrient Recycling: Can operate for two weeks without re-supply\nRecoil Suppression: May fire Basic weapons 1-handed without penalty\nSize: Hulking (Black Carapace means no bonus for enemies to attack)\nPoor Manual Dexterity: Delicate tasks suffer a –10 penalty, unless using equipment designed for Space Marines\nOsmotic Gill Life Sustainer: With the helmet on, the armour is environmentally sealed"]
[null,0,{"$f":"IF(OFFSET(data!$J$13,B48,0)=\"\",\"\",OFFSET(data!$J$13,B48,0))","v":""},{"$nulls":13},13,{"$f":"IF(OFFSET(data!$J$13,Q48,0)=\"\",\"\",OFFSET(data!$J$13,Q48,0))","v":""}]
[null,1,{"$f":"IF(OFFSET(data!$J$13,B49,0)=\"\",\"\",OFFSET(data!$J$13,B49,0))","v":""},{"$nulls":13},14,{"$f":"IF(OFFSET(data!$J$13,Q49,0)=\"\",\"\",OFFSET(data!$J$13,Q49,0))","v":""}]
[null,2,{"$f":"IF(OFFSET(data!$J$13,B50,0)=\"\",\"\",OFFSET(data!$J$13,B50,0))","v":""},{"$nulls":13},15,{"$f":"IF(OFFSET(data!$J$13,Q50,0)=\"\",\"\",OFFSET(data!$J$13,Q50,0))","v":""}]
[null,3,{"$f":"IF(OFFSET(data!$J$13,B51,0)=\"\",\"\",OFFSET(data!$J$13,B51,0))","v":""},{"$nulls":13},16,{"$f":"IF(OFFSET(data!$J$13,Q51,0)=\"\",\"\",OFFSET(data!$J$13,Q51,0))","v":""}]
[null,4,{"$f":"IF(OFFSET(data!$J$13,B52,0)=\"\",\"\",OFFSET(data!$J$13,B52,0))","v":""},{"$nulls":13},17,{"$f":"IF(OFFSET(data!$J$13,Q52,0)=\"\",\"\",OFFSET(data!$J$13,Q52,0))","v":""}]
[null,5,{"$f":"IF(OFFSET(data!$J$13,B53,0)=\"\",\"\",OFFSET(data!$J$13,B53,0))","v":""},{"$nulls":13},18,{"$f":"IF(OFFSET(data!$J$13,Q53,0)=\"\",\"\",OFFSET(data!$J$13,Q53,0))","v":""}]
[null,6,{"$f":"IF(OFFSET(data!$J$13,B54,0)=\"\",\"\",OFFSET(data!$J$13,B54,0))","v":""},{"$nulls":13},19,{"$f":"IF(OFFSET(data!$J$13,Q54,0)=\"\",\"\",OFFSET(data!$J$13,Q54,0))","v":""}]
[null,7,{"$f":"IF(OFFSET(data!$J$13,B55,0)=\"\",\"\",OFFSET(data!$J$13,B55,0))","v":""},{"$nulls":13},20,{"$f":"IF(OFFSET(data!$J$13,Q55,0)=\"\",\"\",OFFSET(data!$J$13,Q55,0))","v":""}]
[null,8,{"$f":"IF(OFFSET(data!$J$13,B56,0)=\"\",\"\",OFFSET(data!$J$13,B56,0))","v":""},{"$nulls":13},21,{"$f":"IF(OFFSET(data!$J$13,Q56,0)=\"\",\"\",OFFSET(data!$J$13,Q56,0))","v":""}]
[null,9,{"$f":"IF(OFFSET(data!$J$13,B57,0)=\"\",\"\",OFFSET(data!$J$13,B57,0))","v":""},{"$nulls":13},22,{"$f":"IF(OFFSET(data!$J$13,Q57,0)=\"\",\"\",OFFSET(data!$J$13,Q57,0))","v":""}]
[null,10,{"$f":"IF(OFFSET(data!$J$13,B58,0)=\"\",\"\",OFFSET(data!$J$13,B58,0))","v":""},{"$nulls":13},23,{"$f":"IF(OFFSET(data!$J$13,Q58,0)=\"\",\"\",OFFSET(data!$J$13,Q58,0))","v":""}]
[null,11,{"$f":"IF(OFFSET(data!$J$13,B59,0)=\"\",\"\",OFFSET(data!$J$13,B59,0))","v":""},{"$nulls":13},24,{"$f":"IF(OFFSET(data!$J$13,Q59,0)=\"\",\"\",OFFSET(data!$J$13,Q59,0))","v":""}]
[null,12,{"$f":"IF(OFFSET(data!$J$13,B60,0)=\"\",\"\",OFFSET(data!$J$13,B60,0))","v":""},{"$nulls":13},25,{"$f":"IF(OFFSET(data!$J$13,Q60,0)=\"\",\"\",OFFSET(data!$J$13,Q60,0))","v":""}]
[{"$nulls":32},"RENOWN:"]
[null,null,"PSYCHIC POWERS",{"$nulls":44},"Current","[",{"$f":"renown","v":0},{"$nulls":8},"]"]
[]
[{"$nulls":4},"Psy Rating:",{"$nulls":4},{"$f":"IF(psyrating<1,\"\",psyrating)","v":""},{"$nulls":7},{"$f":"IF(data!N23=\"\",\"\",data!N23)","v":""},{"$nulls":14},"EXPERIENCE:",{"$nulls":14},"XP to Spend","[",{"$f":"xpr","v":1000},{"$nulls":8},"]"]
[null,null,{"$f":"IF(data!N13=\"\",\"\",data!N13)","v":""},{"$nulls":14},{"$f":"IF(data!N24=\"\",\"\",data!N24)","v":""},{"$nulls":29},"Total XP Spent","[",{"$f":"xps","v":12000},{"$nulls":8},"]"]
[null,null,{"$f":"IF(data!N14=\"\",\"\",data!N14)","v":""},{"$nulls":14},{"$f":"IF(data!N25=\"\",\"\",data!N25)","v":""}]
[null,null,{"$f":"IF(data!N15=\"\",\"\",data!N15)","v":""},{"$nulls":14},{"$f":"IF(data!N26=\"\",\"\",data!N26)","v":""},{"$nulls":14},"GEAR"]
[null,null,{"$f":"IF(data!N16=\"\",\"\",data!N16)","v":""},{"$nulls":14},{"$f":"IF(data!N27=\"\",\"\",data!N27)","v":""}]
[null,null,{"$f":"IF(data!N17=\"\",\"\",data!N17)","v":""},{"$nulls":14},{"$f":"IF(data!N28=\"\",\"\",data!N28)","v":""},{"$nulls":14},{"$f":"IF(data!N36=\"\",\"\",data!N36)","v":""},{"$nulls":14},{"$f":"IF(data!N52=\"\",\"\",data!N52)","v":""}]
[null,null,{"$f":"IF(data!N18=\"\",\"\",data!N18)","v":""},{"$nulls":14},{"$f":"IF(data!N29=\"\",\"\",data!N29)","v":""},{"$nulls":14},{"$f":"IF(data!N37=\"\",\"\",data!N37)","v":""},{"$nulls":14},{"$f":"IF(data!N53=\"\",\"\",data!N53)","v":""}]
[null,null,{"$f":"IF(data!N19=\"\",\"\",data!N19)","v":""},{"$nulls":14},{"$f":"IF(data!N30=\"\",\"\",data!N30)","v":""},{"$nulls":14},{"$f":"IF(data!N38=\"\",\"\",data!N38)","v":""},{"$nulls":14},{"$f":"IF(data!N54=\"\",\"\",data!N54)","v":""}]
[null,null,{"$f":"IF(data!N20=\"\",\"\",data!N20)","v":""},{"$nulls":14},{"$f":"IF(data!N31=\"\",\"\",data!N31)","v":""},{"$nulls":14},{"$f":"IF(data!N39=\"\",\"\",data!N39)","v":""},{"$nulls":14},{"$f":"IF(data!N55=\"\",\"\",data!N55)","v":""}]
[null,null,{"$f":"IF(data!N21=\"\",\"\",data!N21)","v":""},{"$nulls":14},{"$f":"IF(data!N32=\"\",\"\",data!N32)","v":""},{"$nulls":14},{"$f":"IF(data!N40=\"\",\"\",data!N40)","v":""},{"$nulls":14},{"$f":"IF(data!N56=\"\",\"\",data!N56)","v":""}]
[null,null,{"$f":"IF(data!N22=\"\",\"\",data!N22)","v":""},{"$nulls":14},{"$f":"IF(data!N33=\"\",\"\",data!N33)","v":""},{"$nulls":14},{"$f":"IF(data!N41=\"\",\"\",data!N41)","v":""},{"$nulls":14},{"$f":"IF(data!N57=\"\",\"\",data!N57)","v":""}]
[{"$nulls":32},{"$f":"IF(data!N42=\"\",\"\",data!N42)","v":""},{"$nulls":14},{"$f":"IF(data!N58=\"\",\"\",data!N58)","v":""}]
[null,null,"NOTES",{"$nulls":29},{"$f":"IF(data!N43=\"\",\"\",data!N43)","v":""},{"$nulls":14},{"$f":"IF(data!N59=\"\",\"\",data!N59)","v":""}]
[{"$nulls":32},{"$f":"IF(data!N44=\"\",\"\",data!N44)","v":""},{"$nulls":14},{"$f":"IF(data!N60=\"\",\"\",data!N60)","v":""}]
[null,null,{"$f":"IF(notestext=\"\",\"\",notestext)","v":""},{"$nulls":29},{"$f":"IF(data!N45=\"\",\"\",data!N45)","v":""},{"$nulls":14},{"$f":"IF(data!N61=\"\",\"\",data!N61)","v":""}]
[{"$nulls":32},{"$f":"IF(data!N46=\"\",\"\",data!N46)","v":""},{"$nulls":14},{"$f":"IF(data!N62=\"\",\"\",data!N62)","v":""}]
[{"$nulls":32},{"$f":"IF(data!N47=\"\",\"\",data!N47)","v":""},{"$nulls":14},{"$f":"IF(data!N63=\"\",\"\",data!N63)","v":""}]
[{"$nulls":32},{"$f":"IF(data!N48=\"\",\"\",data!N48)","v":""},{"$nulls":14},{"$f":"IF(data!N64=\"\",\"\",data!N64)","v":""}]
[{"$nulls":32},{"$f":"IF(data!N49=\"\",\"\",data!N49)","v":""},{"$nulls":14},{"$f":"IF(data!N65=\"\",\"\",data!N65)","v":""}]
[{"$nulls":32},{"$f":"IF(data!N50=\"\",\"\",data!N50)","v":""},{"$nulls":14},{"$f":"IF(data!N66=\"\",\"\",data!N66)","v":""}]
[{"$nulls":32},{"$f":"IF(data!N51=\"\",\"\",data!N51)","v":""},{"$nulls":14},{"$f":"IF(data!N67=\"\",\"\",data!N67)","v":""}]
[]
[{"$nulls":60},{"$f":"strversion","v":"Version: 0.5 r7 [16/12/2013]"}]

{"sheet":"Alt_Page1","index":3,"n_rows":171,"n_cols":60,"rows_kept":171,"merged":[[2,1,3,6],[2,7,3,30],[2,32,3,36],[2,37,3,60],[4,1,5,3],[4,4,5,30],[4,32,5,35],[4,36,5,60],[6,1,7,7],[6,8,7,30],[6,32,7,39],[6,40,7,60],[8,1,9,4],[8,5,9,25],[8,26,9,27],[8,28,9,30],[8,32,9,37],[8,38,9,60],[10,1,11,8],[10,9,11,30],[10,32,11,34],[10,35,11,60],[12,1,13,5],[12,6,13,60],[14,2,17,59],[18,1,19,5],[18,7,19,11],[18,13,19,18],[18,20,19,25],[18,27,19,32],[18,34,19,39],[18,41,19,46],[18,48,19,53],[18,55,19,60],[20,1,21,5],[20,7,21,11],[20,13,21,18],[20,20,21,25],[20,27,21,32],[20,34,21,39],[20,41,21,46],[20,48,21,53],[20,55,21,60],[22,1,28,5],[22,7,28,11],[22,13,25,14],[22,16,28,18],[22,20,25,21],[22,23,28,25],[22,27,28,29],[22,30,28,32],[22,34,28,36],[22,37,28,39],[22,41,28,43],[22,44,28,46],[22,48,28,50],[22,51,28,53],[22,55,28,57],[22,58,28,60],[26,13,28,15],[26,20,28,22],[30,13,34,13],[30,15,34,15],[30,17,34,17],[30,19,34,19],[30,33,34,33],[30,35,34,35],[30,37,34,37],[30,39,34,39],[30,53,34,53],[30,55,34,55],[30,57,34,57],[30,59,34,59],[35,2,36,12],[35,13,36,13],[35,15,36,15],[35,17,36,17],[35,19,36,19],[35,22,36,32],[35,33,36,33],[35,35,36,35],[35,37,36,37],[35,39,36,39],[35,42,36,52],[35,53,36,53],[35,55,36,55],[35,57,36,57],[35,59,36,59],[38,2,39,12],[38,13,39,13],[38,15,39,15],[38,17,39,17],[38,19,39,19],[38,23,39,31],[38,33,39,33],[38,35,39,35],[38,37,39,37],[38,39,39,39],[38,42,39,52],[38,53,39,53],[38,55,39,55],[38,57,39,57],[38,59,39,59],[41,2,42,12],[41,13,42,13],[41,15,42,15],[41,17,42,17],[41,19,42,19],[41,23,42,31],[41,33,42,33],[41,35,42,35],[41,37,42,37],[41,39,42,39],[41,42,42,52],[41,53,42,53],[41,55,42,55],[41,57,42,57],[41,59,42,59],[44,2,45,12],[44,13,45,13],[44,15,45,15],[44,17,45,17],[44,19,45,19],[44,23,45,31],[44,33,45,33],[44,35,45,35],[44,37,45,37],[44,39,45,39],[44,42,45,52],[44,53,45,53],[44,55,45,55],[44,57,45,57],[44,59,45,59],[47,2,48,12],[47,13,48,13],[47,15,48,15],[47,17,48,17],[47,19,48,19],[47,23,48,31],[47,33,48,33],[47,35,48,35],[47,37,48,37],[47,39,48,39],[47,42,48,52],[47,53,48,53],[47,55,48,55],[47,57,48,57],[47,59,48,59],[50,2,51,12],[50,13,51,13],[50,15,51,15],[50,17,51,17],[50,19,51,19],[50,23,51,31],[50,33,51,33],[50,35,51,35],[50,37,51,37],[50,39,51,39],[50,42,51,52],[50,53,51,53],[50,55,51,55],[50,57,51,57],[50,59,51,59],[53,2,54,12],[53,13,54,13],[53,15,54,15],[53,17,54,17],[53,19,54,19],[53,22,54,32],[53,33,54,33],[53,35,54,35],[53,37,54,37],[53,39,54,39],[53,42,54,52],[53,53,54,53],[53,55,54,55],[53,57,54,57],[53,59,54,59],[56,2,57,12],[56,13,57,13],[56,15,57,15],[56,17,57,17],[56,19,57,19],[56,22,57,32],[56,33,57,33],[56,35,57,35],[56,37,57,37],[56,39,57,39],[56,43,57,51],[56,53,57,53],[56,55,57,55],[56,57,57,57],[56,59,57,59],[59,3,60,11],[59,13,60,13],[59,15,60,15],[59,17,60,17],[59,19,60,19],[59,22,60,32],[59,33,60,33],[59,35,60,35],[59,37,60,37],[59,39,60,39],[59,43,60,51],[59,53,60,53],[59,55,60,55],[59,57,60,57],[59,59,60,59],[62,3,63,11],[62,13,63,13],[62,15,63,15],[62,17,63,17],[62,19,63,19],[62,22,63,32],[62,33,63,33],[62,35,63,35],[62,37,63,37],[62,39,63,39],[62,43,63,51],[62,53,63,53],[62,55,63,55],[62,57,63,57],[62,59,63,59],[65,3,66,11],[65,13,66,13],[65,15,66,15],[65,17,66,17],[65,19,66,19],[65,22,66,32],[65,33,66,33],[65,35,66,35],[65,37,66,37],[65,39,66,39],[65,43,66,51],[65,53,66,53],[65,55,66,55],[65,57,66,57],[65,59,66,59],[68,3,69,11],[68,13,69,13],[68,15,69,15],[68,17,69,17],[68,19,69,19],[68,22,69,32],[68,33,69,33],[68,35,69,35],[68,37,69,37],[68,39,69,39],[68,43,69,51],[68,53,69,53],[68,55,69,55],[68,57,69,57],[68,59,69,59],[71,2,72,12],[71,13,72,13],[71,15,72,15],[71,17,72,17],[71,19,72,19],[71,22,72,32],[71,33,72,33],[71,35,72,35],[71,37,72,37],[71,39,72,39],[71,42,72,52],[71,53,72,53],[71,55,72,55],[71,57,72,57],[71,59,72,59],[74,2,75,12],[74,13,75,13],[74,15,75,15],[74,17,75,17],[74,19,75,19],[74,22,75,32],[74,33,75,33],[74,35,75,35],[74,37,75,37],[74,39,75,39],[74,42,75,52],[74,53,75,53],[74,55,75,55],[74,57,75,57],[74,59,75,59],[77,2,78,12],[77,13,78,13],[77,15,78,15],[77,17,78,17],[77,19,78,19],[77,22,78,32],[77,33,78,33],[77,35,78,35],[77,37,78,37],[77,39,78,39],[77,42,78,52],[77,53,78,53],[77,55,78,55],[77,57,78,57],[77,59,78,59],[80,3,81,11],[80,13,81,13],[80,15,81,15],[80,17,81,17],[80,19,81,19],[80,22,81,32],[80,33,81,33],[80,35,81,35],[80,37,81,37],[80,39,81,39],[80,43,81,51],[80,53,81,53],[80,55,81,55],[80,57,81,57],[80,59,81,59],[83,3,84,11],[83,13,84,13],[83,15,84,15],[83,17,84,17],[83,19,84,19],[83,23,84,31],[83,33,84,33],[83,35,84,35],[83,37,84,37],[83,39,84,39],[83,43,84,51],[83,53,84,53],[83,55,84,55],[83,57,84,57],[83,59,84,59],[86,3,87,11],[86,13,87,13],[86,15,87,15],[86,17,87,17],[86,19,87,19],[86,23,87,31],[86,33,87,33],[86,35,87,35],[86,37,87,37],[86,39,87,39],[86,43,87,51],[86,53,87,53],[86,55,87,55],[86,57,87,57],[86,59,87,59],[89,3,90,11],[89,13,90,13],[89,15,90,15],[89,17,90,17],[89,19,90,19],[89,22,90,32],[89,33,90,33],[89,35,90,35],[89,37,90,37],[89,39,90,39],[89,43,90,51],[89,53,90,53],[89,55,90,55],[89,57,90,57],[89,59,90,59],[92,3,93,11],[92,13,93,13],[92,15,93,15],[92,17,93,17],[92,19,93,19],[92,23,93,31],[92,33,93,33],[92,35,93,35],[92,37,93,37],[92,39,93,39],[92,43,93,51],[92,53,93,53],[92,55,93,55],[92,57,93,57],[92,59,93,59],[95,2,96,12],[95,13,96,13],[95,15,96,15],[95,17,96,17],[95,19,96,19],[95,23,96,31],[95,33,96,33],[95,35,96,35],[95,37,96,37],[95,39,96,39],[95,42,96,52],[95,53,96,53],[95,55,96,55],[95,57,96,57],[95,59,96,59],[98,2,99,12],[98,13,99,13],[98,15,99,15],[98,17,99,17],[98,19,99,19],[98,22,99,32],[98,33,99,33],[98,35,99,35],[98,37,99,37],[98,39,99,39],[98,42,99,52],[98,53,99,53],[98,55,99,55],[98,57,99,57],[98,59,99,59],[101,2,102,12],[101,13,102,13],[101,15,102,15],[101,17,102,17],[101,19,102,19],[101,23,102,31],[101,33,102,33],[101,35,102,35],[101,37,102,37],[101,39,102,39],[101,42,102,52],[101,53,102,53],[101,55,102,55],[101,57,102,57],[101,59,102,59],[104,2,105,12],[104,13,105,13],[104,15,105,15],[104,17,105,17],[104,19,105,19],[104,23,105,31],[104,33,105,33],[104,35,105,35],[104,37,105,37],[104,39,105,39],[104,43,105,51],[104,53,105,53],[104,55,105,55],[104,57,105,57],[104,59,105,59],[107,2,108,12],[107,13,108,13],[107,15,108,15],[107,17,108,17],[107,19,108,19],[107,23,108,31],[107,33,108,33],[107,35,108,35],[107,37,108,37],[107,39,108,39],[107,43,108,51],[107,53,108,53],[107,55,108,55],[107,57,108,57],[107,59,108,59],[110,2,111,12],[110,13,111,13],[110,15,111,15],[110,17,111,17],[110,19,111,19],[110,22,111,32],[110,33,111,33],[110,35,111,35],[110,37,111,37],[110,39,111,39],[110,43,111,51],[110,53,111,53],[110,55,111,55],[110,57,111,57],[110,59,111,59],[113,2,114,12],[113,13,114,13],[113,15,114,15],[113,17,114,17],[113,19,114,19],[113,22,114,32],[113,33,114,33],[113,35,114,35],[113,37,114,37],[113,39,114,39],[113,42,114,52],[113,53,114,53],[113,55,114,55],[113,57,114,57],[113,59,114,59],[116,3,117,11],[116,13,117,13],[116,15,117,15],[116,17,117,17],[116,19,117,19],[116,23,117,31],[116,33,117,33],[116,35,117,35],[116,37,117,37],[116,39,117,39],[119,3,120,11],[119,13,120,13],[119,15,120,15],[119,17,120,17],[119,19,120,19],[119,23,120,31],[119,33,120,33],[119,35,120,35],[119,37,120,37],[119,39,120,39],[120,42,123,49],[120,50,121,51],[120,52,121,53],[120,55,121,57],[120,58,121,59],[122,3,123,11],[122,13,123,13],[122,15,123,15],[122,17,123,17],[122,19,123,19],[122,23,123,31],[122,33,123,33],[122,35,123,35],[122,37,123,37],[122,39,123,39],[122,50,123,51],[122,52,123,53],[122,55,123,57],[122,58,123,59],[125,2,126,12],[125,13,126,13],[125,15,126,15],[125,17,126,17],[125,19,126,19],[125,23,126,31],[125,33,126,33],[125,35,126,35],[125,37,126,37],[125,39,126,39],[126,42,131,49],[126,52,127,54],[126,55,127,57],[128,23,129,31],[128,33,129,33],[128,35,129,35],[128,37,129,37],[128,39,129,39],[128,52,129,54],[128,55,129,57],[130,52,131,54],[130,55,131,57],[132,2,135,8],[132,22,135,32],[132,42,133,48],[132,49,133,59],[133,12,134,15],[133,16,134,17],[133,33,134,35],[133,36,134,37],[134,42,135,59],[136,2,137,7],[136,8,137,19],[137,42,140,51],[137,53,138,55],[137,56,138,57],[138,2,139,7],[138,8,139,19],[139,53,140,55],[139,56,140,57],[142,1,169,20],[142,21,169,40],[142,42,145,51],[146,42,147,48],[146,49,147,49],[146,50,147,58],[146,59,147,59],[149,42,152,51],[153,42,154,48],[153,49,154,49],[153,50,154,58],[153,59,154,59],[155,42,156,48],[155,49,156,49],[155,50,156,58],[155,59,156,59],[158,42,162,59],[163,42,169,59],[170,1,171,60]]}
[]
[]
[null,"Character Name",{"$nulls":5},{"$f":"IF(char_name=\"\",\"\",char_name)","v":""},{"$nulls":24},"Player Name",{"$nulls":4},{"$f":"IF(play_name=\"\",\"\",play_name)","v":""}]
[]
[null,"Chapter",null,null,{"$f":"IF(successorchapter=\"\",IF(chapter=\"\",\"\",chapter),successorchapter)","v":""},{"$nulls":27},"Past Event",{"$nulls":3},{"$f":"IF(past_event=\"\",\"\",past_event)","v":""}]
[]
[null,"Chapter Demeanour",{"$nulls":6},{"$f":"IF(chapdemeanour=\"\",\"\",chapdemeanour)","v":""},{"$nulls":23},"Personal Demeanour",{"$nulls":7},{"$f":"IF(persdemeanour=\"\",\"\",persdemeanour)","v":""}]
[]
[null,"Specialty",{"$nulls":3},{"$f":"IF(specialty=\"\",\"\",specialty)","v":""},{"$nulls":20},"Rank",null,{"$f":"IF(rank=0,1,rank)","v":1},{"$nulls":3},"Special Abilities",{"$nulls":5},{"$f":"IF(specialability=\"\",\"\",specialability)","v":""}]
[]
[null,"Advanced Specialties",{"$nulls":7},{"$f":"IF(advspeclst=\"\",\"\",advspeclst)","v":""},{"$nulls":22},"Deed",null,null,{"$f":"IF(deed=\"\",\"\",deed)","v":""}]
[]
[null,"Description",{"$nulls":4},{"$f":"IF(description=\"\",\"\",description)","v":""}]
[]
[null,null,"CHARACTERISTICS"]
[]
[]
[]
[null,"Weapon Skill",{"$nulls":5},"Ballistic Skill",{"$nulls":5},"Strength",{"$nulls":6},"Toughness",{"$nulls":6},"Agility",{"$nulls":6},"Intelligence",{"$nulls":6},"Perception",{"$nulls":6},"Will Power",{"$nulls":6},"Fellowship"]
[]
[null,"(WS)",{"$nulls":5},"(BS)",{"$nulls":5},"(S)",{"$nulls":6},"(T)",{"$nulls":6},"(Ag)",{"$nulls":6},"(Int)",{"$nulls":6},"(Per)",{"$nulls":6},"(WP)",{"$nulls":6},"(Fel)"]
[]
[null,{"$f":"cha_ws","v":30},{"$nulls":5},{"$f":"cha_bs","v":30},{"$nulls":5},{"$f":"s_bon","v":3},null,null,{"$f":"MOD(cha_s,10)","v":0},{"$nulls":3},{"$f":"t_bon","v":3},null,null,{"$f":"MOD(cha_t,10)","v":0},{"$nulls":3},{"$f":"(cha_ag-AE23)/10","v":3},null,null,{"$f":"MOD(cha_ag,10)","v":0},{"$nulls":3},{"$f":"(cha_int-AL23)/10","v":3},null,null,{"$f":"MOD(cha_int,10)","v":0},{"$nulls":3},{"$f":"(cha_per-AS23)/10","v":3},null,null,{"$f":"MOD(cha_per,10)","v":0},{"$nulls":3},{"$f":"(cha_wp-AZ23)/10","v":3},null,null,{"$f":"MOD(cha_wp,10)","v":0},{"$nulls":3},{"$f":"(cha_fel-BG23)/10","v":3},null,null,{"$f":"MOD(cha_fel,10)","v":0}]
[]
[]
[]
[{"$nulls":13},{"$f":"((cha_s-Q23)/10)","v":3},{"$nulls":6},{"$f":"((cha_t-X23)/10)","v":3}]
[{"$nulls":20},{"$f":"(cha_t-X23)/10","v":3}]
[]
[]
[{"$nulls":13},"Basic",null,"Trained",null,"+10%",null,"+20%",{"$nulls":13},"Basic",null,"Trained",null,"+10%",null,"+20%",{"$nulls":13},"Basic",null,"Trained",null,"+10%",null,"+20%"]
[]
[]
[]
[]
[null,null,"Acrobatics (Ag)",{"$nulls":12},{"$f":"AND(COUNTIF(adv!$A:$A,LEFT(C36,SEARCH(\"(\",C36)-2)))","v":false},null,{"$f":"AND(COUNTIF(adv!$A:$A,LEFT(C36,SEARCH(\"(\",C36)-2)&\" +10\"))","v":false},null,{"$f":"AND(COUNTIF(adv!$A:$A,LEFT(C36,SEARCH(\"(\",C36)-2)&\" +20\"))","v":false},null,null,"Forbidden Lore (Int)",{"$nulls":12},{"$f":"AND(COUNTIF(adv!$A:$A,LEFT(W36,SEARCH(\"(\",W36)-2)))","v":false},null,{"$f":"AND(COUNTIF(adv!$A:$A,LEFT(W36,SEARCH(\"(\",W36)-2)&\" +10\"))","v":false},null,{"$f":"AND(COUNTIF(adv!$A:$A,LEFT(W36,SEARCH(\"(\",W36)-2)&\" +20\"))","v":false},null,null,"Scrutiny (Per)",{"$nulls":10},"x",null,{"$f":"AND(COUNTIF(adv!$A:$A,LEFT(AQ36,SEARCH(\"(\",AQ36)-2)))","v":false},null,{"$f":"AND(COUNTIF(adv!$A:$A,LEFT(AQ36,SEARCH(\"(\",AQ36)-2)&\" +10\"))","v":false},null,{"$f":"AND(COUNTIF(adv!$A:$A,LEFT(AQ36,SEARCH(\"(\",AQ36)-2)&\" +20\"))","v":false}]
[]
[]
[null,null,"Awareness (Per)",{"$nulls":10},"x",null,{"$f":"AND(COUNTIF(adv!$A:$A,LEFT(C39,SEARCH(\"(\",C39)-2)))","v":false},null,{"$f":"AND(COUNTIF(adv!$A:$A,LEFT(C39,SEARCH(\"(\",C39)-2)&\" +10\"))","v":false},null,{"$f":"AND(COUNTIF(adv!$A:$A,LEFT(C39,SEARCH(\"(\",C39)-2)&\" +20\"))","v":false},null,"Lore: Forbidden",16,{"$f":"IF(OFFSET(data!$U$12,W39,0)=\"\",\"\",OFFSET(data!$U$12,W39,0))","v":""},{"$nulls":11},{"$f":"AND(COUNTIF(adv!$A:$A,V39&\" (\"&X39&\")\"))","v":false},null,{"$f":"AND(COUNTIF(adv!$A:$A,V39&\" (\"&X39&\") +10\"))","v":false},null,{"$f":"AND(COUNTIF(adv!$A:$A,V39&\" (\"&X39&\") +20\"))","v":false},null,null,"Search (Per)",{"$nulls":10},"x",null,{"$f":"AND(COUNTIF(adv!$A:$A,LEFT(AQ39,SEARCH(\"(\",AQ39)-2)))","v":false},null,{"$f":"AND(COUNTIF(adv!$A:$A,LEFT(AQ39,SEARCH(\"(\",AQ39)-2)&\" +10\"))","v":false},null,{"$f":"AND(COUNTIF(adv!$A:$A,LEFT(AQ39,SEARCH(\"(\",AQ39)-2)&\" +20\"))","v":false}]
[]
[]
[null,null,"Barter (Fel)",{"$nulls":12},{"$f":"AND(COUNTIF(adv!$A:$A,LEFT(C42,SEARCH(\"(\",C42)-2)))","v":false},null,{"$f":"AND(COUNTIF(adv!$A:$A,LEFT(C42,SEARCH(\"(\",C42)-2)&\" +10\"))","v":false},null,{"$f":"AND(COUNTIF(adv!$A:$A,LEFT(C42,SEARCH(\"(\",C42)-2)&\" +20\"))","v":false},null,"Lore: Forbidden",17,{"$f":"IF(OFFSET(data!$U$12,W42,0)=\"\",\"\",OFFSET(data!$U$12,W42,0))","v":""},{"$nulls":11},{"$f":"AND(COUNTIF(adv!$A:$A,V42&\" (\"&X42&\")\"))","v":false},null,{"$f":"AND(COUNTIF(adv!$A:$A,V42&\" (\"&X42&\") +10\"))","v":false},null,{"$f":"AND(COUNTIF(adv!$A:$A,V42&\" (\"&X42&\") +20\"))","v":false},null,null,"Security (Ag)",{"$nulls":12},{"$f":"AND(COUNTIF(adv!$A:$A,LEFT(AQ42,SEARCH(\"(\",AQ42)-2)))","v":false},null,{"$f":"AND(COUNTIF(adv!$A:$A,LEFT(AQ42,SEARCH(\"(\",AQ42)-2)&\" +10\"))","v":false},null,{"$f":"AND(COUNTIF(adv!$A:$A,LEFT(AQ42,SEARCH(\"(\",AQ42)-2)&\" +20\"))","v":false}]
[]
[]
[null,null,"Blather (Fel)",{"$nulls":12},{"$f":"AND(COUNTIF(adv!$A:$A,LEFT(C45,SEARCH(\"(\",C45)-2)))","v":false},null,{"$f":"AND(COUNTIF(adv!$A:$A,LEFT(C45,SEARCH(\"(\",C45)-2)&\" +10\"))","v":false},null,{"$f":"AND(COUNTIF(adv!$A:$A,LEFT(C45,SEARCH(\"(\",C45)-2)&\" +20\"))","v":false},null,"Lore: Forbidden",18,{"$f":"IF(OFFSET(data!$U$12,W45,0)=\"\",\"\",OFFSET(data!$U$12,W45,0))","v":""},{"$nulls":11},{"$f":"AND(COUNTIF(adv!$A:$A,V45&\" (\"&X45&\")\"))","v":false},null,{"$f":"AND(COUNTIF(adv!$A:$A,V45&\" (\"&X45&\") +10\"))","v":false},null,{"$f":"AND(COUNTIF(adv!$A:$A,V45&\" (\"&X45&\") +20\"))","v":false},null,null,"Shadowing (Ag)",{"$nulls":12},{"$f":"AND(COUNTIF(adv!$A:$A,LEFT(AQ45,SEARCH(\"(\",AQ45)-2)))","v":false},null,{"$f":"AND(COUNTIF(adv!$A:$A,LEFT(AQ45,SEARCH(\"(\",AQ45)-2)&\" +10\"))","v":false},null,{"$f":"AND(COUNTIF(adv!$A:$A,LEFT(AQ45,SEARCH(\"(\",AQ45)-2)&\" +20\"))","v":false}]
[]
[]
[null,null,"Carouse (T)",{"$nulls":10},"x",null,{"$f":"AND(COUNTIF(adv!$A:$A,LEFT(C48,SEARCH(\"(\",C48)-2)))","v":false},null,{"$f":"AND(COUNTIF(adv!$A:$A,LEFT(C48,SEARCH(\"(\",C48)-2)&\" +10\"))","v":false},null,{"$f":"AND(COUNTIF(adv!$A:$A,LEFT(C48,SEARCH(\"(\",C48)-2)&\" +20\"))","v":false},null,"Lore: Forbidden",19,{"$f":"IF(OFFSET(data!$U$12,W48,0)=\"\",\"\",OFFSET(data!$U$12,W48,0))","v":""},{"$nulls":11},{"$f":"AND(COUNTIF(adv!$A:$A,V48&\" (\"&X48&\")\"))","v":false},null,{"$f":"AND(COUNTIF(adv!$A:$A,V48&\" (\"&X48&\") +10\"))","v":false},null,{"$f":"AND(COUNTIF(adv!$A:$A,V48&\" (\"&X48&\") +20\"))","v":false},null,null,"Silent Move (Ag)",{"$nulls":10},"x",null,{"$f":"AND(COUNTIF(adv!$A:$A,LEFT(AQ48,SEARCH(\"(\",AQ48)-2)))","v":false},null,{"$f":"AND(COUNTIF(adv!$A:$A,LEFT(AQ48,SEARCH(\"(\",AQ48)-2)&\" +10\"))","v":false},null,{"$f":"AND(COUNTIF(adv!$A:$A,LEFT(AQ48,SEARCH(\"(\",AQ48)-2)&\" +20\"))","v":false}]
[]
[]
[null,null,"Charm (Fel)",{"$nulls":10},"x",null,{"$f":"AND(COUNTIF(adv!$A:$A,LEFT(C51,SEARCH(\"(\",C51)-2)))","v":false},null,{"$f":"AND(COUNTIF(adv!$A:$A,LEFT(C51,SEARCH(\"(\",C51)-2)&\" +10\"))","v":false},null,{"$f":"AND(COUNTIF(adv!$A:$A,LEFT(C51,SEARCH(\"(\",C51)-2)&\" +20\"))","v":false},null,"Lore: Forbidden",20,{"$f":"IF(OFFSET(data!$U$12,W51,0)=\"\",\"\",OFFSET(data!$U$12,W51,0))","v":""},{"$nulls":11},{"$f":"AND(COUNTIF(adv!$A:$A,V51&\" (\"&X51&\")\"))","v":false},null,{"$f":"AND(COUNTIF(adv!$A:$A,V51&\" (\"&X51&\") +10\"))","v":false},null,{"$f":"AND(COUNTIF(adv!$A:$A,V51&\" (\"&X51&\") +20\"))","v":false},null,null,"Sleight of Hand (Ag)",{"$nulls":12},{"$f":"AND(COUNTIF(adv!$A:$A,LEFT(AQ51,SEARCH(\"(\",AQ51)-2)))","v":false},null,{"$f":"AND(COUNTIF(adv!$A:$A,LEFT(AQ51,SEARCH(\"(\",AQ51)-2)&\" +10\"))","v":false},null,{"$f":"AND(COUNTIF(adv!$A:$A,LEFT(AQ51,SEARCH(\"(\",AQ51)-2)&\" +20\"))","v":false}]
[]
[]
[null,null,"Chem-Use (Int)",{"$nulls":12},{"$f":"AND(COUNTIF(adv!$A:$A,LEFT(C54,SEARCH(\"(\",C54)-2)))","v":false},null,{"$f":"AND(COUNTIF(adv!$A:$A,LEFT(C54,SEARCH(\"(\",C54)-2)&\" +10\"))","v":false},null,{"$f":"AND(COUNTIF(adv!$A:$A,LEFT(C54,SEARCH(\"(\",C54)-2)&\" +20\"))","v":false},null,null,"Gamble (Int)",{"$nulls":10},"x",null,{"$f":"AND(COUNTIF(adv!$A:$A,LEFT(W54,SEARCH(\"(\",W54)-2)))","v":false},null,{"$f":"AND(COUNTIF(adv!$A:$A,LEFT(W54,SEARCH(\"(\",W54)-2)&\" +10\"))","v":false},null,{"$f":"AND(COUNTIF(adv!$A:$A,LEFT(W54,SEARCH(\"(\",W54)-2)&\" +20\"))","v":false},null,null,"Speak Language (Ag)",{"$nulls":12},{"$f":"AND(COUNTIF(adv!$A:$A,LEFT(AQ54,SEARCH(\"(\",AQ54)-2)))","v":false},null,{"$f":"AND(COUNTIF(adv!$A:$A,LEFT(AQ54,SEARCH(\"(\",AQ54)-2)&\" +10\"))","v":false},null,{"$f":"AND(COUNTIF(adv!$A:$A,LEFT(AQ54,SEARCH(\"(\",AQ54)-2)&\" +20\"))","v":false}]
[]
[]
[null,null,"Ciphers (Int)",{"$nulls":12},{"$f":"AND(COUNTIF(adv!$A:$A,LEFT(C57,SEARCH(\"(\",C57)-2)))","v":false},null,{"$f":"AND(COUNTIF(adv!$A:$A,LEFT(C57,SEARCH(\"(\",C57)-2)&\" +10\"))","v":false},null,{"$f":"AND(COUNTIF(adv!$A:$A,LEFT(C57,SEARCH(\"(\",C57)-2)&\" +20\"))","v":false},null,null,"Inquiry (Fel)",{"$nulls":10},"x",null,{"$f":"AND(COUNTIF(adv!$A:$A,LEFT(W57,SEARCH(\"(\",W57)-2)))","v":false},null,{"$f":"AND(COUNTIF(adv!$A:$A,LEFT(W57,SEARCH(\"(\",W57)-2)&\" +10\"))","v":false},null,{"$f":"AND(COUNTIF(adv!$A:$A,LEFT(W57,SEARCH(\"(\",W57)-2)&\" +20\"))","v":false},null,"Speak Language",41,{"$f":"IF(OFFSET(data!$U$12,AQ57,0)=\"\",\"\",OFFSET(data!$U$12,AQ57,0))","v":""},{"$nulls":11},{"$f":"AND(COUNTIF(adv!$A:$A,AP57&\" (\"&AR57&\")\"))","v":false},null,{"$f":"AND(COUNTIF(adv!$A:$A,AP57&\" (\"&AR57&\") +10\"))","v":false},null,{"$f":"AND(COUNTIF(adv!$A:$A,AP57&\" (\"&AR57&\") +20\"))","v":false}]
[]
[]
[null,"Ciphers",1,{"$f":"IF(OFFSET(data!$U$12,C60,0)=\"\",\"\",OFFSET(data!$U$12,C60,0))","v":""},{"$nulls":11},{"$f":"AND(COUNTIF(adv!$A:$A,B60&\" (\"&D60&\")\"))","v":false},null,{"$f":"AND(COUNTIF(adv!$A:$A,B60&\" (\"&D60&\") +10\"))","v":false},null,{"$f":"AND(COUNTIF(adv!$A:$A,B60&\" (\"&D60&\") +20\"))","v":false},null,null,"Interrogation (WP)",{"$nulls":12},{"$f":"AND(COUNTIF(adv!$A:$A,LEFT(W60,SEARCH(\"(\",W60)-2)))","v":false},null,{"$f":"AND(COUNTIF(adv!$A:$A,LEFT(W60,SEARCH(\"(\",W60)-2)&\" +10\"))","v":false},null,{"$f":"AND(COUNTIF(adv!$A:$A,LEFT(W60,SEARCH(\"(\",W60)-2)&\" +20\"))","v":false},null,"Speak Language",42,{"$f":"IF(OFFSET(data!$U$12,AQ60,0)=\"\",\"\",OFFSET(data!$U$12,AQ60,0))","v":""},{"$nulls":11},{"$f":"AND(COUNTIF(adv!$A:$A,AP60&\" (\"&AR60&\")\"))","v":false},null,{"$f":"AND(COUNTIF(adv!$A:$A,AP60&\" (\"&AR60&\") +10\"))","v":false},null,{"$f":"AND(COUNTIF(adv!$A:$A,AP60&\" (\"&AR60&\") +20\"))","v":false}]
[]
[]
[null,"Ciphers",2,{"$f":"IF(OFFSET(data!$U$12,C63,0)=\"\",\"\",OFFSET(data!$U$12,C63,0))","v":""},{"$nulls":11},{"$f":"AND(COUNTIF(adv!$A:$A,B63&\" (\"&D63&\")\"))","v":false},null,{"$f":"AND(COUNTIF(adv!$A:$A,B63&\" (\"&D63&\") +10\"))","v":false},null,{"$f":"AND(COUNTIF(adv!$A:$A,B63&\" (\"&D63&\") +20\"))","v":false},null,null,"Intimidate (S)",{"$nulls":10},"x",null,{"$f":"AND(COUNTIF(adv!$A:$A,LEFT(W63,SEARCH(\"(\",W63)-2)))","v":false},null,{"$f":"AND(COUNTIF(adv!$A:$A,LEFT(W63,SEARCH(\"(\",W63)-2)&\" +10\"))","v":false},null,{"$f":"AND(COUNTIF(adv!$A:$A,LEFT(W63,SEARCH(\"(\",W63)-2)&\" +20\"))","v":false},null,"Speak Language",43,{"$f":"IF(OFFSET(data!$U$12,AQ63,0)=\"\",\"\",OFFSET(data!$U$12,AQ63,0))","v":""},{"$nulls":11},{"$f":"AND(COUNTIF(adv!$A:$A,AP63&\" (\"&AR63&\")\"))","v":false},null,{"$f":"AND(COUNTIF(adv!$A:$A,AP63&\" (\"&AR63&\") +10\"))","v":false},null,{"$f":"AND(COUNTIF(adv!$A:$A,AP63&\" (\"&AR63&\") +20\"))","v":false}]
[]
[]
[null,"Ciphers",3,{"$f":"IF(OFFSET(data!$U$12,C66,0)=\"\",\"\",OFFSET(data!$U$12,C66,0))","v":""},{"$nulls":11},{"$f":"AND(COUNTIF(adv!$A:$A,B66&\" (\"&D66&\")\"))","v":false},null,{"$f":"AND(COUNTIF(adv!$A:$A,B66&\" (\"&D66&\") +10\"))","v":false},null,{"$f":"AND(COUNTIF(adv!$A:$A,B66&\" (\"&D66&\") +20\"))","v":false},null,null,"Invocation (WP)",{"$nulls":12},{"$f":"AND(COUNTIF(adv!$A:$A,LEFT(W66,SEARCH(\"(\",W66)-2)))","v":false},null,{"$f":"AND(COUNTIF(adv!$A:$A,LEFT(W66,SEARCH(\"(\",W66)-2)&\" +10\"))","v":false},null,{"$f":"AND(COUNTIF(adv!$A:$A,LEFT(W66,SEARCH(\"(\",W66)-2)&\" +20\"))","v":false},null,"Speak Language",44,{"$f":"IF(OFFSET(data!$U$12,AQ66,0)=\"\",\"\",OFFSET(data!$U$12,AQ66,0))","v":""},{"$nulls":11},{"$f":"AND(COUNTIF(adv!$A:$A,AP66&\" (\"&AR66&\")\"))","v":false},null,{"$f":"AND(COUNTIF(adv!$A:$A,AP66&\" (\"&AR66&\") +10\"))","v":false},null,{"$f":"AND(COUNTIF(adv!$A:$A,AP66&\" (\"&AR66&\") +20\"))","v":false}]
[]
[]
[null,"Ciphers",4,{"$f":"IF(OFFSET(data!$U$12,C69,0)=\"\",\"\",OFFSET(data!$U$12,C69,0))","v":""},{"$nulls":11},{"$f":"AND(COUNTIF(adv!$A:$A,B69&\" (\"&D69&\")\"))","v":false},null,{"$f":"AND(COUNTIF(adv!$A:$A,B69&\" (\"&D69&\") +10\"))","v":false},null,{"$f":"AND(COUNTIF(adv!$A:$A,B69&\" (\"&D69&\") +20\"))","v":false},null,null,"Lip Reading (Per)",{"$nulls":12},{"$f":"AND(COUNTIF(adv!$A:$A,LEFT(W69,SEARCH(\"(\",W69)-2)))","v":false},null,{"$f":"AND(COUNTIF(adv!$A:$A,LEFT(W69,SEARCH(\"(\",W69)-2)&\" +10\"))","v":false},null,{"$f":"AND(COUNTIF(adv!$A:$A,LEFT(W69,SEARCH(\"(\",W69)-2)&\" +20\"))","v":false},null,"Speak Language",45,{"$f":"IF(OFFSET(data!$U$12,AQ69,0)=\"\",\"\",OFFSET(data!$U$12,AQ69,0))","v":""},{"$nulls":11},{"$f":"AND(COUNTIF(adv!$A:$A,AP69&\" (\"&AR69&\")\"))","v":false},null,{"$f":"AND(COUNTIF(adv!$A:$A,AP69&\" (\"&AR69&\") +10\"))","v":false},null,{"$f":"AND(COUNTIF(adv!$A:$A,AP69&\" (\"&AR69&\") +20\"))","v":false}]
[]
[]
[null,null,"Climb (S)",{"$nulls":10},"x",null,{"$f":"AND(COUNTIF(adv!$A:$A,LEFT(C72,SEARCH(\"(\",C72)-2)))","v":false},null,{"$f":"AND(COUNTIF(adv!$A:$A,LEFT(C72,SEARCH(\"(\",C72)-2)&\" +10\"))","v":false},null,{"$f":"AND(COUNTIF(adv!$A:$A,LEFT(C72,SEARCH(\"(\",C72)-2)&\" +20\"))","v":false},null,null,"Literacy (Int)",{"$nulls":12},{"$f":"AND(COUNTIF(adv!$A:$A,LEFT(W72,SEARCH(\"(\",W72)-2)))","v":false},null,{"$f":"AND(COUNTIF(adv!$A:$A,LEFT(W72,SEARCH(\"(\",W72)-2)&\" +10\"))","v":false},null,{"$f":"AND(COUNTIF(adv!$A:$A,LEFT(W72,SEARCH(\"(\",W72)-2)&\" +20\"))","v":false},null,null,"Survival (Int)",{"$nulls":12},{"$f":"AND(COUNTIF(adv!$A:$A,LEFT(AQ72,SEARCH(\"(\",AQ72)-2)))","v":false},null,{"$f":"AND(COUNTIF(adv!$A:$A,LEFT(AQ72,SEARCH(\"(\",AQ72)-2)&\" +10\"))","v":false},null,{"$f":"AND(COUNTIF(adv!$A:$A,LEFT(AQ72,SEARCH(\"(\",AQ72)-2)&\" +20\"))","v":false}]
[]
[]
[null,null,"Command (Fel)",{"$nulls":10},"x",null,{"$f":"AND(COUNTIF(adv!$A:$A,LEFT(C75,SEARCH(\"(\",C75)-2)))","v":false},null,{"$f":"AND(COUNTIF(adv!$A:$A,LEFT(C75,SEARCH(\"(\",C75)-2)&\" +10\"))","v":false},null,{"$f":"AND(COUNTIF(adv!$A:$A,LEFT(C75,SEARCH(\"(\",C75)-2)&\" +20\"))","v":false},null,null,"Logic (Int)",{"$nulls":10},"x",null,{"$f":"AND(COUNTIF(adv!$A:$A,LEFT(W75,SEARCH(\"(\",W75)-2)))","v":false},null,{"$f":"AND(COUNTIF(adv!$A:$A,LEFT(W75,SEARCH(\"(\",W75)-2)&\" +10\"))","v":false},null,{"$f":"AND(COUNTIF(adv!$A:$A,LEFT(W75,SEARCH(\"(\",W75)-2)&\" +20\"))","v":false},null,null,"Swim (S)",{"$nulls":10},"x",null,{"$f":"AND(COUNTIF(adv!$A:$A,LEFT(AQ75,SEARCH(\"(\",AQ75)-2)))","v":false},null,{"$f":"AND(COUNTIF(adv!$A:$A,LEFT(AQ75,SEARCH(\"(\",AQ75)-2)&\" +10\"))","v":false},null,{"$f":"AND(COUNTIF(adv!$A:$A,LEFT(AQ75,SEARCH(\"(\",AQ75)-2)&\" +20\"))","v":false}]
[]
[]
[null,null,"Common Lore (Int)",{"$nulls":12},{"$f":"AND(COUNTIF(adv!$A:$A,LEFT(C78,SEARCH(\"(\",C78)-2)))","v":false},null,{"$f":"AND(COUNTIF(adv!$A:$A,LEFT(C78,SEARCH(\"(\",C78)-2)&\" +10\"))","v":false},null,{"$f":"AND(COUNTIF(adv!$A:$A,LEFT(C78,SEARCH(\"(\",C78)-2)&\" +20\"))","v":false},null,null,"Medicae (Int)",{"$nulls":12},{"$f":"AND(COUNTIF(adv!$A:$A,LEFT(W78,SEARCH(\"(\",W78)-2)))","v":false},null,{"$f":"AND(COUNTIF(adv!$A:$A,LEFT(W78,SEARCH(\"(\",W78)-2)&\" +10\"))","v":false},null,{"$f":"AND(COUNTIF(adv!$A:$A,LEFT(W78,SEARCH(\"(\",W78)-2)&\" +20\"))","v":false},null,null,"Tactics (Int)",{"$nulls":12},{"$f":"AND(COUNTIF(adv!$A:$A,LEFT(AQ78,SEARCH(\"(\",AQ78)-2)))","v":false},null,{"$f":"AND(COUNTIF(adv!$A:$A,LEFT(AQ78,SEARCH(\"(\",AQ78)-2)&\" +10\"))","v":false},null,{"$f":"AND(COUNTIF(adv!$A:$A,LEFT(AQ78,SEARCH(\"(\",AQ78)-2)&\" +20\"))","v":false}]
[]
[]
[null,"Lore: Common",6,{"$f":"IF(OFFSET(data!$U$12,C81,0)=\"\",\"\",OFFSET(data!$U$12,C81,0))","v":""},{"$nulls":11},{"$f":"AND(COUNTIF(adv!$A:$A,B81&\" (\"&D81&\")\"))","v":false},null,{"$f":"AND(COUNTIF(adv!$A:$A,B81&\" (\"&D81&\") +10\"))","v":false},null,{"$f":"AND(COUNTIF(adv!$A:$A,B81&\" (\"&D81&\") +20\"))","v":false},null,null,"Navigation (Int)",{"$nulls":12},{"$f":"AND(COUNTIF(adv!$A:$A,LEFT(W81,SEARCH(\"(\",W81)-2)))","v":false},null,{"$f":"AND(COUNTIF(adv!$A:$A,LEFT(W81,SEARCH(\"(\",W81)-2)&\" +10\"))","v":false},null,{"$f":"AND(COUNTIF(adv!$A:$A,LEFT(W81,SEARCH(\"(\",W81)-2)&\" +20\"))","v":false},null,"Tactics",46,{"$f":"IF(OFFSET(data!$U$12,AQ81,0)=\"\",\"\",OFFSET(data!$U$12,AQ81,0))","v":""},{"$nulls":11},{"$f":"AND(COUNTIF(adv!$A:$A,AP81&\" (\"&AR81&\")\"))","v":false},null,{"$f":"AND(COUNTIF(adv!$A:$A,AP81&\" (\"&AR81&\") +10\"))","v":false},null,{"$f":"AND(COUNTIF(adv!$A:$A,AP81&\" (\"&AR81&\") +20\"))","v":false}]
[]
[]
[null,"Lore: Common",7,{"$f":"IF(OFFSET(data!$U$12,C84,0)=\"\",\"\",OFFSET(data!$U$12,C84,0))","v":""},{"$nulls":11},{"$f":"AND(COUNTIF(adv!$A:$A,B84&\" (\"&D84&\")\"))","v":false},null,{"$f":"AND(COUNTIF(adv!$A:$A,B84&\" (\"&D84&\") +10\"))","v":false},null,{"$f":"AND(COUNTIF(adv!$A:$A,B84&\" (\"&D84&\") +20\"))","v":false},null,"Navigation",21,{"$f":"IF(OFFSET(data!$U$12,W84,0)=\"\",\"\",OFFSET(data!$U$12,W84,0))","v":""},{"$nulls":11},{"$f":"AND(COUNTIF(adv!$A:$A,V84&\" (\"&X84&\")\"))","v":false},null,{"$f":"AND(COUNTIF(adv!$A:$A,V84&\" (\"&X84&\") +10\"))","v":false},null,{"$f":"AND(COUNTIF(adv!$A:$A,V84&\" (\"&X84&\") +20\"))","v":false},null,"Tactics",47,{"$f":"IF(OFFSET(data!$U$12,AQ84,0)=\"\",\"\",OFFSET(data!$U$12,AQ84,0))","v":""},{"$nulls":11},{"$f":"AND(COUNTIF(adv!$A:$A,AP84&\" (\"&AR84&\")\"))","v":false},null,{"$f":"AND(COUNTIF(adv!$A:$A,AP84&\" (\"&AR84&\") +10\"))","v":false},null,{"$f":"AND(COUNTIF(adv!$A:$A,AP84&\" (\"&AR84&\") +20\"))","v":false}]
[]
[]
[null,"Lore: Common",8,{"$f":"IF(OFFSET(data!$U$12,C87,0)=\"\",\"\",OFFSET(data!$U$12,C87,0))","v":""},{"$nulls":11},{"$f":"AND(COUNTIF(adv!$A:$A,B87&\" (\"&D87&\")\"))","v":false},null,{"$f":"AND(COUNTIF(adv!$A:$A,B87&\" (\"&D87&\") +10\"))","v":false},null,{"$f":"AND(COUNTIF(adv!$A:$A,B87&\" (\"&D87&\") +20\"))","v":false},null,"Navigation",22,{"$f":"IF(OFFSET(data!$U$12,W87,0)=\"\",\"\",OFFSET(data!$U$12,W87,0))","v":""},{"$nulls":11},{"$f":"AND(COUNTIF(adv!$A:$A,V87&\" (\"&X87&\")\"))","v":false},null,{"$f":"AND(COUNTIF(adv!$A:$A,V87&\" (\"&X87&\") +10\"))","v":false},null,{"$f":"AND(COUNTIF(adv!$A:$A,V87&\" (\"&X87&\") +20\"))","v":false},null,"Tactics",48,{"$f":"IF(OFFSET(data!$U$12,AQ87,0)=\"\",\"\",OFFSET(data!$U$12,AQ87,0))","v":""},{"$nulls":11},{"$f":"AND(COUNTIF(adv!$A:$A,AP87&\" (\"&AR87&\")\"))","v":false},null,{"$f":"AND(COUNTIF(adv!$A:$A,AP87&\" (\"&AR87&\") +10\"))","v":false},null,{"$f":"AND(COUNTIF(adv!$A:$A,AP87&\" (\"&AR87&\") +20\"))","v":false}]
[]
[]
[null,"Lore: Common",9,{"$f":"IF(OFFSET(data!$U$12,C90,0)=\"\",\"\",OFFSET(data!$U$12,C90,0))","v":""},{"$nulls":11},{"$f":"AND(COUNTIF(adv!$A:$A,B90&\" (\"&D90&\")\"))","v":false},null,{"$f":"AND(COUNTIF(adv!$A:$A,B90&\" (\"&D90&\") +10\"))","v":false},null,{"$f":"AND(COUNTIF(adv!$A:$A,B90&\" (\"&D90&\") +20\"))","v":false},null,null,"Performer (Fel)",{"$nulls":12},{"$f":"AND(COUNTIF(adv!$A:$A,LEFT(W90,SEARCH(\"(\",W90)-2)))","v":false},null,{"$f":"AND(COUNTIF(adv!$A:$A,LEFT(W90,SEARCH(\"(\",W90)-2)&\" +10\"))","v":false},null,{"$f":"AND(COUNTIF(adv!$A:$A,LEFT(W90,SEARCH(\"(\",W90)-2)&\" +20\"))","v":false},null,"Tactics",49,{"$f":"IF(OFFSET(data!$U$12,AQ90,0)=\"\",\"\",OFFSET(data!$U$12,AQ90,0))","v":""},{"$nulls":11},{"$f":"AND(COUNTIF(adv!$A:$A,AP90&\" (\"&AR90&\")\"))","v":false},null,{"$f":"AND(COUNTIF(adv!$A:$A,AP90&\" (\"&AR90&\") +10\"))","v":false},null,{"$f":"AND(COUNTIF(adv!$A:$A,AP90&\" (\"&AR90&\") +20\"))","v":false}]
[]
[]
[null,null,10,{"$f":"IF(OFFSET(data!$U$12,C93,0)=\"\",\"\",OFFSET(data!$U$12,C93,0))","v":""},{"$nulls":11},{"$f":"AND(COUNTIF(adv!$A:$A,B93&\" (\"&D93&\")\"))","v":false},null,{"$f":"AND(COUNTIF(adv!$A:$A,B93&\" (\"&D93&\") +10\"))","v":false},null,{"$f":"AND(COUNTIF(adv!$A:$A,B93&\" (\"&D93&\") +20\"))","v":false},null,"Performer",26,{"$f":"IF(OFFSET(data!$U$12,W93,0)=\"\",\"\",OFFSET(data!$U$12,W93,0))","v":""},{"$nulls":11},{"$f":"AND(COUNTIF(adv!$A:$A,V93&\" (\"&X93&\")\"))","v":false},null,{"$f":"AND(COUNTIF(adv!$A:$A,V93&\" (\"&X93&\") +10\"))","v":false},null,{"$f":"AND(COUNTIF(adv!$A:$A,V93&\" (\"&X93&\") +20\"))","v":false},null,"Tactics",50,{"$f":"IF(OFFSET(data!$U$12,AQ93,0)=\"\",\"\",OFFSET(data!$U$12,AQ93,0))","v":""},{"$nulls":11},{"$f":"AND(COUNTIF(adv!$A:$A,AP93&\" (\"&AR93&\")\"))","v":false},null,{"$f":"AND(COUNTIF(adv!$A:$A,AP93&\" (\"&AR93&\") +10\"))","v":false},null,{"$f":"AND(COUNTIF(adv!$A:$A,AP93&\" (\"&AR93&\") +20\"))","v":false}]
[]
[]
[null,null,"Concealment (Ag)",{"$nulls":10},"x",null,{"$f":"AND(COUNTIF(adv!$A:$A,LEFT(C96,SEARCH(\"(\",C96)-2)))","v":false},null,{"$f":"AND(COUNTIF(adv!$A:$A,LEFT(C96,SEARCH(\"(\",C96)-2)&\" +10\"))","v":false},null,{"$f":"AND(COUNTIF(adv!$A:$A,LEFT(C96,SEARCH(\"(\",C96)-2)&\" +20\"))","v":false},null,"Performer",27,{"$f":"IF(OFFSET(data!$U$12,W96,0)=\"\",\"\",OFFSET(data!$U$12,W96,0))","v":""},{"$nulls":11},{"$f":"AND(COUNTIF(adv!$A:$A,V96&\" (\"&X96&\")\"))","v":false},null,{"$f":"AND(COUNTIF(adv!$A:$A,V96&\" (\"&X96&\") +10\"))","v":false},null,{"$f":"AND(COUNTIF(adv!$A:$A,V96&\" (\"&X96&\") +20\"))","v":false},null,null,"Tech-Use (Int)",{"$nulls":12},{"$f":"AND(COUNTIF(adv!$A:$A,LEFT(AQ96,SEARCH(\"(\",AQ96)-2)))","v":false},null,{"$f":"AND(COUNTIF(adv!$A:$A,LEFT(AQ96,SEARCH(\"(\",AQ96)-2)&\" +10\"))","v":false},null,{"$f":"AND(COUNTIF(adv!$A:$A,LEFT(AQ96,SEARCH(\"(\",AQ96)-2)&\" +20\"))","v":false}]
[]
[]
[null,null,"Contortionist (Ag)",{"$nulls":10},"x",null,{"$f":"AND(COUNTIF(adv!$A:$A,LEFT(C99,SEARCH(\"(\",C99)-2)))","v":false},null,{"$f":"AND(COUNTIF(adv!$A:$A,LEFT(C99,SEARCH(\"(\",C99)-2)&\" +10\"))","v":false},null,{"$f":"AND(COUNTIF(adv!$A:$A,LEFT(C99,SEARCH(\"(\",C99)-2)&\" +20\"))","v":false},null,null,"Pilot (Ag)",{"$nulls":12},{"$f":"AND(COUNTIF(adv!$A:$A,LEFT(W99,SEARCH(\"(\",W99)-2)))","v":false},null,{"$f":"AND(COUNTIF(adv!$A:$A,LEFT(W99,SEARCH(\"(\",W99)-2)&\" +10\"))","v":false},null,{"$f":"AND(COUNTIF(adv!$A:$A,LEFT(W99,SEARCH(\"(\",W99)-2)&\" +20\"))","v":false},null,null,"Tracking (Int)",{"$nulls":12},{"$f":"AND(COUNTIF(adv!$A:$A,LEFT(AQ99,SEARCH(\"(\",AQ99)-2)))","v":false},null,{"$f":"AND(COUNTIF(adv!$A:$A,LEFT(AQ99,SEARCH(\"(\",AQ99)-2)&\" +10\"))","v":false},null,{"$f":"AND(COUNTIF(adv!$A:$A,LEFT(AQ99,SEARCH(\"(\",AQ99)-2)&\" +20\"))","v":false}]
[]
[]
[null,null,"Deceive (Fel)",{"$nulls":10},"x",null,{"$f":"AND(COUNTIF(adv!$A:$A,LEFT(C102,SEARCH(\"(\",C102)-2)))","v":false},null,{"$f":"AND(COUNTIF(adv!$A:$A,LEFT(C102,SEARCH(\"(\",C102)-2)&\" +10\"))","v":false},null,{"$f":"AND(COUNTIF(adv!$A:$A,LEFT(C102,SEARCH(\"(\",C102)-2)&\" +20\"))","v":false},null,"Pilot",31,{"$f":"IF(OFFSET(data!$U$12,W102,0)=\"\",\"\",OFFSET(data!$U$12,W102,0))","v":""},{"$nulls":11},{"$f":"AND(COUNTIF(adv!$A:$A,V102&\" (\"&X102&\")\"))","v":false},null,{"$f":"AND(COUNTIF(adv!$A:$A,V102&\" (\"&X102&\") +10\"))","v":false},null,{"$f":"AND(COUNTIF(adv!$A:$A,V102&\" (\"&X102&\") +20\"))","v":false},null,null,"Trade (Int)",{"$nulls":12},{"$f":"AND(COUNTIF(adv!$A:$A,LEFT(AQ102,SEARCH(\"(\",AQ102)-2)))","v":false},null,{"$f":"AND(COUNTIF(adv!$A:$A,LEFT(AQ102,SEARCH(\"(\",AQ102)-2)&\" +10\"))","v":false},null,{"$f":"AND(COUNTIF(adv!$A:$A,LEFT(AQ102,SEARCH(\"(\",AQ102)-2)&\" +20\"))","v":false}]
[]
[]
[null,null,"Demolition (Int)",{"$nulls":12},{"$f":"AND(COUNTIF(adv!$A:$A,LEFT(C105,SEARCH(\"(\",C105)-2)))","v":false},null,{"$f":"AND(COUNTIF(adv!$A:$A,LEFT(C105,SEARCH(\"(\",C105)-2)&\" +10\"))","v":false},null,{"$f":"AND(COUNTIF(adv!$A:$A,LEFT(C105,SEARCH(\"(\",C105)-2)&\" +20\"))","v":false},null,"Pilot",32,{"$f":"IF(OFFSET(data!$U$12,W105,0)=\"\",\"\",OFFSET(data!$U$12,W105,0))","v":""},{"$nulls":11},{"$f":"AND(COUNTIF(adv!$A:$A,V105&\" (\"&X105&\")\"))","v":false},null,{"$f":"AND(COUNTIF(adv!$A:$A,V105&\" (\"&X105&\") +10\"))","v":false},null,{"$f":"AND(COUNTIF(adv!$A:$A,V105&\" (\"&X105&\") +20\"))","v":false},null,"Trade",51,{"$f":"IF(OFFSET(data!$U$12,AQ105,0)=\"\",\"\",OFFSET(data!$U$12,AQ105,0))","v":""},{"$nulls":11},{"$f":"AND(COUNTIF(adv!$A:$A,AP105&\" (\"&AR105&\")\"))","v":false},null,{"$f":"AND(COUNTIF(adv!$A:$A,AP105&\" (\"&AR105&\") +10\"))","v":false},null,{"$f":"AND(COUNTIF(adv!$A:$A,AP105&\" (\"&AR105&\") +20\"))","v":false}]
[]
[]
[null,null,"Disguise (Fel)",{"$nulls":12},{"$f":"AND(COUNTIF(adv!$A:$A,LEFT(C108,SEARCH(\"(\",C108)-2)))","v":false},null,{"$f":"AND(COUNTIF(adv!$A:$A,LEFT(C108,SEARCH(\"(\",C108)-2)&\" +10\"))","v":false},null,{"$f":"AND(COUNTIF(adv!$A:$A,LEFT(C108,SEARCH(\"(\",C108)-2)&\" +20\"))","v":false},null,"Pilot",33,{"$f":"IF(OFFSET(data!$U$12,W108,0)=\"\",\"\",OFFSET(data!$U$12,W108,0))","v":""},{"$nulls":11},{"$f":"AND(COUNTIF(adv!$A:$A,V108&\" (\"&X108&\")\"))","v":false},null,{"$f":"AND(COUNTIF(adv!$A:$A,V108&\" (\"&X108&\") +10\"))","v":false},null,{"$f":"AND(COUNTIF(adv!$A:$A,V108&\" (\"&X108&\") +20\"))","v":false},null,"Trade",52,{"$f":"IF(OFFSET(data!$U$12,AQ108,0)=\"\",\"\",OFFSET(data!$U$12,AQ108,0))","v":""},{"$nulls":11},{"$f":"AND(COUNTIF(adv!$A:$A,AP108&\" (\"&AR108&\")\"))","v":false},null,{"$f":"AND(COUNTIF(adv!$A:$A,AP108&\" (\"&AR108&\") +10\"))","v":false},null,{"$f":"AND(COUNTIF(adv!$A:$A,AP108&\" (\"&AR108&\") +20\"))","v":false}]
[]
[]
[null,null,"Dodge (Ag)",{"$nulls":10},"x",null,{"$f":"AND(COUNTIF(adv!$A:$A,LEFT(C111,SEARCH(\"(\",C111)-2)))","v":false},null,{"$f":"AND(COUNTIF(adv!$A:$A,LEFT(C111,SEARCH(\"(\",C111)-2)&\" +10\"))","v":false},null,{"$f":"AND(COUNTIF(adv!$A:$A,LEFT(C111,SEARCH(\"(\",C111)-2)&\" +20\"))","v":false},null,null,"Psyniscience (Per)",{"$nulls":12},{"$f":"AND(COUNTIF(adv!$A:$A,LEFT(W111,SEARCH(\"(\",W111)-2)))","v":false},null,{"$f":"AND(COUNTIF(adv!$A:$A,LEFT(W111,SEARCH(\"(\",W111)-2)&\" +10\"))","v":false},null,{"$f":"AND(COUNTIF(adv!$A:$A,LEFT(W111,SEARCH(\"(\",W111)-2)&\" +20\"))","v":false},null,"Trade",53,{"$f":"IF(OFFSET(data!$U$12,AQ111,0)=\"\",\"\",OFFSET(data!$U$12,AQ111,0))","v":""},{"$nulls":11},{"$f":"AND(COUNTIF(adv!$A:$A,AP111&\" (\"&AR111&\")\"))","v":false},null,{"$f":"AND(COUNTIF(adv!$A:$A,AP111&\" (\"&AR111&\") +10\"))","v":false},null,{"$f":"AND(COUNTIF(adv!$A:$A,AP111&\" (\"&AR111&\") +20\"))","v":false}]
[]
[]
[null,null,"Drive (Ag)",{"$nulls":12},{"$f":"AND(COUNTIF(adv!$A:$A,LEFT(C114,SEARCH(\"(\",C114)-2)))","v":false},null,{"$f":"AND(COUNTIF(adv!$A:$A,LEFT(C114,SEARCH(\"(\",C114)-2)&\" +10\"))","v":false},null,{"$f":"AND(COUNTIF(adv!$A:$A,LEFT(C114,SEARCH(\"(\",C114)-2)&\" +20\"))","v":false},null,null,"Scholastic Lore (Int)",{"$nulls":12},{"$f":"AND(COUNTIF(adv!$A:$A,LEFT(W114,SEARCH(\"(\",W114)-2)))","v":false},null,{"$f":"AND(COUNTIF(adv!$A:$A,LEFT(W114,SEARCH(\"(\",W114)-2)&\" +10\"))","v":false},null,{"$f":"AND(COUNTIF(adv!$A:$A,LEFT(W114,SEARCH(\"(\",W114)-2)&\" +20\"))","v":false},null,null,"Wrangling (Int)",{"$nulls":12},{"$f":"AND(COUNTIF(adv!$A:$A,LEFT(AQ114,SEARCH(\"(\",AQ114)-2)))","v":false},null,{"$f":"AND(COUNTIF(adv!$A:$A,LEFT(AQ114,SEARCH(\"(\",AQ114)-2)&\" +10\"))","v":false},null,{"$f":"AND(COUNTIF(adv!$A:$A,LEFT(AQ114,SEARCH(\"(\",AQ114)-2)&\" +20\"))","v":false}]
[]
[]
[null,"Drive",11,{"$f":"IF(OFFSET(data!$U$12,C117,0)=\"\",\"\",OFFSET(data!$U$12,C117,0))","v":""},{"$nulls":11},{"$f":"AND(COUNTIF(adv!$A:$A,B117&\" (\"&D117&\")\"))","v":false},null,{"$f":"AND(COUNTIF(adv!$A:$A,B117&\" (\"&D117&\") +10\"))","v":false},null,{"$f":"AND(COUNTIF(adv!$A:$A,B117&\" (\"&D117&\") +20\"))","v":false},null,"Lore: Scholastic",36,{"$f":"IF(OFFSET(data!$U$12,W117,0)=\"\",\"\",OFFSET(data!$U$12,W117,0))","v":""},{"$nulls":11},{"$f":"AND(COUNTIF(adv!$A:$A,V117&\" (\"&X117&\")\"))","v":false},null,{"$f":"AND(COUNTIF(adv!$A:$A,V117&\" (\"&X117&\") +10\"))","v":false},null,{"$f":"AND(COUNTIF(adv!$A:$A,V117&\" (\"&X117&\") +20\"))","v":false}]
[]
[]
[null,"Drive",12,{"$f":"IF(OFFSET(data!$U$12,C120,0)=\"\",\"\",OFFSET(data!$U$12,C120,0))","v":""},{"$nulls":11},{"$f":"AND(COUNTIF(adv!$A:$A,B120&\" (\"&D120&\")\"))","v":false},null,{"$f":"AND(COUNTIF(adv!$A:$A,B120&\" (\"&D120&\") +10\"))","v":false},null,{"$f":"AND(COUNTIF(adv!$A:$A,B120&\" (\"&D120&\") +20\"))","v":false},null,"Lore: Scholastic",37,{"$f":"IF(OFFSET(data!$U$12,W120,0)=\"\",\"\",OFFSET(data!$U$12,W120,0))","v":""},{"$nulls":11},{"$f":"AND(COUNTIF(adv!$A:$A,V120&\" (\"&X120&\")\"))","v":false},null,{"$f":"AND(COUNTIF(adv!$A:$A,V120&\" (\"&X120&\") +10\"))","v":false},null,{"$f":"AND(COUNTIF(adv!$A:$A,V120&\" (\"&X120&\") +20\"))","v":false}]
[{"$nulls":42},"MOVEMENT:",{"$nulls":7},"Half",null,{"$f":"mv_half","v":3},null,null,"Charge",null,null,{"$f":"mv_charge","v":9}]
[]
[null,"Drive",13,{"$f":"IF(OFFSET(data!$U$12,C123,0)=\"\",\"\",OFFSET(data!$U$12,C123,0))","v":""},{"$nulls":11},{"$f":"AND(COUNTIF(adv!$A:$A,B123&\" (\"&D123&\")\"))","v":false},null,{"$f":"AND(COUNTIF(adv!$A:$A,B123&\" (\"&D123&\") +10\"))","v":false},null,{"$f":"AND(COUNTIF(adv!$A:$A,B123&\" (\"&D123&\") +20\"))","v":false},null,"Lore: Scholastic",38,{"$f":"IF(OFFSET(data!$U$12,W123,0)=\"\",\"\",OFFSET(data!$U$12,W123,0))","v":""},{"$nulls":11},{"$f":"AND(COUNTIF(adv!$A:$A,V123&\" (\"&X123&\")\"))","v":false},null,{"$f":"AND(COUNTIF(adv!$A:$A,V123&\" (\"&X123&\") +10\"))","v":false},null,{"$f":"AND(COUNTIF(adv!$A:$A,V123&\" (\"&X123&\") +20\"))","v":false},{"$nulls":10},"Full",null,{"$f":"mv_full","v":6},null,null,"Run",null,null,{"$f":"mv_run","v":18}]
[]
[]
[null,null,"Evaluate (int)",{"$nulls":12},{"$f":"AND(COUNTIF(adv!$A:$A,LEFT(C126,SEARCH(\"(\",C126)-2)))","v":false},null,{"$f":"AND(COUNTIF(adv!$A:$A,LEFT(C126,SEARCH(\"(\",C126)-2)&\" +10\"))","v":false},null,{"$f":"AND(COUNTIF(adv!$A:$A,LEFT(C126,SEARCH(\"(\",C126)-2)&\" +20\"))","v":false},null,"Lore: Scholastic",39,{"$f":"IF(OFFSET(data!$U$12,W126,0)=\"\",\"\",OFFSET(data!$U$12,W126,0))","v":""},{"$nulls":11},{"$f":"AND(COUNTIF(adv!$A:$A,V126&\" (\"&X126&\")\"))","v":false},null,{"$f":"AND(COUNTIF(adv!$A:$A,V126&\" (\"&X126&\") +10\"))","v":false},null,{"$f":"AND(COUNTIF(adv!$A:$A,V126&\" (\"&X126&\") +20\"))","v":false}]
[{"$nulls":42},"WOUNDS:",{"$nulls":9},"Total",null,null,{"$f":"wounds","v":18}]
[]
[{"$nulls":21},"Lore: Scholastic",40,{"$f":"IF(OFFSET(data!$U$12,W129,0)=\"\",\"\",OFFSET(data!$U$12,W129,0))","v":""},{"$nulls":11},{"$f":"AND(COUNTIF(adv!$A:$A,V129&\" (\"&X129&\")\"))","v":false},null,{"$f":"AND(COUNTIF(adv!$A:$A,V129&\" (\"&X129&\") +10\"))","v":false},null,{"$f":"AND(COUNTIF(adv!$A:$A,V129&\" (\"&X129&\") +20\"))","v":false},{"$nulls":12},"Current"]
[]
[{"$nulls":52},"Fatigue"]
[]
[null,null,"INSANITY:",{"$nulls":19},"CORRUPTION:",{"$nulls":19},"Critical Damage"]
[{"$nulls":12},"Current",{"$nulls":3},{"$f":"IF(insanity<1,\"\",insanity)","v":""},{"$nulls":16},"Current",null,null,{"$f":"IF(corruption<1,\"\",corruption)","v":""}]
[]
[]
[null,null,"Battle Fatigue"]
[{"$nulls":42},"FATE POINTS:",{"$nulls":10},"Total",null,null,{"$f":"fate","v":0}]
[null,null,"Primarch's Curse",{"$nulls":5},{"$f":"IF(primcurse=\"\",\"\",primcurse)","v":""}]
[{"$nulls":53},"Current"]
[]
[]
[null,"SPACE MARINE ABILITIES\n\nSecondary Heart/Ossmodula/Biscopea/Haemastamen: You gain the Unnatural Strength and Toughness Traits.\nLarraman’s Organ: You do not suffer from Blood Loss.\nCatalepsean Node: You suffer no penalties to Perception-based Tests when awake for long periods of time.\nPreomnor: You gain +20 to Toughness Tests against ingested poisons.\nmophagea: You may gain a Skill or Skill Group by devouring a portion of an enemy.\nMulti-Lung: You may re-roll any failed Toughness Test for drowning or asphyxiation. In addition, you gain a +30 to Toughness Tests made to resist gases, and may re-roll failed results.\ncculube and Lyman’s Ear: You gain the Heightened Senses (Sight and Hearing) Talents, +10 to relevant Awareness Tests.",{"$nulls":19},"Sus-an Membrane: You may enter suspended animation.\nOolotic Kidney: You may re-roll any failed Toughness Test ro resist poisons and toxins, including attacks with the Toxic Quality.\nNeuroglottis: You may detect any poison or toxin by taste with a successful Awareness Test. You gain a +10 to Tracking Tests against a target you have tasted.\nMucranoid: You may re-roll any failed Toughness Tests caused by temperature extremes.\nBetcher’s Gland: You may spit acid as a ranged weapon with the following profile:\nRange: 3m; Damage: 1d5; Pen 4; Toxic. If you hit your target by 3 or more degrees of success, you have blinded him for 1d5 Rounds.\nProgenoids: These may be retrieved with a successful Medicae Test.\nBlack Carapace: While wearing Power Armour, enemies do not gain a bonus to hit you due to your size.",{"$nulls":20},"RENOWN:"]
[]
[]
[]
[{"$nulls":42},"Current",{"$nulls":6},"[",{"$f":"renown","v":0},{"$nulls":8},"]"]
[]
[]
[{"$nulls":42},"EXPERIENCE:"]
[]
[]
[]
[{"$nulls":42},"XP to Spend",{"$nulls":6},"[",{"$f":"xpr","v":1000},{"$nulls":8},"]"]
[]
[{"$nulls":42},"Total XP Spent",{"$nulls":6},"[",{"$f":"xps","v":12000},{"$nulls":8},"]"]
[]
[]
[{"$nulls":42},"Distinctions"]
[]
[]
[]
[]
[{"$nulls":42},{"$f":"IF(distinctions=\"\",\"\",distinctions)","v":""}]
[]
[]
[]
[]
[]
[]
[null,{"$f":"strversion","v":"Version: 0.5 r7 [16/12/2013]"}]

{"sheet":"Alt_Page2","index":4,"n_rows":171,"n_cols":64,"rows_kept":171,"merged":[[2,2,5,59],[6,1,7,5],[6,7,7,11],[6,13,7,18],[6,20,7,25],[6,27,7,32],[6,34,7,39],[6,41,7,46],[6,48,7,53],[6,55,7,60],[8,1,9,5],[8,7,9,11],[8,13,9,18],[8,20,9,25],[8,27,9,32],[8,34,9,39],[8,41,9,46],[8,48,9,53],[8,55,9,60],[10,1,16,5],[10,7,16,11],[10,13,13,14],[10,16,16,18],[10,20,13,21],[10,23,16,25],[10,27,16,29],[10,30,16,32],[10,34,16,36],[10,37,16,39],[10,41,16,43],[10,44,16,46],[10,48,16,50],[10,51,16,53],[10,55,16,57],[10,58,16,60],[14,13,16,15],[14,20,16,22],[19,2,22,29],[19,32,20,36],[19,38,20,42],[19,44,20,48],[19,53,20,59],[21,32,24,36],[21,38,22,42],[21,44,24,48],[23,2,24,4],[23,5,24,29],[23,39,25,41],[23,54,24,58],[23,59,24,59],[25,2,26,4],[25,5,26,8],[25,9,26,12],[25,13,26,17],[25,18,26,20],[25,21,26,23],[25,24,26,25],[25,26,26,29],[26,38,27,42],[27,2,28,4],[27,5,28,8],[27,9,28,10],[27,11,28,16],[27,17,28,20],[27,21,28,23],[27,24,28,25],[27,26,28,29],[27,32,28,36],[27,44,28,48],[27,54,28,58],[27,59,28,59],[29,2,32,8],[29,9,32,29],[29,32,30,36],[29,44,30,48],[30,38,31,42],[31,33,33,35],[31,45,33,47],[31,54,32,58],[31,59,32,59],[32,38,33,42],[33,2,36,29],[34,32,35,36],[34,39,36,41],[34,44,35,48],[37,2,38,4],[37,5,38,29],[37,38,38,42],[37,47,38,59],[39,2,40,4],[39,5,40,8],[39,9,40,12],[39,13,40,17],[39,18,40,20],[39,21,40,23],[39,24,40,25],[39,26,40,29],[39,47,42,59],[41,2,42,4],[41,5,42,8],[41,9,42,10],[41,11,42,16],[41,17,42,20],[41,21,42,23],[41,24,42,25],[41,26,42,29],[41,35,42,39],[41,41,42,45],[43,2,46,8],[43,9,46,29],[43,35,44,39],[43,41,44,45],[43,47,49,59],[45,36,47,38],[45,42,47,44],[47,2,50,29],[48,35,49,39],[48,41,49,45],[51,2,52,4],[51,5,52,29],[51,32,52,59],[53,2,54,4],[53,5,54,8],[53,9,54,12],[53,13,54,17],[53,18,54,20],[53,21,54,23],[53,24,54,25],[53,26,54,29],[53,32,72,45],[53,46,72,59],[55,2,56,4],[55,5,56,8],[55,9,56,10],[55,11,56,16],[55,17,56,20],[55,21,56,23],[55,24,56,25],[55,26,56,29],[57,2,60,8],[57,9,60,29],[61,2,64,29],[65,2,66,4],[65,5,66,29],[67,2,68,4],[67,5,68,8],[67,9,68,12],[67,13,68,17],[67,18,68,20],[67,21,68,23],[67,24,68,25],[67,26,68,29],[69,2,70,4],[69,5,70,8],[69,9,70,10],[69,11,70,16],[69,17,70,20],[69,21,70,23],[69,24,70,25],[69,26,70,29],[71,2,74,8],[71,9,74,29],[73,32,77,59],[75,2,78,29],[78,32,79,59],[79,2,80,4],[79,5,80,29],[80,32,81,59],[81,2,82,4],[81,5,82,8],[81,9,82,12],[81,13,82,17],[81,18,82,20],[81,21,82,23],[81,24,82,25],[81,26,82,29],[82,32,83,59],[83,2,84,4],[83,5,84,8],[83,9,84,10],[83,11,84,16],[83,17,84,20],[83,21,84,23],[83,24,84,25],[83,26,84,29],[84,32,85,59],[85,2,88,8],[85,9,88,29],[86,32,87,59],[88,32,89,59],[89,2,92,29],[90,32,91,59],[92,32,93,59],[93,2,94,4],[93,5,94,29],[94,32,95,59],[95,2,96,4],[95,5,96,8],[95,9,96,12],[95,13,96,17],[95,18,96,20],[95,21,96,23],[95,24,96,25],[95,26,96,29],[96,32,97,59],[97,2,98,4],[97,5,98,8],[97,9,98,10],[97,11,98,16],[97,17,98,20],[97,21,98,23],[97,24,98,25],[97,26,98,29],[98,32,99,59],[99,2,102,8],[99,9,102,29],[100,32,101,59],[102,32,103,59],[104,32,105,59],[106,2,109,29],[106,32,107,59],[108,32,109,59],[110,2,111,14],[110,17,111,29],[110,32,111,59],[112,2,113,14],[112,17,113,29],[112,32,113,59],[114,2,115,14],[114,17,115,29],[114,32,115,59],[116,2,117,14],[116,17,117,29],[116,32,117,59],[118,2,119,14],[118,17,119,29],[118,32,119,59],[120,2,121,14],[120,17,121,29],[120,32,121,59],[122,2,123,14],[122,17,123,29],[122,32,123,59],[124,2,125,14],[124,17,125,29],[124,32,125,59],[126,2,127,14],[126,17,127,29],[126,32,127,59],[128,2,129,14],[128,17,129,29],[128,32,129,59],[130,2,131,14],[130,17,131,29],[130,32,131,59],[132,2,133,14],[132,17,133,29],[132,32,133,59],[134,2,135,14],[134,17,135,29],[134,32,135,59],[136,2,137,14],[136,17,137,29],[136,32,137,59],[138,2,139,14],[138,17,139,29],[138,32,139,59],[140,2,141,14],[140,17,141,29],[140,32,141,59],[142,32,143,59],[144,2,147,29],[144,32,145,59],[146,32,147,59],[148,2,149,8],[148,9,149,10],[148,17,149,29],[148,32,149,59],[150,2,151,14],[150,17,151,29],[150,32,151,59],[152,2,153,14],[152,17,153,29],[152,32,153,59],[154,2,155,14],[154,17,155,29],[154,32,155,59],[156,2,157,14],[156,17,157,29],[156,32,157,59],[158,2,159,14],[158,17,159,29],[158,32,159,59],[160,2,161,14],[160,17,161,29],[160,32,161,59],[162,2,163,14],[162,17,163,29],[162,32,163,59],[164,2,165,14],[164,17,165,29],[164,32,165,59],[166,2,167,14],[166,17,167,29],[166,32,167,59],[168,2,169,14],[168,17,169,29],[168,32,169,59],[170,1,171,60]]}
[]
[]
[null,null,"CHARACTERISTICS"]
[]
[]
[]
[null,"Weapon Skill",{"$nulls":5},"Ballistic Skill",{"$nulls":5},"Strength",{"$nulls":6},"Toughness",{"$nulls":6},"Agility",{"$nulls":6},"Intelligence",{"$nulls":6},"Perception",{"$nulls":6},"Will Power",{"$nulls":6},"Fellowship"]
[]
[null,"(WS)",{"$nulls":5},"(BS)",{"$nulls":5},"(S)",{"$nulls":6},"(T)",{"$nulls":6},"(Ag)",{"$nulls":6},"(Int)",{"$nulls":6},"(Per)",{"$nulls":6},"(WP)",{"$nulls":6},"(Fel)"]
[]
[null,{"$f":"cha_ws","v":30},{"$nulls":5},{"$f":"cha_bs","v":30},{"$nulls":5},{"$f":"s_bon","v":3},null,null,{"$f":"MOD(cha_s,10)","v":0},{"$nulls":3},{"$f":"t_bon","v":3},null,null,{"$f":"MOD(cha_t,10)","v":0},{"$nulls":3},{"$f":"(cha_ag-AE11)/10","v":3},null,null,{"$f":"MOD(cha_ag,10)","v":0},{"$nulls":3},{"$f":"(cha_int-AL11)/10","v":3},null,null,{"$f":"MOD(cha_int,10)","v":0},{"$nulls":3},{"$f":"(cha_per-AS11)/10","v":3},null,null,{"$f":"MOD(cha_per,10)","v":0},{"$nulls":3},{"$f":"(cha_wp-AZ11)/10","v":3},null,null,{"$f":"MOD(cha_wp,10)","v":0},{"$nulls":3},{"$f":"(cha_fel-BG11)/10","v":3},null,null,{"$f":"MOD(cha_fel,10)","v":0}]
[]
[]
[]
[{"$nulls":13},{"$f":"((cha_s-Q11)/10)","v":3},{"$nulls":6},{"$f":"((cha_t-X11)/10)","v":3}]
[]
[]
[]
[]
[null,null,"WEAPON",{"$nulls":29},"ARMOUR",{"$nulls":5},"HEAD",{"$nulls":5},"HELMET",{"$nulls":8},"ARMOUR ADDITIONS"]
[]
[{"$nulls":32},{"$f":"IF(armour=\"\",\"\",armour)","v":""},{"$nulls":5},"(1-10)",{"$nulls":5},{"$f":"IF(helmet=\"\",\"\",helmet)","v":""}]
[]
[null,null,"NAME",null,null,{"$f":"IF(weapon1=\"\",\"\",weapon1)","v":""},{"$nulls":33},{"$f":"IF(data!N3=\"\",\"\",data!N3)","v":""},{"$nulls":14},"JUMP PACK",{"$nulls":4},{"$f":"IF(COUNTIF(gear!A:A,\"Astartes Jump Pack\")>0,\"x\",\"\")","v":""}]
[]
[null,null,"CLASS",null,null,{"$f":"IF(OFFSET(weapon1,0,1)=\"\",\"\",OFFSET(weapon1,0,1))","v":""},{"$nulls":3},"DAMAGE",{"$nulls":3},{"$f":"IF(OFFSET(weapon1,0,4)=\"\",\"\",OFFSET(weapon1,0,4))","v":""},{"$nulls":4},"TYPE",null,null,{"$f":"IF(OFFSET(weapon1,0,5)=\"\",\"\",OFFSET(weapon1,0,5))","v":""},null,null,"PEN",null,{"$f":"IF(OFFSET(weapon1,0,6)=\"\",\"\",OFFSET(weapon1,0,6))","v":""}]
[{"$nulls":38},"Type:"]
[null,null,"RANGE",null,null,{"$f":"IF(OFFSET(weapon1,0,2)=\"\",\"\",OFFSET(weapon1,0,2))","v":""},{"$nulls":3},"ROF",null,{"$f":"IF(OFFSET(weapon1,0,3)=\"\",\"\",OFFSET(weapon1,0,3))","v":""},{"$nulls":5},"CLIP",{"$nulls":3},{"$f":"IF(OFFSET(weapon1,0,7)=\"\",\"\",OFFSET(weapon1,0,7))","v":""},null,null,"RLD",null,{"$f":"IF(OFFSET(weapon1,0,8)=\"\",\"\",OFFSET(weapon1,0,8))","v":""},{"$nulls":5},"RIGHT ARM",{"$nulls":11},"LEFT ARM",{"$nulls":9},"TERMINATOR",{"$nulls":4},{"$f":"IF(COUNTIF(gear!A:A,\"Astartes Terminator Armour\")>0,\"x\",\"\")","v":""}]
[]
[null,null,"SPECIAL RULES",{"$nulls":6},{"$f":"IF(OFFSET(weapon1,0,9)=\"\",\"\",OFFSET(weapon1,0,9))","v":""},{"$nulls":22},"(11-20)",{"$nulls":11},"(21-30)"]
[{"$nulls":38},"BODY"]
[{"$nulls":33},{"$f":"IF(data!N5=\"\",\"\",data!N5)","v":""},{"$nulls":11},{"$f":"IF(data!N6=\"\",\"\",data!N6)","v":""},{"$nulls":8},"SHIELD",{"$nulls":4},{"$f":"IF(OR(COUNTIF(gear!A:A,\"Astartes Combat Shield\")>0,COUNTIF(gear!A:A,\"Astartes Storm Shield\")>0,COUNTIF(gear!A:A,\"Iron Halo\")>0,COUNTIF(gear!A:A,\"Rosarius\")>0),\"x\",\"\")","v":""}]
[{"$nulls":38},"(31-70)"]
[null,null,"WEAPON"]
[{"$nulls":32},"Type:",{"$nulls":6},{"$f":"IF(data!N4=\"\",\"\",data!N4)","v":""},{"$nulls":4},"Type:"]
[{"$nulls":32},"Type:"]
[]
[null,null,"NAME",null,null,{"$f":"IF(weapon2=\"\",\"\",weapon2)","v":""},{"$nulls":32},"Type:",{"$nulls":8},"Power Armour History"]
[null,null,"NAME"]
[null,null,"CLASS",null,null,{"$f":"IF(OFFSET(weapon2,0,1)=\"\",\"\",OFFSET(weapon2,0,1))","v":""},{"$nulls":3},"DAMAGE",{"$nulls":3},{"$f":"IF(OFFSET(weapon2,0,4)=\"\",\"\",OFFSET(weapon2,0,4))","v":""},{"$nulls":4},"TYPE",null,null,{"$f":"IF(OFFSET(weapon2,0,5)=\"\",\"\",OFFSET(weapon2,0,5))","v":""},null,null,"PEN",null,{"$f":"IF(OFFSET(weapon2,0,6)=\"\",\"\",OFFSET(weapon2,0,6))","v":""},{"$nulls":20},{"$f":"IF(pa_history1=\"\",\"\",pa_history1)&IF(pa_history2=\"\",\"\",\", \"&pa_history2)&IF(pa_history3=\"\",\"\",\", \"&pa_history3)","v":""}]
[null,null,"CLASS",{"$nulls":6},"DAMAGE",{"$nulls":8},"TYPE",{"$nulls":5},"PEN"]
[null,null,"RANGE",null,null,{"$f":"IF(OFFSET(weapon2,0,2)=\"\",\"\",OFFSET(weapon2,0,2))","v":""},{"$nulls":3},"ROF",null,{"$f":"IF(OFFSET(weapon2,0,3)=\"\",\"\",OFFSET(weapon2,0,3))","v":""},{"$nulls":5},"CLIP",{"$nulls":3},{"$f":"IF(OFFSET(weapon2,0,7)=\"\",\"\",OFFSET(weapon2,0,7))","v":""},null,null,"RLD",null,{"$f":"IF(OFFSET(weapon2,0,8)=\"\",\"\",OFFSET(weapon2,0,8))","v":""},{"$nulls":8},"RIGHT LEG",{"$nulls":5},"LEFT LEG"]
[null,null,"RANGE",{"$nulls":6},"ROF",{"$nulls":8},"CLIP",{"$nulls":5},"RLD"]
[null,null,"SPECIAL RULES",{"$nulls":6},{"$f":"IF(OFFSET(weapon2,0,9)=\"\",\"\",OFFSET(weapon2,0,9))","v":""},{"$nulls":25},"(71-85)",{"$nulls":5},"(71-85)",{"$nulls":5},{"$f":"IF(pahistoryeffect=\"\",\"\",pahistoryeffect)","v":""}]
[]
[null,null,"SPECIAL RULES",{"$nulls":33},{"$f":"IF(data!N7=\"\",\"\",data!N7)","v":""},{"$nulls":5},{"$f":"IF(data!N8=\"\",\"\",data!N8)","v":""}]
[]
[null,null,"WEAPON"]
[{"$nulls":35},"Type:",{"$nulls":5},"Type:"]
[]
[]
[null,null,"NAME",null,null,{"$f":"IF(weapon3=\"\",\"\",weapon3)","v":""},{"$nulls":26},"[POWER ARMOUR ABILTIES]"]
[null,null,"NAME"]
[null,null,"CLASS",null,null,{"$f":"IF(OFFSET(weapon3,0,1)=\"\",\"\",OFFSET(weapon3,0,1))","v":""},{"$nulls":3},"DAMAGE",{"$nulls":3},{"$f":"IF(OFFSET(weapon3,0,4)=\"\",\"\",OFFSET(weapon3,0,4))","v":""},{"$nulls":4},"TYPE",null,null,{"$f":"IF(OFFSET(weapon3,0,5)=\"\",\"\",OFFSET(weapon3,0,5))","v":""},null,null,"PEN",null,{"$f":"IF(OFFSET(weapon3,0,6)=\"\",\"\",OFFSET(weapon3,0,6))","v":""},{"$nulls":5},"Servo-Augmented Musculature: +20 Strength\nAuto-senses: Dark Sight, immune to Photon Flash and Stun Grenades;\nCalled Shots are Half Actions; +10 to Sight and Hearing Awareness Tests (total of +20 bonus with Heightened Senses)\nBuilt-in Vox Link\nBuilt-in Magboots\nNutrient Recycling: Can operate for two weeks without re-supply",{"$nulls":13},"Recoil Suppression: May fire Basic weapons 1-handed without penalty\nSize: Hulking (Black Carapace means no bonus for enemies to attack)\nPoor Manual Dexterity: Delicate tasks suffer a –10 penalty, unless using equipment designed for Space Marines\nOsmotic Gill Life Sustainer: With the helmet on, the armour is environmentally sealed"]
[null,null,"CLASS",{"$nulls":6},"DAMAGE",{"$nulls":8},"TYPE",{"$nulls":5},"PEN"]
[null,null,"RANGE",null,null,{"$f":"IF(OFFSET(weapon3,0,2)=\"\",\"\",OFFSET(weapon3,0,2))","v":""},{"$nulls":3},"ROF",null,{"$f":"IF(OFFSET(weapon3,0,3)=\"\",\"\",OFFSET(weapon3,0,3))","v":""},{"$nulls":5},"CLIP",{"$nulls":3},{"$f":"IF(OFFSET(weapon3,0,7)=\"\",\"\",OFFSET(weapon3,0,7))","v":""},null,null,"RLD",null,{"$f":"IF(OFFSET(weapon3,0,8)=\"\",\"\",OFFSET(weapon3,0,8))","v":""}]
[null,null,"RANGE",{"$nulls":6},"ROF",{"$nulls":8},"CLIP",{"$nulls":5},"RLD"]
[null,null,"SPECIAL RULES",{"$nulls":6},{"$f":"IF(OFFSET(weapon3,0,9)=\"\",\"\",OFFSET(weapon3,0,9))","v":""}]
[null,null,"SPECIAL RULES"]
[]
[]
[null,null,"WEAPON"]
[]
[]
[]
[null,null,"NAME",null,null,{"$f":"IF(weapon4=\"\",\"\",weapon4)","v":""}]
[null,null,"NAME"]
[null,null,"CLASS",null,null,{"$f":"IF(OFFSET(weapon4,0,1)=\"\",\"\",OFFSET(weapon4,0,1))","v":""},{"$nulls":3},"DAMAGE",{"$nulls":3},{"$f":"IF(OFFSET(weapon4,0,4)=\"\",\"\",OFFSET(weapon4,0,4))","v":""},{"$nulls":4},"TYPE",null,null,{"$f":"IF(OFFSET(weapon4,0,5)=\"\",\"\",OFFSET(weapon4,0,5))","v":""},null,null,"PEN",null,{"$f":"IF(OFFSET(weapon4,0,6)=\"\",\"\",OFFSET(weapon4,0,6))","v":""}]
[null,null,"CLASS",{"$nulls":6},"DAMAGE",{"$nulls":8},"TYPE",{"$nulls":5},"PEN"]
[null,null,"RANGE",null,null,{"$f":"IF(OFFSET(weapon4,0,2)=\"\",\"\",OFFSET(weapon4,0,2))","v":""},{"$nulls":3},"ROF",null,{"$f":"IF(OFFSET(weapon4,0,3)=\"\",\"\",OFFSET(weapon4,0,3))","v":""},{"$nulls":5},"CLIP",{"$nulls":3},{"$f":"IF(OFFSET(weapon4,0,7)=\"\",\"\",OFFSET(weapon4,0,7))","v":""},null,null,"RLD",null,{"$f":"IF(OFFSET(weapon4,0,8)=\"\",\"\",OFFSET(weapon4,0,8))","v":""}]
[null,null,"RANGE",{"$nulls":6},"ROF",{"$nulls":8},"CLIP",{"$nulls":5},"RLD"]
[null,null,"SPECIAL RULES",{"$nulls":6},{"$f":"IF(OFFSET(weapon4,0,9)=\"\",\"\",OFFSET(weapon4,0,9))","v":""}]
[null,null,"SPECIAL RULES"]
[{"$nulls":32},"SPACE MARINE TALENTS & TRAITS"]
[]
[null,null,"WEAPON"]
[]
[]
[{"$nulls":31},1,{"$f":"IF(OFFSET(data!$J$12,AF79,0)=\"\",\"\",OFFSET(data!$J$12,AF79,0)&IF(OFFSET(data!$J$12,AF79,1)<>\"\",\" [\"&OFFSET(data!$J$12,AF79,1)&\"]\",\"\"))","v":""}]
[null,null,"NAME",null,null,{"$f":"IF(weapon5=\"\",\"\",weapon5)","v":""}]
[null,null,"NAME",{"$nulls":28},2,{"$f":"IF(OFFSET(data!$J$12,AF81,0)=\"\",\"\",OFFSET(data!$J$12,AF81,0)&IF(OFFSET(data!$J$12,AF81,1)<>\"\",\" [\"&OFFSET(data!$J$12,AF81,1)&\"]\",\"\"))","v":""}]
[null,null,"CLASS",null,null,{"$f":"IF(OFFSET(weapon5,0,1)=\"\",\"\",OFFSET(weapon5,0,1))","v":""},{"$nulls":3},"DAMAGE",{"$nulls":3},{"$f":"IF(OFFSET(weapon5,0,4)=\"\",\"\",OFFSET(weapon5,0,4))","v":""},{"$nulls":4},"TYPE",null,null,{"$f":"IF(OFFSET(weapon5,0,5)=\"\",\"\",OFFSET(weapon5,0,5))","v":""},null,null,"PEN",null,{"$f":"IF(OFFSET(weapon5,0,6)=\"\",\"\",OFFSET(weapon5,0,6))","v":""}]
[null,null,"CLASS",{"$nulls":6},"DAMAGE",{"$nulls":8},"TYPE",{"$nulls":5},"PEN",{"$nulls":6},3,{"$f":"IF(OFFSET(data!$J$12,AF83,0)=\"\",\"\",OFFSET(data!$J$12,AF83,0)&IF(OFFSET(data!$J$12,AF83,1)<>\"\",\" [\"&OFFSET(data!$J$12,AF83,1)&\"]\",\"\"))","v":""}]
[null,null,"RANGE",null,null,{"$f":"IF(OFFSET(weapon5,0,2)=\"\",\"\",OFFSET(weapon5,0,2))","v":""},{"$nulls":3},"ROF",null,{"$f":"IF(OFFSET(weapon5,0,3)=\"\",\"\",OFFSET(weapon5,0,3))","v":""},{"$nulls":5},"CLIP",{"$nulls":3},{"$f":"IF(OFFSET(weapon5,0,7)=\"\",\"\",OFFSET(weapon5,0,7))","v":""},null,null,"RLD",null,{"$f":"IF(OFFSET(weapon5,0,8)=\"\",\"\",OFFSET(weapon5,0,8))","v":""}]
[null,null,"RANGE",{"$nulls":6},"ROF",{"$nulls":8},"CLIP",{"$nulls":5},"RLD",{"$nulls":6},4,{"$f":"IF(OFFSET(data!$J$12,AF85,0)=\"\",\"\",OFFSET(data!$J$12,AF85,0)&IF(OFFSET(data!$J$12,AF85,1)<>\"\",\" [\"&OFFSET(data!$J$12,AF85,1)&\"]\",\"\"))","v":""}]
[null,null,"SPECIAL RULES",{"$nulls":6},{"$f":"IF(OFFSET(weapon5,0,9)=\"\",\"\",OFFSET(weapon5,0,9))","v":""}]
[null,null,"SPECIAL RULES",{"$nulls":28},5,{"$f":"IF(OFFSET(data!$J$12,AF87,0)=\"\",\"\",OFFSET(data!$J$12,AF87,0)&IF(OFFSET(data!$J$12,AF87,1)<>\"\",\" [\"&OFFSET(data!$J$12,AF87,1)&\"]\",\"\"))","v":""}]
[]
[{"$nulls":31},6,{"$f":"IF(OFFSET(data!$J$12,AF89,0)=\"\",\"\",OFFSET(data!$J$12,AF89,0)&IF(OFFSET(data!$J$12,AF89,1)<>\"\",\" [\"&OFFSET(data!$J$12,AF89,1)&\"]\",\"\"))","v":""}]
[null,null,"WEAPON"]
[{"$nulls":31},7,{"$f":"IF(OFFSET(data!$J$12,AF91,0)=\"\",\"\",OFFSET(data!$J$12,AF91,0)&IF(OFFSET(data!$J$12,AF91,1)<>\"\",\" [\"&OFFSET(data!$J$12,AF91,1)&\"]\",\"\"))","v":""}]
[]
[{"$nulls":31},8,{"$f":"IF(OFFSET(data!$J$12,AF93,0)=\"\",\"\",OFFSET(data!$J$12,AF93,0)&IF(OFFSET(data!$J$12,AF93,1)<>\"\",\" [\"&OFFSET(data!$J$12,AF93,1)&\"]\",\"\"))","v":""},{"$nulls":30},40]
[null,null,"NAME",null,null,{"$f":"IF(weapon6=\"\",\"\",weapon6)","v":""}]
[null,null,"NAME",{"$nulls":28},9,{"$f":"IF(OFFSET(data!$J$12,AF95,0)=\"\",\"\",OFFSET(data!$J$12,AF95,0)&IF(OFFSET(data!$J$12,AF95,1)<>\"\",\" [\"&OFFSET(data!$J$12,AF95,1)&\"]\",\"\"))","v":""},{"$nulls":30},41]
[null,null,"CLASS",null,null,{"$f":"IF(OFFSET(weapon6,0,1)=\"\",\"\",OFFSET(weapon6,0,1))","v":""},{"$nulls":3},"DAMAGE",{"$nulls":3},{"$f":"IF(OFFSET(weapon6,0,4)=\"\",\"\",OFFSET(weapon6,0,4))","v":""},{"$nulls":4},"TYPE",null,null,{"$f":"IF(OFFSET(weapon6,0,5)=\"\",\"\",OFFSET(weapon6,0,5))","v":""},null,null,"PEN",null,{"$f":"IF(OFFSET(weapon6,0,6)=\"\",\"\",OFFSET(weapon6,0,6))","v":""}]
[null,null,"CLASS",{"$nulls":6},"DAMAGE",{"$nulls":8},"TYPE",{"$nulls":5},"PEN",{"$nulls":6},10,{"$f":"IF(OFFSET(data!$J$12,AF97,0)=\"\",\"\",OFFSET(data!$J$12,AF97,0)&IF(OFFSET(data!$J$12,AF97,1)<>\"\",\" [\"&OFFSET(data!$J$12,AF97,1)&\"]\",\"\"))","v":""},{"$nulls":30},42]
[null,null,"RANGE",null,null,{"$f":"IF(OFFSET(weapon6,0,2)=\"\",\"\",OFFSET(weapon6,0,2))","v":""},{"$nulls":3},"ROF",null,{"$f":"IF(OFFSET(weapon6,0,3)=\"\",\"\",OFFSET(weapon6,0,3))","v":""},{"$nulls":5},"CLIP",{"$nulls":3},{"$f":"IF(OFFSET(weapon6,0,7)=\"\",\"\",OFFSET(weapon6,0,7))","v":""},null,null,"RLD",null,{"$f":"IF(OFFSET(weapon6,0,8)=\"\",\"\",OFFSET(weapon6,0,8))","v":""}]
[null,null,"RANGE",{"$nulls":6},"ROF",{"$nulls":8},"CLIP",{"$nulls":5},"RLD",{"$nulls":6},11,{"$f":"IF(OFFSET(data!$J$12,AF99,0)=\"\",\"\",OFFSET(data!$J$12,AF99,0)&IF(OFFSET(data!$J$12,AF99,1)<>\"\",\" [\"&OFFSET(data!$J$12,AF99,1)&\"]\",\"\"))","v":""},{"$nulls":30},43]
[null,null,"SPECIAL RULES",{"$nulls":6},{"$f":"IF(OFFSET(weapon6,0,9)=\"\",\"\",OFFSET(weapon6,0,9))","v":""}]
[null,null,"SPECIAL RULES",{"$nulls":28},12,{"$f":"IF(OFFSET(data!$J$12,AF101,0)=\"\",\"\",OFFSET(data!$J$12,AF101,0)&IF(OFFSET(data!$J$12,AF101,1)<>\"\",\" [\"&OFFSET(data!$J$12,AF101,1)&\"]\",\"\"))","v":""},{"$nulls":30},44]
[]
[{"$nulls":31},13,{"$f":"IF(OFFSET(data!$J$12,AF103,0)=\"\",\"\",OFFSET(data!$J$12,AF103,0)&IF(OFFSET(data!$J$12,AF103,1)<>\"\",\" [\"&OFFSET(data!$J$12,AF103,1)&\"]\",\"\"))","v":""},{"$nulls":30},45]
[]
[{"$nulls":31},14,{"$f":"IF(OFFSET(data!$J$12,AF105,0)=\"\",\"\",OFFSET(data!$J$12,AF105,0)&IF(OFFSET(data!$J$12,AF105,1)<>\"\",\" [\"&OFFSET(data!$J$12,AF105,1)&\"]\",\"\"))","v":""},{"$nulls":30},46]
[]
[null,null,"GEAR",{"$nulls":28},15,{"$f":"IF(OFFSET(data!$J$12,AF107,0)=\"\",\"\",OFFSET(data!$J$12,AF107,0)&IF(OFFSET(data!$J$12,AF107,1)<>\"\",\" [\"&OFFSET(data!$J$12,AF107,1)&\"]\",\"\"))","v":""},{"$nulls":30},47]
[]
[{"$nulls":31},16,{"$f":"IF(OFFSET(data!$J$12,AF109,0)=\"\",\"\",OFFSET(data!$J$12,AF109,0)&IF(OFFSET(data!$J$12,AF109,1)<>\"\",\" [\"&OFFSET(data!$J$12,AF109,1)&\"]\",\"\"))","v":""},{"$nulls":30},48]
[]
[null,1,{"$f":"IF(OFFSET(data!$N$35,B111,0)=\"\",\"\",OFFSET(data!$N$35,B111,0))","v":""},{"$nulls":13},17,{"$f":"IF(OFFSET(data!$N$35,Q111,0)=\"\",\"\",OFFSET(data!$N$35,Q111,0))","v":""},{"$nulls":13},17,{"$f":"IF(OFFSET(data!$J$12,AF111,0)=\"\",\"\",OFFSET(data!$J$12,AF111,0)&IF(OFFSET(data!$J$12,AF111,1)<>\"\",\" [\"&OFFSET(data!$J$12,AF111,1)&\"]\",\"\"))","v":""},{"$nulls":30},49]
[]
[null,2,{"$f":"IF(OFFSET(data!$N$35,B113,0)=\"\",\"\",OFFSET(data!$N$35,B113,0))","v":""},{"$nulls":13},18,{"$f":"IF(OFFSET(data!$N$35,Q113,0)=\"\",\"\",OFFSET(data!$N$35,Q113,0))","v":""},{"$nulls":13},18,{"$f":"IF(OFFSET(data!$J$12,AF113,0)=\"\",\"\",OFFSET(data!$J$12,AF113,0)&IF(OFFSET(data!$J$12,AF113,1)<>\"\",\" [\"&OFFSET(data!$J$12,AF113,1)&\"]\",\"\"))","v":""},{"$nulls":30},50]
[]
[null,3,{"$f":"IF(OFFSET(data!$N$35,B115,0)=\"\",\"\",OFFSET(data!$N$35,B115,0))","v":""},{"$nulls":13},19,{"$f":"IF(OFFSET(data!$N$35,Q115,0)=\"\",\"\",OFFSET(data!$N$35,Q115,0))","v":""},{"$nulls":13},19,{"$f":"IF(OFFSET(data!$J$12,AF115,0)=\"\",\"\",OFFSET(data!$J$12,AF115,0)&IF(OFFSET(data!$J$12,AF115,1)<>\"\",\" [\"&OFFSET(data!$J$12,AF115,1)&\"]\",\"\"))","v":""},{"$nulls":30},51]
[]
[null,4,{"$f":"IF(OFFSET(data!$N$35,B117,0)=\"\",\"\",OFFSET(data!$N$35,B117,0))","v":""},{"$nulls":13},20,{"$f":"IF(OFFSET(data!$N$35,Q117,0)=\"\",\"\",OFFSET(data!$N$35,Q117,0))","v":""},{"$nulls":13},20,{"$f":"IF(OFFSET(data!$J$12,AF117,0)=\"\",\"\",OFFSET(data!$J$12,AF117,0)&IF(OFFSET(data!$J$12,AF117,1)<>\"\",\" [\"&OFFSET(data!$J$12,AF117,1)&\"]\",\"\"))","v":""},{"$nulls":30},52]
[]
[null,5,{"$f":"IF(OFFSET(data!$N$35,B119,0)=\"\",\"\",OFFSET(data!$N$35,B119,0))","v":""},{"$nulls":13},21,{"$f":"IF(OFFSET(data!$N$35,Q119,0)=\"\",\"\",OFFSET(data!$N$35,Q119,0))","v":""},{"$nulls":13},21,{"$f":"IF(OFFSET(data!$J$12,AF119,0)=\"\",\"\",OFFSET(data!$J$12,AF119,0)&IF(OFFSET(data!$J$12,AF119,1)<>\"\",\" [\"&OFFSET(data!$J$12,AF119,1)&\"]\",\"\"))","v":""},{"$nulls":30},53]
[]
[null,6,{"$f":"IF(OFFSET(data!$N$35,B121,0)=\"\",\"\",OFFSET(data!$N$35,B121,0))","v":""},{"$nulls":13},22,{"$f":"IF(OFFSET(data!$N$35,Q121,0)=\"\",\"\",OFFSET(data!$N$35,Q121,0))","v":""},{"$nulls":13},22,{"$f":"IF(OFFSET(data!$J$12,AF121,0)=\"\",\"\",OFFSET(data!$J$12,AF121,0)&IF(OFFSET(data!$J$12,AF121,1)<>\"\",\" [\"&OFFSET(data!$J$12,AF121,1)&\"]\",\"\"))","v":""},{"$nulls":30},54]
[]
[null,7,{"$f":"IF(OFFSET(data!$N$35,B123,0)=\"\",\"\",OFFSET(data!$N$35,B123,0))","v":""},{"$nulls":13},23,{"$f":"IF(OFFSET(data!$N$35,Q123,0)=\"\",\"\",OFFSET(data!$N$35,Q123,0))","v":""},{"$nulls":13},23,{"$f":"IF(OFFSET(data!$J$12,AF123,0)=\"\",\"\",OFFSET(data!$J$12,AF123,0)&IF(OFFSET(data!$J$12,AF123,1)<>\"\",\" [\"&OFFSET(data!$J$12,AF123,1)&\"]\",\"\"))","v":""},{"$nulls":30},55]
[]
[null,8,{"$f":"IF(OFFSET(data!$N$35,B125,0)=\"\",\"\",OFFSET(data!$N$35,B125,0))","v":""},{"$nulls":13},24,{"$f":"IF(OFFSET(data!$N$35,Q125,0)=\"\",\"\",OFFSET(data!$N$35,Q125,0))","v":""},{"$nulls":13},24,{"$f":"IF(OFFSET(data!$J$12,AF125,0)=\"\",\"\",OFFSET(data!$J$12,AF125,0)&IF(OFFSET(data!$J$12,AF125,1)<>\"\",\" [\"&OFFSET(data!$J$12,AF125,1)&\"]\",\"\"))","v":""},{"$nulls":30},56]
[]
[null,9,{"$f":"IF(OFFSET(data!$N$35,B127,0)=\"\",\"\",OFFSET(data!$N$35,B127,0))","v":""},{"$nulls":13},25,{"$f":"IF(OFFSET(data!$N$35,Q127,0)=\"\",\"\",OFFSET(data!$N$35,Q127,0))","v":""},{"$nulls":13},25,{"$f":"IF(OFFSET(data!$J$12,AF127,0)=\"\",\"\",OFFSET(data!$J$12,AF127,0)&IF(OFFSET(data!$J$12,AF127,1)<>\"\",\" [\"&OFFSET(data!$J$12,AF127,1)&\"]\",\"\"))","v":""},{"$nulls":30},57]
[]
[null,10,{"$f":"IF(OFFSET(data!$N$35,B129,0)=\"\",\"\",OFFSET(data!$N$35,B129,0))","v":""},{"$nulls":13},26,{"$f":"IF(OFFSET(data!$N$35,Q129,0)=\"\",\"\",OFFSET(data!$N$35,Q129,0))","v":""},{"$nulls":13},26,{"$f":"IF(OFFSET(data!$J$12,AF129,0)=\"\",\"\",OFFSET(data!$J$12,AF129,0)&IF(OFFSET(data!$J$12,AF129,1)<>\"\",\" [\"&OFFSET(data!$J$12,AF129,1)&\"]\",\"\"))","v":""},{"$nulls":30},58]
[]
[null,11,{"$f":"IF(OFFSET(data!$N$35,B131,0)=\"\",\"\",OFFSET(data!$N$35,B131,0))","v":""},{"$nulls":13},27,{"$f":"IF(OFFSET(data!$N$35,Q131,0)=\"\",\"\",OFFSET(data!$N$35,Q131,0))","v":""},{"$nulls":13},27,{"$f":"IF(OFFSET(data!$J$12,AF131,0)=\"\",\"\",OFFSET(data!$J$12,AF131,0)&IF(OFFSET(data!$J$12,AF131,1)<>\"\",\" [\"&OFFSET(data!$J$12,AF131,1)&\"]\",\"\"))","v":""},{"$nulls":30},59]
[]
[null,12,{"$f":"IF(OFFSET(data!$N$35,B133,0)=\"\",\"\",OFFSET(data!$N$35,B133,0))","v":""},{"$nulls":13},28,{"$f":"IF(OFFSET(data!$N$35,Q133,0)=\"\",\"\",OFFSET(data!$N$35,Q133,0))","v":""},{"$nulls":13},28,{"$f":"IF(OFFSET(data!$J$12,AF133,0)=\"\",\"\",OFFSET(data!$J$12,AF133,0)&IF(OFFSET(data!$J$12,AF133,1)<>\"\",\" [\"&OFFSET(data!$J$12,AF133,1)&\"]\",\"\"))","v":""},{"$nulls":30},60]
[]
[null,13,{"$f":"IF(OFFSET(data!$N$35,B135,0)=\"\",\"\",OFFSET(data!$N$35,B135,0))","v":""},{"$nulls":13},29,{"$f":"IF(OFFSET(data!$N$35,Q135,0)=\"\",\"\",OFFSET(data!$N$35,Q135,0))","v":""},{"$nulls":13},29,{"$f":"IF(OFFSET(data!$J$12,AF135,0)=\"\",\"\",OFFSET(data!$J$12,AF135,0)&IF(OFFSET(data!$J$12,AF135,1)<>\"\",\" [\"&OFFSET(data!$J$12,AF135,1)&\"]\",\"\"))","v":""},{"$nulls":30},61]
[]
[null,14,{"$f":"IF(OFFSET(data!$N$35,B137,0)=\"\",\"\",OFFSET(data!$N$35,B137,0))","v":""},{"$nulls":13},30,{"$f":"IF(OFFSET(data!$N$35,Q137,0)=\"\",\"\",OFFSET(data!$N$35,Q137,0))","v":""},{"$nulls":13},30,{"$f":"IF(OFFSET(data!$J$12,AF137,0)=\"\",\"\",OFFSET(data!$J$12,AF137,0)&IF(OFFSET(data!$J$12,AF137,1)<>\"\",\" [\"&OFFSET(data!$J$12,AF137,1)&\"]\",\"\"))","v":""},{"$nulls":30},62]
[]
[null,15,{"$f":"IF(OFFSET(data!$N$35,B139,0)=\"\",\"\",OFFSET(data!$N$35,B139,0))","v":""},{"$nulls":13},31,{"$f":"IF(OFFSET(data!$N$35,Q139,0)=\"\",\"\",OFFSET(data!$N$35,Q139,0))","v":""},{"$nulls":13},31,{"$f":"IF(OFFSET(data!$J$12,AF139,0)=\"\",\"\",OFFSET(data!$J$12,AF139,0)&IF(OFFSET(data!$J$12,AF139,1)<>\"\",\" [\"&OFFSET(data!$J$12,AF139,1)&\"]\",\"\"))","v":""},{"$nulls":30},63]
[]
[null,16,{"$f":"IF(OFFSET(data!$N$35,B141,0)=\"\",\"\",OFFSET(data!$N$35,B141,0))","v":""},{"$nulls":13},32,{"$f":"IF(OFFSET(data!$N$35,Q141,0)=\"\",\"\",OFFSET(data!$N$35,Q141,0))","v":""},{"$nulls":13},32,{"$f":"IF(OFFSET(data!$J$12,AF141,0)=\"\",\"\",OFFSET(data!$J$12,AF141,0)&IF(OFFSET(data!$J$12,AF141,1)<>\"\",\" [\"&OFFSET(data!$J$12,AF141,1)&\"]\",\"\"))","v":""},{"$nulls":30},64]
[]
[{"$nulls":31},33,{"$f":"IF(OFFSET(data!$J$12,AF143,0)=\"\",\"\",OFFSET(data!$J$12,AF143,0)&IF(OFFSET(data!$J$12,AF143,1)<>\"\",\" [\"&OFFSET(data!$J$12,AF143,1)&\"]\",\"\"))","v":""},{"$nulls":30},65]
[]
[null,null,"PSYCHIC POWERS",{"$nulls":28},34,{"$f":"IF(OFFSET(data!$J$12,AF145,0)=\"\",\"\",OFFSET(data!$J$12,AF145,0)&IF(OFFSET(data!$J$12,AF145,1)<>\"\",\" [\"&OFFSET(data!$J$12,AF145,1)&\"]\",\"\"))","v":""},{"$nulls":30},66]
[]
[{"$nulls":31},35,{"$f":"IF(OFFSET(data!$J$12,AF147,0)=\"\",\"\",OFFSET(data!$J$12,AF147,0)&IF(OFFSET(data!$J$12,AF147,1)<>\"\",\" [\"&OFFSET(data!$J$12,AF147,1)&\"]\",\"\"))","v":""},{"$nulls":30},67]
[]
[null,null,"Psy Rating:",{"$nulls":6},{"$f":"IF(psyrating<1,\"\",psyrating)","v":""},{"$nulls":6},11,{"$f":"IF(OFFSET(data!$N$12,Q149,0)=\"\",\"\",OFFSET(data!$N$12,Q149,0))","v":""},{"$nulls":13},36,{"$f":"IF(OFFSET(data!$J$12,AF149,0)=\"\",\"\",OFFSET(data!$J$12,AF149,0)&IF(OFFSET(data!$J$12,AF149,1)<>\"\",\" [\"&OFFSET(data!$J$12,AF149,1)&\"]\",\"\"))","v":""},{"$nulls":30},68]
[]
[null,1,{"$f":"IF(OFFSET(data!$N$12,B151,0)=\"\",\"\",OFFSET(data!$N$12,B151,0))","v":""},{"$nulls":13},12,{"$f":"IF(OFFSET(data!$N$12,Q151,0)=\"\",\"\",OFFSET(data!$N$12,Q151,0))","v":""},{"$nulls":13},37,{"$f":"IF(OFFSET(data!$J$12,AF151,0)=\"\",\"\",OFFSET(data!$J$12,AF151,0)&IF(OFFSET(data!$J$12,AF151,1)<>\"\",\" [\"&OFFSET(data!$J$12,AF151,1)&\"]\",\"\"))","v":""},{"$nulls":30},69]
[]
[null,2,{"$f":"IF(OFFSET(data!$N$12,B153,0)=\"\",\"\",OFFSET(data!$N$12,B153,0))","v":""},{"$nulls":13},13,{"$f":"IF(OFFSET(data!$N$12,Q153,0)=\"\",\"\",OFFSET(data!$N$12,Q153,0))","v":""},{"$nulls":13},38,{"$f":"IF(OFFSET(data!$J$12,AF153,0)=\"\",\"\",OFFSET(data!$J$12,AF153,0)&IF(OFFSET(data!$J$12,AF153,1)<>\"\",\" [\"&OFFSET(data!$J$12,AF153,1)&\"]\",\"\"))","v":""},{"$nulls":30},70]
[]
[null,3,{"$f":"IF(OFFSET(data!$N$12,B155,0)=\"\",\"\",OFFSET(data!$N$12,B155,0))","v":""},{"$nulls":13},14,{"$f":"IF(OFFSET(data!$N$12,Q155,0)=\"\",\"\",OFFSET(data!$N$12,Q155,0))","v":""},{"$nulls":13},39,{"$f":"IF(OFFSET(data!$J$12,AF155,0)=\"\",\"\",OFFSET(data!$J$12,AF155,0)&IF(OFFSET(data!$J$12,AF155,1)<>\"\",\" [\"&OFFSET(data!$J$12,AF155,1)&\"]\",\"\"))","v":""},{"$nulls":30},71]
[]
[null,4,{"$f":"IF(OFFSET(data!$N$12,B157,0)=\"\",\"\",OFFSET(data!$N$12,B157,0))","v":""},{"$nulls":13},15,{"$f":"IF(OFFSET(data!$N$12,Q157,0)=\"\",\"\",OFFSET(data!$N$12,Q157,0))","v":""},{"$nulls":13},40,{"$f":"IF(OFFSET(data!$J$12,AF157,0)=\"\",\"\",OFFSET(data!$J$12,AF157,0)&IF(OFFSET(data!$J$12,AF157,1)<>\"\",\" [\"&OFFSET(data!$J$12,AF157,1)&\"]\",\"\"))","v":""},{"$nulls":30},72]
[]
[null,5,{"$f":"IF(OFFSET(data!$N$12,B159,0)=\"\",\"\",OFFSET(data!$N$12,B159,0))","v":""},{"$nulls":13},16,{"$f":"IF(OFFSET(data!$N$12,Q159,0)=\"\",\"\",OFFSET(data!$N$12,Q159,0))","v":""},{"$nulls":13},41,{"$f":"IF(OFFSET(data!$J$12,AF159,0)=\"\",\"\",OFFSET(data!$J$12,AF159,0)&IF(OFFSET(data!$J$12,AF159,1)<>\"\",\" [\"&OFFSET(data!$J$12,AF159,1)&\"]\",\"\"))","v":""},{"$nulls":30},73]
[]
[null,6,{"$f":"IF(OFFSET(data!$N$12,B161,0)=\"\",\"\",OFFSET(data!$N$12,B161,0))","v":""},{"$nulls":13},17,{"$f":"IF(OFFSET(data!$N$12,Q161,0)=\"\",\"\",OFFSET(data!$N$12,Q161,0))","v":""},{"$nulls":13},42,{"$f":"IF(OFFSET(data!$J$12,AF161,0)=\"\",\"\",OFFSET(data!$J$12,AF161,0)&IF(OFFSET(data!$J$12,AF161,1)<>\"\",\" [\"&OFFSET(data!$J$12,AF161,1)&\"]\",\"\"))","v":""},{"$nulls":30},74]
[]
[null,7,{"$f":"IF(OFFSET(data!$N$12,B163,0)=\"\",\"\",OFFSET(data!$N$12,B163,0))","v":""},{"$nulls":13},18,{"$f":"IF(OFFSET(data!$N$12,Q163,0)=\"\",\"\",OFFSET(data!$N$12,Q163,0))","v":""},{"$nulls":13},43,{"$f":"IF(OFFSET(data!$J$12,AF163,0)=\"\",\"\",OFFSET(data!$J$12,AF163,0)&IF(OFFSET(data!$J$12,AF163,1)<>\"\",\" [\"&OFFSET(data!$J$12,AF163,1)&\"]\",\"\"))","v":""},{"$nulls":30},75]
[]
[null,8,{"$f":"IF(OFFSET(data!$N$12,B165,0)=\"\",\"\",OFFSET(data!$N$12,B165,0))","v":""},{"$nulls":13},19,{"$f":"IF(OFFSET(data!$N$12,Q165,0)=\"\",\"\",OFFSET(data!$N$12,Q165,0))","v":""},{"$nulls":13},44,{"$f":"IF(OFFSET(data!$J$12,AF165,0)=\"\",\"\",OFFSET(data!$J$12,AF165,0)&IF(OFFSET(data!$J$12,AF165,1)<>\"\",\" [\"&OFFSET(data!$J$12,AF165,1)&\"]\",\"\"))","v":""},{"$nulls":30},76]
[]
[null,9,{"$f":"IF(OFFSET(data!$N$12,B167,0)=\"\",\"\",OFFSET(data!$N$12,B167,0))","v":""},{"$nulls":13},20,{"$f":"IF(OFFSET(data!$N$12,Q167,0)=\"\",\"\",OFFSET(data!$N$12,Q167,0))","v":""},{"$nulls":13},45,{"$f":"IF(OFFSET(data!$J$12,AF167,0)=\"\",\"\",OFFSET(data!$J$12,AF167,0)&IF(OFFSET(data!$J$12,AF167,1)<>\"\",\" [\"&OFFSET(data!$J$12,AF167,1)&\"]\",\"\"))","v":""},{"$nulls":30},77]
[]
[null,10,{"$f":"IF(OFFSET(data!$N$12,B169,0)=\"\",\"\",OFFSET(data!$N$12,B169,0))","v":""},{"$nulls":13},21,{"$f":"IF(OFFSET(data!$N$12,Q169,0)=\"\",\"\",OFFSET(data!$N$12,Q169,0))","v":""},{"$nulls":13},46,{"$f":"IF(OFFSET(data!$J$12,AF169,0)=\"\",\"\",OFFSET(data!$J$12,AF169,0)&IF(OFFSET(data!$J$12,AF169,1)<>\"\",\" [\"&OFFSET(data!$J$12,AF169,1)&\"]\",\"\"))","v":""},{"$nulls":30},78]
[]
[null,{"$f":"strversion","v":"Version: 0.5 r7 [16/12/2013]"}]

{"sheet":"Chapter","index":5,"n_rows":32,"n_cols":5,"rows_kept":32}
[]
[null,"SECTION","QUESTION","RESULT","ROLL"]
[null,"ORIGINS","1: Why Was The Chapter Founded?"]
[null,null,"2: When Was The Chapter Founded?"]
[null,"GENE-SEED","3: Progenitor"]
[null,null,"4: Gene-stock Purity"]
[null,null,"5: Codex Demeanours"]
[null,null,"6: Chance of Gene-seed Mutation"]
[null,null,"7: Gene-seed Deficiencies"]
[null,null,"8: Chapter Flaw"]
[null,null,"9: Missing or Inactive Zygotes"]
[null,null,"10: Chapter Characteristic Modifiers"]
[null,"FOUNDING FATHERS","11: Figures of Legend"]
[null,null,"12: Deeds of Legend"]
[null,"HOME WORLD","13: Chapter Home World Category"]
[null,"HOME WORLD PREDOMINANT TERRAIN","14: Chapter Home World Terrain"]
[null,"RELATIONSHIP WITH HOME WORLD","15: Home World Relationship"]
[null,"ORGANISATION","16: Ultramarines Successor Chapter Organisation"]
[null,null,"17: Other Successor Chapter Organisation"]
[null,"COMBAT DOCTRINE","18: Combat Doctrine"]
[null,"SOLO MODE ABILITIES","19: Solo Mode Abilities"]
[null,"SQUAD MODE ABILITIES","20: Squad Mode Attack Patterns"]
[null,null,"21: Squad Mode Defensive Patterns"]
[null,"SPECIALTY RESTRICTIONS","22: Specialty Restrictions"]
[null,"SPECIAL EQUIPMENT","23: Special Equipment"]
[null,"BELIEFS","24: Chapter Beliefs"]
[null,"CURRENT STATUS","25: Chapter Status"]
[null,"FRIENDS AND ENEMIES","26: Chapter Friends"]
[null,null,"27: Chapter Enemies"]
[null,"CHAPTER NAME","28: Chapter Name Adjectives"]
[null,null,"29: Chapter Name Nouns"]
[null,"CUSTOM CHAPTER ADVANCE TABLES","30: Custom Chapter Advance Tables"]

{"sheet":"data","index":6,"n_rows":74,"n_cols":26,"rows_kept":74,"hidden":true}
["CHARACTERISTICS",null,"Bonus","MOD","i","c","a",null,"Unnatural Bonus","e","d"]
["WS",30,3,0,0,0,0,null,1,0,0,null,"ARMOUR",{"$nulls":3},"WEAPONS"]
["BS",30,3,0,0,0,0,null,1,0,0,null,"Head",{"$nulls":3},"Name","Class","Range","RoF","Dmg","Type","Pen","Clip","Rld","Special"]
["S",30,3,0,0,0,0,null,1,0,0,null,"Body"]
["T",30,3,0,0,0,0,null,1,0,0,null,"R.Arm"]
["Ag",30,3,0,0,0,0,null,1,0,0,null,"L.Arm"]
["Int",30,3,0,0,0,0,null,1,0,0,null,"R.Leg"]
["Per",30,3,0,0,0,0,null,1,0,0,null,"L.Leg"]
["WP",30,3,0,0,0,0,null,1,0,0]
["Fel",30,3,0,0,0,0,null,1,0,0]
[]
["Generated Characteristic",false,"Print Weapons",false,"Power Armour",false,"Trauma5",false,"CHOSEN TALENTS & TRAITS",{"$nulls":3},"PSYCHIC POWERS"]
["Reroll Characterstic",false,"Personal Demeanour",false,"Trauma1",false,"Deed",false,1,{"$nulls":3},1,{"$nulls":5},"Ciphers1","Ciphers (any)"]
["UMCharMod",false,"Past Event",false,"Trauma2",false,"No Trapping",false,2,{"$nulls":3},2,{"$nulls":5},"Ciphers2","Ciphers (any)"]
["Wounds",false,"PA History",false,"Trauma3",false,"IgnoreRenown",false,3,{"$nulls":3},3,{"$nulls":5},"Ciphers3","Ciphers (any)"]
["Fate",false,"Hide Prereq",false,"Trauma4",false,"Optional Weapons",false,4,{"$nulls":3},4,{"$nulls":5},"Ciphers4","Ciphers (any)"]
[{"$nulls":4},1,2,null,null,5,{"$nulls":3},5,{"$nulls":5},"Ciphers5","Ciphers (any)"]
["Chapter",null,null,"UMCharMod",null,null,"Cust Chap",false,6,{"$nulls":3},6,{"$nulls":5},"CommonLore1","Lore: Common (any)"]
["Successor Chapter",null,null,"ChapAdv",null,null,"Restriction1",null,7,{"$nulls":3},7,{"$nulls":5},"CommonLore2","Lore: Common (any)"]
["Specialty",null,null,"Psy Rating",0,null,"Restriction2",null,8,{"$nulls":3},8,{"$nulls":5},"CommonLore3","Lore: Common (any)"]
[{"$nulls":8},9,{"$nulls":3},9,{"$nulls":5},"CommonLore4","Lore: Common (any)"]
[null,null,"i","c","a","d",null,null,10,{"$nulls":3},10,{"$nulls":5},"CommonLore5","Lore: Common (any)"]
["Wounds",18,0,0,0,0,null,null,11,{"$nulls":3},11,{"$nulls":5},"Drive1","Drive (any)"]
["Fate",0,0,null,null,0,null,null,12,{"$nulls":3},12,{"$nulls":5},"Drive2","Drive (any)"]
[null,"Half","Full","Charge","Run",{"$nulls":3},13,{"$nulls":3},13,{"$nulls":5},"Drive3","Drive (any)"]
["Movement",3,6,9,18,{"$nulls":3},14,{"$nulls":3},14,{"$nulls":5},"Drive4","Drive (any)"]
["Insanity",0,{"$nulls":6},15,{"$nulls":3},15,{"$nulls":5},"Drive5","Drive (any)"]
["Corruption",0,{"$nulls":6},16,{"$nulls":3},16,{"$nulls":5},"ForbiddenLore1","Lore: Forbidden (any)"]
["Primarch's Curse",{"$nulls":7},17,{"$nulls":3},17,{"$nulls":5},"ForbiddenLore2","Lore: Forbidden (any)"]
["Battle Trauma",{"$nulls":7},18,{"$nulls":3},18,{"$nulls":5},"ForbiddenLore3","Lore: Forbidden (any)"]
[{"$nulls":8},19,{"$nulls":3},19,{"$nulls":5},"ForbiddenLore4","Lore: Forbidden (any)"]
["XP",13000,null,"Renown",0,{"$nulls":3},20,{"$nulls":3},20,{"$nulls":5},"ForbiddenLore5","Lore: Forbidden (any)"]
["XP Spent",12000,null,"Renown Rank",{"$nulls":4},21,{"$nulls":3},21,{"$nulls":5},"Navigation1","Navigation (any)"]
["XP Left",1000,null,"Req Spent",0,{"$nulls":3},22,{"$nulls":9},"Navigation2","Navigation (any)"]
["Rank",0,{"$nulls":6},23,{"$nulls":3},"GEAR",{"$nulls":5},"Navigation3","Navigation (any)"]
[{"$nulls":8},24,{"$nulls":3},1,null,null,"Chapter Trapping",null,null,"Navigation4","Navigation (any)"]
["Character Name",{"$nulls":7},25,{"$nulls":3},2,null,null,"Signature Wargear",0,null,"Navigation5","Navigation (any)"]
["Player Name",{"$nulls":7},26,{"$nulls":3},3,null,null,"Signature Wargear (Master)",0,null,"Performer1","Performer (any)"]
["Chapter Demeanour",{"$nulls":7},27,{"$nulls":3},4,{"$nulls":5},"Performer2","Performer (any)"]
["Personal Demeanour",{"$nulls":7},28,{"$nulls":3},5,{"$nulls":5},"Performer3","Performer (any)"]
["Past Event",{"$nulls":7},29,{"$nulls":3},6,{"$nulls":5},"Performer4","Performer (any)"]
["PA Hisory Count",0,{"$nulls":6},30,{"$nulls":3},7,{"$nulls":5},"Performer5","Performer (any)"]
["PA Hisory Max",0,{"$nulls":6},31,{"$nulls":3},8,{"$nulls":5},"Pilot1","Pilot (any)"]
["PA History1",null,"PA Table1","NA1",{"$nulls":4},32,{"$nulls":3},9,{"$nulls":5},"Pilot2","Pilot (any)"]
["PA History2",null,"PA Table2","NA2",{"$nulls":4},33,{"$nulls":3},10,{"$nulls":5},"Pilot3","Pilot (any)"]
["PA History3",null,"PA Table3","NA3",{"$nulls":4},34,{"$nulls":3},11,{"$nulls":5},"Pilot4","Pilot (any)"]
["PA History4",null,"PA Table4","NA4",{"$nulls":4},35,{"$nulls":3},12,{"$nulls":5},"Pilot5","Pilot (any)"]
["PA History Effects",{"$nulls":7},36,{"$nulls":3},13,{"$nulls":5},"ScholasticLore1","Lore: Scholastic (any)"]
["Description",{"$nulls":7},37,{"$nulls":3},14,{"$nulls":5},"ScholasticLore2","Lore: Scholastic (any)"]
["Special Ability",{"$nulls":7},38,{"$nulls":3},15,{"$nulls":5},"ScholasticLore3","Lore: Scholastic (any)"]
["Deed",{"$nulls":7},39,{"$nulls":3},16,{"$nulls":5},"ScholasticLore4","Lore: Scholastic (any)"]
["Craftsmanship","Standard",{"$nulls":6},40,{"$nulls":3},17,{"$nulls":5},"ScholasticLore5","Lore: Scholastic (any)"]
[{"$nulls":8},41,{"$nulls":3},18,{"$nulls":5},"SpeakLanguage1","Speak Language (any)"]
["Advanced Specialties",null,"PA History Effects",false,{"$nulls":4},42,{"$nulls":3},19,{"$nulls":5},"SpeakLanguage2","Speak Language (any)"]
["Black Shield",false,"Ignore Req",false,{"$nulls":4},43,{"$nulls":3},20,{"$nulls":5},"SpeakLanguage3","Speak Language (any)"]
["Champion",false,"Adv Spec",{"$nulls":5},44,{"$nulls":3},21,{"$nulls":5},"SpeakLanguage4","Speak Language (any)"]
["Chaplain",false,{"$nulls":6},45,{"$nulls":3},22,{"$nulls":5},"SpeakLanguage5","Speak Language (any)"]
["Dreadnaught",false,{"$nulls":6},46,{"$nulls":3},23,{"$nulls":5},"Tactics1","Tactics (any)"]
["Epistolary",false,{"$nulls":6},47,{"$nulls":3},24,{"$nulls":5},"Tactics2","Tactics (any)"]
["Forge Master",false,{"$nulls":6},48,{"$nulls":3},25,{"$nulls":5},"Tactics3","Tactics (any)"]
["Keeper",false,{"$nulls":6},49,{"$nulls":3},26,{"$nulls":5},"Tactics4","Tactics (any)"]
["Kill-marine",false,{"$nulls":6},50,{"$nulls":3},27,{"$nulls":5},"Tactics5","Tactics (any)"]
["Watch Captain",false,{"$nulls":6},51,{"$nulls":3},28,{"$nulls":5},"Trade1","Trade (any)"]
["First Company Veteran",false,{"$nulls":6},52,{"$nulls":3},29,{"$nulls":5},"Trade2","Trade (any)"]
[{"$nulls":8},53,{"$nulls":3},30,{"$nulls":5},"Trade3","Trade (any)"]
["Notes",{"$nulls":7},54,{"$nulls":3},31,{"$nulls":5},"Trade4","Trade (any)"]
["Version Number",0.5,{"$nulls":6},55,{"$nulls":3},32,{"$nulls":5},"Trade5","Trade (any)"]
["Release Number",6,{"$nulls":6},56]
["Release Date","2013-12-16",{"$nulls":6},57]
["Version","Version: 0.5 r7 [16/12/2013]",{"$nulls":6},58]
["Distinctions",{"$nulls":7},59]
[{"$nulls":8},60]
[{"$nulls":8},61]
[{"$nulls":8},62]

{"sheet":"adv","index":7,"n_rows":1,"n_cols":7,"rows_kept":1,"hidden":true}
["Advancement","Cost","Table","Rank","Type","Group","Skill"]

{"sheet":"gear","index":8,"n_rows":1,"n_cols":22,"rows_kept":1,"hidden":true}
["Name","Craftsmanship","Cost","Quanity","Cat1","Cat2","Stats","Stats","Stats","Stats","Stats","Stats","Stats","Stats","Stats","Stats","Stats","Stats","Stats","Stats","Stats","Stats"]

{"sheet":"cust_groups","index":9,"n_rows":1,"n_cols":8,"rows_kept":1,"hidden":true}
["Group","Skill","Cost","Type","Prerequisites","PreReq","Chosen","Print"]

{"sheet":"cust_chap","index":10,"n_rows":1,"n_cols":12,"rows_kept":1,"hidden":true}
["Chapter Name","Progenitor","CharMod1","CharMod2","Restiction1","Restriction2","NOT USED","NOT USED","NOT USED","NOT USED","Adv Tbl","ChapDemeanour"]

{"sheet":"adv_lst","index":11,"n_rows":1007,"n_cols":20,"rows_kept":1007,"hidden":true}
["Table","Advance","Cost","Type","Prerequisites","Rank","PreReq","Group","Chosen","Dreadnaught","Validation",{"$nulls":3},"Cost"]
[{"$f":"specialty","v":0},"Agility (simple)",{"$f":"IF(A2=0,0,VLOOKUP(B2,tbl_adv_cha,MATCH(A2,hdr_adv_cha,0),FALSE))","v":0},"Characteristic",null,0,true,false,{"$f":"AND(COUNTIF(adv!A:A,B2))","v":false},false,{"$f":"COUNTIF(elite_adv!A:A,B2)","v":1},null,null,"Advance","Deathwatch Apothecary","Deathwatch Assault Marine","Deathwatch Devastator Marine","Deathwatch Librarian","Deathwatch Tactical Marine","Deathwatch Techmarine"]
[0,"Agility (intermediate)",{"$f":"IF(A3=0,0,VLOOKUP(B3,tbl_adv_cha,MATCH(A3,hdr_adv_cha,0),FALSE))","v":0},"Characteristic","Agility (simple)",0,{"$f":"AND(COUNTIF(adv!A:A,E3))","v":false},false,{"$f":"AND(COUNTIF(adv!A:A,B3))","v":false},false,{"$f":"COUNTIF(elite_adv!A:A,B3)","v":1},null,null,"Weapon Skill (simple)",200,200,750,200,500,500]
[0,"Agility (trained)",0,"Characteristic","Agility (intermediate)",0,{"$f":"AND(COUNTIF(adv!A:A,E4))","v":false},false,{"$f":"AND(COUNTIF(adv!A:A,B4))","v":false},false,{"$f":"COUNTIF(elite_adv!A:A,B4)","v":1},null,null,"Weapon Skill (intermediate)",500,500,1000,500,1000,1000]
[0,"Agility (expert)",0,"Characteristic","Agility (trained)",0,{"$f":"AND(COUNTIF(adv!A:A,E5))","v":false},false,{"$f":"AND(COUNTIF(adv!A:A,B5))","v":false},false,{"$f":"COUNTIF(elite_adv!A:A,B5)","v":1},null,null,"Weapon Skill (trained)",1000,1000,2000,1000,1500,1500]
[0,"Ballistic Skill (simple)",0,"Characteristic",null,0,true,false,{"$f":"AND(COUNTIF(adv!A:A,B6))","v":false},false,{"$f":"COUNTIF(elite_adv!A:A,B6)","v":1},null,null,"Weapon Skill (expert)",1500,1500,5000,1500,2000,2000]
[0,"Ballistic Skill (intermediate)",0,"Characteristic","Ballistic Skill (simple)",0,{"$f":"AND(COUNTIF(adv!A:A,E7))","v":false},false,{"$f":"AND(COUNTIF(adv!A:A,B7))","v":false},false,{"$f":"COUNTIF(elite_adv!A:A,B7)","v":1},null,null,"Ballistic Skill (simple)",500,750,200,750,500,500]
[0,"Ballistic Skill (trained)",0,"Characteristic","Ballistic Skill (intermediate)",0,{"$f":"AND(COUNTIF(adv!A:A,E8))","v":false},false,{"$f":"AND(COUNTIF(adv!A:A,B8))","v":false},false,{"$f":"COUNTIF(elite_adv!A:A,B8)","v":1},null,null,"Ballistic Skill (intermediate)",1000,1000,500,1000,1000,1000]
[0,"Ballistic Skill (expert)",0,"Characteristic","Ballistic Skill (trained)",0,{"$f":"AND(COUNTIF(adv!A:A,E9))","v":false},false,{"$f":"AND(COUNTIF(adv!A:A,B9))","v":false},false,{"$f":"COUNTIF(elite_adv!A:A,B9)","v":1},null,null,"Ballistic Skill (trained)",1500,2000,1000,2000,1500,1500]
[0,"Fellowship (simple)",0,"Characteristic",null,0,true,false,{"$f":"AND(COUNTIF(adv!A:A,B10))","v":false},false,{"$f":"COUNTIF(elite_adv!A:A,B10)","v":1},null,null,"Ballistic Skill (expert)",2000,5000,1500,5000,2000,2000]
[0,"Fellowship (intermediate)",0,"Characteristic","Fellowship (simple)",0,{"$f":"AND(COUNTIF(adv!A:A,E11))","v":false},false,{"$f":"AND(COUNTIF(adv!A:A,B11))","v":false},false,{"$f":"COUNTIF(elite_adv!A:A,B11)","v":1},null,null,"Strength (simple)",500,200,200,500,500,200]
[0,"Fellowship (trained)",0,"Characteristic","Fellowship (intermediate)",0,{"$f":"AND(COUNTIF(adv!A:A,E12))","v":false},false,{"$f":"AND(COUNTIF(adv!A:A,B12))","v":false},false,{"$f":"COUNTIF(elite_adv!A:A,B12)","v":1},null,null,"Strength (intermediate)",1000,500,500,1000,1000,500]
[0,"Fellowship (expert)",0,"Characteristic","Fellowship (trained)",0,{"$f":"AND(COUNTIF(adv!A:A,E13))","v":false},false,{"$f":"AND(COUNTIF(adv!A:A,B13))","v":false},false,{"$f":"COUNTIF(elite_adv!A:A,B13)","v":1},null,null,"Strength (trained)",1500,1000,1000,1500,1500,1000]
[0,"Intelligence (simple)",0,"Characteristic",null,0,true,false,{"$f":"AND(COUNTIF(adv!A:A,B14))","v":false},false,{"$f":"COUNTIF(elite_adv!A:A,B14)","v":1},null,null,"Strength (expert)",2000,1500,1500,2000,2000,1500]
[0,"Intelligence (intermediate)",0,"Characteristic","Intelligence (simple)",0,{"$f":"AND(COUNTIF(adv!A:A,E15))","v":false},false,{"$f":"AND(COUNTIF(adv!A:A,B15))","v":false},false,{"$f":"COUNTIF(elite_adv!A:A,B15)","v":1},null,null,"Toughness (simple)",500,500,500,500,500,200]
[0,"Intelligence (trained)",0,"Characteristic","Intelligence (intermediate)",0,{"$f":"AND(COUNTIF(adv!A:A,E16))","v":false},false,{"$f":"AND(COUNTIF(adv!A:A,B16))","v":false},false,{"$f":"COUNTIF(elite_adv!A:A,B16)","v":1},null,null,"Toughness (intermediate)",1000,1000,1000,1000,1000,500]
[0,"Intelligence (expert)",0,"Characteristic","Intelligence (trained)",0,{"$f":"AND(COUNTIF(adv!A:A,E17))","v":false},false,{"$f":"AND(COUNTIF(adv!A:A,B17))","v":false},false,{"$f":"COUNTIF(elite_adv!A:A,B17)","v":1},null,null,"Toughness (trained)",1500,1500,1500,1500,1500,1000]
[0,"Perception (simple)",0,"Characteristic",null,0,true,false,{"$f":"AND(COUNTIF(adv!A:A,B18))","v":false},false,{"$f":"COUNTIF(elite_adv!A:A,B18)","v":1},null,null,"Toughness (expert)",2000,2000,2000,2000,2000,1500]
[0,"Perception (intermediate)",0,"Characteristic","Perception (simple)",0,{"$f":"AND(COUNTIF(adv!A:A,E19))","v":false},false,{"$f":"AND(COUNTIF(adv!A:A,B19))","v":false},false,{"$f":"COUNTIF(elite_adv!A:A,B19)","v":1},null,null,"Agility (simple)",500,200,750,750,500,750]
[0,"Perception (trained)",0,"Characteristic","Perception (intermediate)",0,{"$f":"AND(COUNTIF(adv!A:A,E20))","v":false},false,{"$f":"AND(COUNTIF(adv!A:A,B20))","v":false},false,{"$f":"COUNTIF(elite_adv!A:A,B20)","v":1},null,null,"Agility (intermediate)",1000,500,1000,1000,1000,1000]
[0,"Perception (expert)",0,"Characteristic","Perception (trained)",0,{"$f":"AND(COUNTIF(adv!A:A,E21))","v":false},false,{"$f":"AND(COUNTIF(adv!A:A,B21))","v":false},false,{"$f":"COUNTIF(elite_adv!A:A,B21)","v":1},null,null,"Agility (trained)",1500,1000,2000,2000,1500,2000]
[0,"Strength (simple)",0,"Characteristic",null,0,true,false,{"$f":"AND(COUNTIF(adv!A:A,B22))","v":false},false,{"$f":"COUNTIF(elite_adv!A:A,B22)","v":1},null,null,"Agility (expert)",2000,1500,5000,5000,2000,5000]
[0,"Strength (intermediate)",0,"Characteristic","Strength (simple)",0,{"$f":"AND(COUNTIF(adv!A:A,E23))","v":false},false,{"$f":"AND(COUNTIF(adv!A:A,B23))","v":false},false,{"$f":"COUNTIF(elite_adv!A:A,B23)","v":1},null,null,"Intelligence (simple)",200,750,750,200,500,200]
[0,"Strength (trained)",0,"Characteristic","Strength (intermediate)",0,{"$f":"AND(COUNTIF(adv!A:A,E24))","v":false},false,{"$f":"AND(COUNTIF(adv!A:A,B24))","v":false},false,{"$f":"COUNTIF(elite_adv!A:A,B24)","v":1},null,null,"Intelligence (intermediate)",500,1000,1000,500,1000,500]
[0,"Strength (expert)",0,"Characteristic","Strength (trained)",0,{"$f":"AND(COUNTIF(adv!A:A,E25))","v":false},false,{"$f":"AND(COUNTIF(adv!A:A,B25))","v":false},false,{"$f":"COUNTIF(elite_adv!A:A,B25)","v":1},null,null,"Intelligence (trained)",1000,2000,2000,1000,1500,1000]
[0,"Toughness (simple)",0,"Characteristic",null,0,true,false,{"$f":"AND(COUNTIF(adv!A:A,B26))","v":false},false,{"$f":"COUNTIF(elite_adv!A:A,B26)","v":1},null,null,"Intelligence (expert)",1500,5000,5000,1500,2000,1500]
[0,"Toughness (intermediate)",0,"Characteristic","Toughness (simple)",0,{"$f":"AND(COUNTIF(adv!A:A,E27))","v":false},false,{"$f":"AND(COUNTIF(adv!A:A,B27))","v":false},false,{"$f":"COUNTIF(elite_adv!A:A,B27)","v":1},null,null,"Perception (simple)",200,200,200,200,500,500]
[0,"Toughness (trained)",0,"Characteristic","Toughness (intermediate)",0,{"$f":"AND(COUNTIF(adv!A:A,E28))","v":false},false,{"$f":"AND(COUNTIF(adv!A:A,B28))","v":false},false,{"$f":"COUNTIF(elite_adv!A:A,B28)","v":1},null,null,"Perception (intermediate)",500,500,500,500,1000,1000]
[0,"Toughness (expert)",0,"Characteristic","Toughness (trained)",0,{"$f":"AND(COUNTIF(adv!A:A,E29))","v":false},false,{"$f":"AND(COUNTIF(adv!A:A,B29))","v":false},false,{"$f":"COUNTIF(elite_adv!A:A,B29)","v":1},null,null,"Perception (trained)",1000,1000,1000,1000,1500,1500]
[0,"Weapon Skill (simple)",{"$f":"IF(A30=0,0,VLOOKUP(B30,tbl_adv_cha,MATCH(A30,hdr_adv_cha,0),FALSE))","v":0},"Characteristic",null,0,true,false,{"$f":"AND(COUNTIF(adv!A:A,B30))","v":false},false,{"$f":"COUNTIF(elite_adv!A:A,B30)","v":1},null,null,"Perception (expert)",1500,1500,1500,1500,2000,2000]
[0,"Weapon Skill (intermediate)",0,"Characteristic","Weapon Skill (simple)",0,{"$f":"AND(COUNTIF(adv!A:A,E31))","v":false},false,{"$f":"AND(COUNTIF(adv!A:A,B31))","v":false},false,{"$f":"COUNTIF(elite_adv!A:A,B31)","v":1},null,null,"Willpower (simple)",500,750,500,200,200,750]
[0,"Weapon Skill (trained)",0,"Characteristic","Weapon Skill (intermediate)",0,{"$f":"AND(COUNTIF(adv!A:A,E32))","v":false},false,{"$f":"AND(COUNTIF(adv!A:A,B32))","v":false},false,{"$f":"COUNTIF(elite_adv!A:A,B32)","v":1},null,null,"Willpower (intermediate)",1000,1000,1000,500,500,1000]
[0,"Weapon Skill (expert)",0,"Characteristic","Weapon Skill (trained)",0,{"$f":"AND(COUNTIF(adv!A:A,E33))","v":false},false,{"$f":"AND(COUNTIF(adv!A:A,B33))","v":false},false,{"$f":"COUNTIF(elite_adv!A:A,B33)","v":1},null,null,"Willpower (trained)",1500,2000,1500,1000,1000,2000]
[0,"Willpower (simple)",0,"Characteristic",null,0,true,false,{"$f":"AND(COUNTIF(adv!A:A,B34))","v":false},false,{"$f":"COUNTIF(elite_adv!A:A,B34)","v":1},null,null,"Willpower (expert)",2000,5000,2000,1500,1500,5000]
[0,"Willpower (intermediate)",0,"Characteristic","Willpower (simple)",0,{"$f":"AND(COUNTIF(adv!A:A,E35))","v":false},false,{"$f":"AND(COUNTIF(adv!A:A,B35))","v":false},false,{"$f":"COUNTIF(elite_adv!A:A,B35)","v":1},null,null,"Fellowship (simple)",500,500,500,750,200,750]
[0,"Willpower (trained)",0,"Characteristic","Willpower (intermediate)",0,{"$f":"AND(COUNTIF(adv!A:A,E36))","v":false},false,{"$f":"AND(COUNTIF(adv!A:A,B36))","v":false},false,{"$f":"COUNTIF(elite_adv!A:A,B36)","v":1},null,null,"Fellowship (intermediate)",1000,1000,1000,1000,500,1000]
[0,"Willpower (expert)",0,"Characteristic","Willpower (trained)",0,{"$f":"AND(COUNTIF(adv!A:A,E37))","v":false},false,{"$f":"AND(COUNTIF(adv!A:A,B37))","v":false},false,{"$f":"COUNTIF(elite_adv!A:A,B37)","v":1},null,null,"Fellowship (trained)",1500,1500,1500,2000,1000,2000]
["Black Shield","Awareness",200,"Skill",null,0,true,false,{"$f":"AND(COUNTIF(adv!A:A,B38))","v":false},false,{"$f":"COUNTIF(elite_adv!A:A,B38)","v":1},null,null,"Fellowship (expert)",2000,2000,2000,5000,1500,5000]
["Black Shield","Carouse",200,"Skill",null,0,true,false,{"$f":"AND(COUNTIF(adv!A:A,B39))","v":false},false,{"$f":"COUNTIF(elite_adv!A:A,B39)","v":1}]
["Black Shield","Climb",400,"Skill",null,0,true,false,{"$f":"AND(COUNTIF(adv!A:A,B40))","v":false},false,{"$f":"COUNTIF(elite_adv!A:A,B40)","v":1}]
["Black Shield","Concealment",800,"Skill",null,0,true,false,{"$f":"AND(COUNTIF(adv!A:A,B41))","v":false},false,{"$f":"COUNTIF(elite_adv!A:A,B41)","v":1}]
["Black Shield","Concealment +10",800,"Skill","Concealment",0,{"$f":"AND(COUNTIF(adv!A:A,E42))","v":false},false,{"$f":"AND(COUNTIF(adv!A:A,B42))","v":false},false,{"$f":"COUNTIF(elite_adv!A:A,B42)","v":1}]
["Black Shield","Drive (any)",800,"Skill",null,0,true,true,{"$f":"AND(COUNTIF(adv!A:A,B43))","v":false},false,{"$f":"COUNTIF(elite_adv!A:A,B43)","v":0}]
["Black Shield","Intimidate",400,"Skill",null,0,true,false,{"$f":"AND(COUNTIF(adv!A:A,B44))","v":false},false,{"$f":"COUNTIF(elite_adv!A:A,B44)","v":1}]
["Black Shield","Literacy",200,"Skill",null,0,true,false,{"$f":"AND(COUNTIF(adv!A:A,B45))","v":false},false,{"$f":"COUNTIF(elite_adv!A:A,B45)","v":1}]
["Black Shield","Lore: Common (Adeptus Astartes)",400,"Skill",null,0,true,true,{"$f":"AND(COUNTIF(adv!A:A,B46))","v":false},false,{"$f":"COUNTIF(elite_adv!A:A,B46)","v":1}]
["Black Shield","Lore: Common (Imperium)",400,"Skill",null,0,true,true,{"$f":"AND(COUNTIF(adv!A:A,B47))","v":false},false,{"$f":"COUNTIF(elite_adv!A:A,B47)","v":1}]
["Black Shield","Lore: Common (War)",400,"Skill",null,0,true,true,{"$f":"AND(COUNTIF(adv!A:A,B48))","v":false},false,{"$f":"COUNTIF(elite_adv!A:A,B48)","v":1}]
["Black Shield","Search",400,"Skill",null,0,true,false,{"$f":"AND(COUNTIF(adv!A:A,B49))","v":false},false,{"$f":"COUNTIF(elite_adv!A:A,B49)","v":1}]
["Black Shield","Silent Move",800,"Skill",null,0,true,false,{"$f":"AND(COUNTIF(adv!A:A,B50))","v":false},false,{"$f":"COUNTIF(elite_adv!A:A,B50)","v":1}]
["Black Shield","Silent Move +10",800,"Skill","Silent Move",0,{"$f":"AND(COUNTIF(adv!A:A,E51))","v":false},false,{"$f":"AND(COUNTIF(adv!A:A,B51))","v":false},false,{"$f":"COUNTIF(elite_adv!A:A,B51)","v":1}]
["Black Shield","Speak Language (any)",200,"Skill",null,0,true,true,{"$f":"AND(COUNTIF(adv!A:A,B52))","v":false},false,{"$f":"COUNTIF(elite_adv!A:A,B52)","v":0}]
["Black Shield","Survival",800,"Skill",null,0,true,false,{"$f":"AND(COUNTIF(adv!A:A,B53))","v":false},false,{"$f":"COUNTIF(elite_adv!A:A,B53)","v":1}]
["Black Shield","Swim",200,"Skill",null,0,true,false,{"$f":"AND(COUNTIF(adv!A:A,B54))","v":false},false,{"$f":"COUNTIF(elite_adv!A:A,B54)","v":1}]
["Black Shield","Trade (any)",400,"Skill",null,0,true,true,{"$f":"AND(COUNTIF(adv!A:A,B55))","v":false},false,{"$f":"COUNTIF(elite_adv!A:A,B55)","v":0}]
["Black Shield","Ambidextrous",1000,"Talent","Ag 30",0,{"$f":"AND(cha_ag>=30)","v":true},false,{"$f":"AND(COUNTIF(adv!A:A,B56))","v":false},false,{"$f":"COUNTIF(elite_adv!A:A,B56)","v":1}]
["Black Shield","Astartes Weapon Specialisation",1500,"Talent","Signature Gear",0,{"$f":"AND(COUNTIF(adv!A:A,E57))","v":false},false,{"$f":"AND(COUNTIF(adv!A:A,B57))","v":false},false,{"$f":"COUNTIF(elite_adv!A:A,B57)","v":1}]
["Black Shield","Sound Constitution [BS1]",1000,"Talent",null,0,true,false,{"$f":"AND(COUNTIF(adv!A:A,B58))","v":false},false,{"$f":"COUNTIF(elite_adv!A:A,B58)","v":0}]
["Black Shield","Sound Constitution [BS2]",1000,"Talent",null,0,true,false,{"$f":"AND(COUNTIF(adv!A:A,B59))","v":false},false,{"$f":"COUNTIF(elite_adv!A:A,B59)","v":0}]
["Black Shield","Sound Constitution [BS3]",1000,"Talent",null,0,true,false,{"$f":"AND(COUNTIF(adv!A:A,B60))","v":false},false,{"$f":"COUNTIF(elite_adv!A:A,B60)","v":0}]
["Black Templars","Interrogation",200,"Skill",null,0,true,false,{"$f":"AND(COUNTIF(adv!A:A,B61))","v":false},false,{"$f":"COUNTIF(elite_adv!A:A,B61)","v":1}]
["Black Templars","Interrogation +10",200,"Skill","Interrogation",0,{"$f":"AND(COUNTIF(adv!A:A,E62))","v":false},false,{"$f":"AND(COUNTIF(adv!A:A,B62))","v":false},false,{"$f":"COUNTIF(elite_adv!A:A,B62)","v":1}]
["Black Templars","Interrogation +20",200,"Skill","Interrogation +10",0,{"$f":"AND(COUNTIF(adv!A:A,E63))","v":false},false,{"$f":"AND(COUNTIF(adv!A:A,B63))","v":false},false,{"$f":"COUNTIF(elite_adv!A:A,B63)","v":1}]
["Black Templars","Abhor the Witch",800,"Talent","Adeptus Astartes",0,{"$f":"AND(COUNTIF(adv!A:A,E64))","v":false},false,{"$f":"AND(COUNTIF(adv!A:A,B64))","v":false},false,{"$f":"COUNTIF(elite_adv!A:A,B64)","v":1}]
["Black Templars","Fearless",800,"Talent",null,0,true,false,{"$f":"AND(COUNTIF(adv!A:A,B65))","v":false},false,{"$f":"COUNTIF(elite_adv!A:A,B65)","v":1}]
["Black Templars","Hatred (Heretics)",500,"Talent",null,0,true,false,{"$f":"AND(COUNTIF(adv!A:A,B66))","v":false},false,{"$f":"COUNTIF(elite_adv!A:A,B66)","v":1}]
["Black Templars","Hatred (Mutants)",500,"Talent",null,0,true,false,{"$f":"AND(COUNTIF(adv!A:A,B67))","v":false},false,{"$f":"COUNTIF(elite_adv!A:A,B67)","v":1}]
["Black Templars","Hatred (Psykers)",500,"Talent",null,0,true,false,{"$f":"AND(COUNTIF(adv!A:A,B68))","v":false},false,{"$f":"COUNTIF(elite_adv!A:A,B68)","v":1}]
["Black Templars","Inspire Wrath",1000,"Talent","Fel 30",0,{"$f":"AND(cha_fel>=30)","v":true},false,{"$f":"AND(COUNTIF(adv!A:A,B69))","v":false},false,{"$f":"COUNTIF(elite_adv!A:A,B69)","v":1}]
["Black Templars","Litany of Hate",1000,"Talent","Hatred (any)",0,{"$f":"AND(COUNTIF(adv!F:F,E70))","v":false},false,{"$f":"AND(COUNTIF(adv!A:A,B70))","v":false},false,{"$f":"COUNTIF(elite_adv!A:A,B70)","v":1}]
["Black Templars","Orthoproxy",500,"Talent",null,0,true,false,{"$f":"AND(COUNTIF(adv!A:A,B71))","v":false},false,{"$f":"COUNTIF(elite_adv!A:A,B71)","v":1}]
["Black Templars","Scourge of Heretics",500,"Talent",null,0,true,false,{"$f":"AND(COUNTIF(adv!A:A,B72))","v":false},false,{"$f":"COUNTIF(elite_adv!A:A,B72)","v":1}]
["Blood Angels","Acrobatics",200,"Skill",null,0,true,false,{"$f":"AND(COUNTIF(adv!A:A,B73))","v":false},false,{"$f":"COUNTIF(elite_adv!A:A,B73)","v":1}]
["Blood Angels","Acrobatics +10",600,"Skill","Acrobatics",0,{"$f":"AND(COUNTIF(adv!A:A,E74))","v":false},false,{"$f":"AND(COUNTIF(adv!A:A,B74))","v":false},false,{"$f":"COUNTIF(elite_adv!A:A,B74)","v":1}]
["Blood Angels","Acrobatics +20",600,"Skill","Acrobatics +10",0,{"$f":"AND(COUNTIF(adv!A:A,E75))","v":false},false,{"$f":"AND(COUNTIF(adv!A:A,B75))","v":false},false,{"$f":"COUNTIF(elite_adv!A:A,B75)","v":1}]
["Blood Angels","Assassin Strike",500,"Talent","Ag 40, Acrobatics",0,{"$f":"AND(cha_ag>=40,COUNTIF(adv!A:A,\"Acrobatics\"))","v":false},false,{"$f":"AND(COUNTIF(adv!A:A,B76))","v":false},false,{"$f":"COUNTIF(elite_adv!A:A,B76)","v":1}]
["Blood Angels","Battle Rage",400,"Talent","Frenzy",0,{"$f":"AND(COUNTIF(adv!A:A,E77))","v":false},false,{"$f":"AND(COUNTIF(adv!A:A,B77))","v":false},false,{"$f":"COUNTIF(elite_adv!A:A,B77)","v":1}]
["Blood Angels","Berserk Charge",600,"Talent",null,0,true,false,{"$f":"AND(COUNTIF(adv!A:A,B78))","v":false},false,{"$f":"COUNTIF(elite_adv!A:A,B78)","v":1}]
["Blood Angels","Flesh Render",500,"Talent",null,0,true,false,{"$f":"AND(COUNTIF(adv!A:A,B79))","v":false},false,{"$f":"COUNTIF(elite_adv!A:A,B79)","v":1}]
["Blood Angels","Frenzy",400,"Talent",null,0,true,false,{"$f":"AND(COUNTIF(adv!A:A,B80))","v":false},false,{"$f":"COUNTIF(elite_adv!A:A,B80)","v":1}]
["Blood Angels","Furious Assault",600,"Talent","WS 35",0,{"$f":"AND(cha_ws>=30)","v":true},false,{"$f":"AND(COUNTIF(adv!A:A,B81))","v":false},false,{"$f":"COUNTIF(elite_adv!A:A,B81)","v":1}]
["Blood Angels","Hatred (Orks)",500,"Talent",null,0,true,false,{"$f":"AND(COUNTIF(adv!A:A,B82))","v":false},false,{"$f":"COUNTIF(elite_adv!A:A,B82)","v":1}]
["Blood Angels","Mental Rage",800,"Talent","Frenzy",0,{"$f":"AND(COUNTIF(adv!A:A,E83))","v":false},false,{"$f":"AND(COUNTIF(adv!A:A,B83))","v":false},false,{"$f":"COUNTIF(elite_adv!A:A,B83)","v":1}]
["Blood Angels","Slayer of Daemons",1000,"Talent",null,0,true,false,{"$f":"AND(COUNTIF(adv!A:A,B84))","v":false},false,{"$f":"COUNTIF(elite_adv!A:A,B84)","v":1}]
["Blood Angels","Talented (Pilot (Personal))",500,"Talent",null,0,true,false,{"$f":"AND(COUNTIF(adv!A:A,B85))","v":false},false,{"$f":"COUNTIF(elite_adv!A:A,B85)","v":1}]
["Blood Angels","Talented (Trade (Artisan))",500,"Talent",null,0,true,false,{"$f":"AND(COUNTIF(adv!A:A,B86))","v":false},false,{"$f":"COUNTIF(elite_adv!A:A,B86)","v":1}]
["Champion","Dodge",400,"Skill",null,0,true,false,{"$f":"AND(COUNTIF(adv!A:A,B87))","v":false},false,{"$f":"COUNTIF(elite_adv!A:A,B87)","v":1}]
["Champion","Dodge +10",400,"Skill","Dodge",0,{"$f":"AND(COUNTIF(adv!A:A,E88))","v":false},false,{"$f":"AND(COUNTIF(adv!A:A,B88))","v":false},false,{"$f":"COUNTIF(elite_adv!A:A,B88)","v":1}]
["Champion","Dodge +20",400,"Skill","Dodge +10",0,{"$f":"AND(COUNTIF(adv!A:A,E89))","v":false},false,{"$f":"AND(COUNTIF(adv!A:A,B89))","v":false},false,{"$f":"COUNTIF(elite_adv!A:A,B89)","v":1}]
["Champion","Intimidate",200,"Skill",null,0,true,false,{"$f":"AND(COUNTIF(adv!A:A,B90))","v":false},false,{"$f":"COUNTIF(elite_adv!A:A,B90)","v":1}]
["Champion","Intimidate +10",200,"Skill","Intimidate",0,{"$f":"AND(COUNTIF(adv!A:A,E91))","v":false},false,{"$f":"AND(COUNTIF(adv!A:A,B91))","v":false},false,{"$f":"COUNTIF(elite_adv!A:A,B91)","v":1}]
["Champion","Assassin Strike",1000,"Talent","Ag 40, Acrobatics",0,{"$f":"AND(cha_ag>=40,COUNTIF(adv!A:A,\"Acrobatics\"))","v":false},false,{"$f":"AND(COUNTIF(adv!A:A,B92))","v":false},false,{"$f":"COUNTIF(elite_adv!A:A,B92)","v":1}]
["Champion","Blademaster",1500,"Talent","WS 40",0,{"$f":"AND(cha_ws>=40)","v":false},false,{"$f":"AND(COUNTIF(adv!A:A,B93))","v":false},false,{"$f":"COUNTIF(elite_adv!A:A,B93)","v":1}]
["Champion","Blind Fighting",1500,"Talent","Per 30",0,{"$f":"AND(cha_per>=30)","v":true},false,{"$f":"AND(COUNTIF(adv!A:A,B94))","v":false},false,{"$f":"COUNTIF(elite_adv!A:A,B94)","v":1}]
["Champion","Combat Master",1500,"Talent","WS 30",0,{"$f":"AND(cha_ws>=30)","v":true},false,{"$f":"AND(COUNTIF(adv!A:A,B95))","v":false},false,{"$f":"COUNTIF(elite_adv!A:A,B95)","v":1}]
["Champion","Counter Attack",1500,"Talent","WS 40",0,{"$f":"AND(cha_ws>=40)","v":false},false,{"$f":"AND(COUNTIF(adv!A:A,B96))","v":false},false,{"$f":"COUNTIF(elite_adv!A:A,B96)","v":1}]
["Champion","Crippling Strike",2000,"Talent","WS 50",0,{"$f":"AND(cha_ws>=50)","v":false},false,{"$f":"AND(COUNTIF(adv!A:A,B97))","v":false},false,{"$f":"COUNTIF(elite_adv!A:A,B97)","v":1}]
["Champion","Fearless",1000,"Talent",null,0,true,false,{"$f":"AND(COUNTIF(adv!A:A,B98))","v":false},false,{"$f":"COUNTIF(elite_adv!A:A,B98)","v":1}]
["Champion","Hammer Blow",15100,"Talent",null,0,true,false,{"$f":"AND(COUNTIF(adv!A:A,B99))","v":false},false,{"$f":"COUNTIF(elite_adv!A:A,B99)","v":1}]
["Champion","Lightning Attack",2000,"Talent","Swift Attack",0,{"$f":"AND(COUNTIF(adv!A:A,E100))","v":false},false,{"$f":"AND(COUNTIF(adv!A:A,B100))","v":false},false,{"$f":"COUNTIF(elite_adv!A:A,B100)","v":1}]
["Champion","Precise Blow",1500,"Talent","WS 40, Sure Strike",0,{"$f":"AND(cha_ws>=40,COUNTIF(adv!A:A,\"Sure Strike\"))","v":false},false,{"$f":"AND(COUNTIF(adv!A:A,B101))","v":false},false,{"$f":"COUNTIF(elite_adv!A:A,B101)","v":1}]
["Champion","Signature Wargear: Hero (Weapon)",1000,"Talent",null,0,true,false,{"$f":"AND(COUNTIF(adv!A:A,B102))","v":false},false,{"$f":"COUNTIF(elite_adv!A:A,B102)","v":1}]
["Champion","Signature Wargear: Hero (Armour)",1000,"Talent",null,0,true,false,{"$f":"AND(COUNTIF(adv!A:A,B103))","v":false},false,{"$f":"COUNTIF(elite_adv!A:A,B103)","v":1}]
["Champion","Step Aside",2000,"Talent","Ag 40, Dodge",0,{"$f":"AND(cha_ag>=40,COUNTIF(adv!A:A,\"Dodge\"))","v":false},false,{"$f":"AND(COUNTIF(adv!A:A,B104))","v":false},false,{"$f":"COUNTIF(elite_adv!A:A,B104)","v":1}]
["Champion","Sure Strike",1000,"Talent","WS 30",0,{"$f":"AND(cha_ws>=30,)","v":false},false,{"$f":"AND(COUNTIF(adv!A:A,B105))","v":false},false,{"$f":"COUNTIF(elite_adv!A:A,B105)","v":1}]
["Champion","Swift Attack",1500,"Talent","WS 35",0,{"$f":"AND(cha_ws>=35)","v":false},false,{"$f":"AND(COUNTIF(adv!A:A,B106))","v":false},false,{"$f":"COUNTIF(elite_adv!A:A,B106)","v":1}]
["Champion","Sound Constitution [DWC]",1000,"Talent",null,0,true,false,{"$f":"AND(COUNTIF(adv!A:A,B107))","v":false},false,{"$f":"COUNTIF(elite_adv!A:A,B107)","v":0}]
["Champion","Wall of Steel",2000,"Talent","Ag 35",0,{"$f":"AND(cha_ag>=35)","v":false},false,{"$f":"AND(COUNTIF(adv!A:A,B108))","v":false},false,{"$f":"COUNTIF(elite_adv!A:A,B108)","v":1}]
["Chaplain","Command",200,"Skill",null,0,true,false,{"$f":"AND(COUNTIF(adv!A:A,B109))","v":false},false,{"$f":"COUNTIF(elite_adv!A:A,B109)","v":1}]
["Chaplain","Command +10",200,"Skill","Command",0,{"$f":"AND(COUNTIF(adv!A:A,E110))","v":false},false,{"$f":"AND(COUNTIF(adv!A:A,B110))","v":false},false,{"$f":"COUNTIF(elite_adv!A:A,B110)","v":1}]
["Chaplain","Deceive",200,"Skill",null,0,true,false,{"$f":"AND(COUNTIF(adv!A:A,B111))","v":false},false,{"$f":"COUNTIF(elite_adv!A:A,B111)","v":1}]
["Chaplain","Intimidate",200,"Skill",null,0,true,false,{"$f":"AND(COUNTIF(adv!A:A,B112))","v":false},false,{"$f":"COUNTIF(elite_adv!A:A,B112)","v":1}]
["Chaplain","Intimidate +10",400,"Skill","Intimidate",0,{"$f":"AND(COUNTIF(adv!A:A,E113))","v":false},false,{"$f":"AND(COUNTIF(adv!A:A,B113))","v":false},false,{"$f":"COUNTIF(elite_adv!A:A,B113)","v":1}]
["Chaplain","Intimidate +20",400,"Skill","Intimidate +10",0,{"$f":"AND(COUNTIF(adv!A:A,E114))","v":false},false,{"$f":"AND(COUNTIF(adv!A:A,B114))","v":false},false,{"$f":"COUNTIF(elite_adv!A:A,B114)","v":1}]
["Chaplain","Interrogation",200,"Skill",null,0,true,false,{"$f":"AND(COUNTIF(adv!A:A,B115))","v":false},false,{"$f":"COUNTIF(elite_adv!A:A,B115)","v":1}]
["Chaplain","Interrogation +10",400,"Skill","Interrogation",0,{"$f":"AND(COUNTIF(adv!A:A,E116))","v":false},false,{"$f":"AND(COUNTIF(adv!A:A,B116))","v":false},false,{"$f":"COUNTIF(elite_adv!A:A,B116)","v":1}]
["Chaplain","Interrogation +20",400,"Skill","Interrogation +10",0,{"$f":"AND(COUNTIF(adv!A:A,E117))","v":false},false,{"$f":"AND(COUNTIF(adv!A:A,B117))","v":false},false,{"$f":"COUNTIF(elite_adv!A:A,B117)","v":1}]
["Chaplain","Lore: Common (Ecclesiarchy)",200,"Skill",null,0,true,true,{"$f":"AND(COUNTIF(adv!A:A,B118))","v":false},false,{"$f":"COUNTIF(elite_adv!A:A,B118)","v":1}]
["Chaplain","Lore: Forbidden (The Traitor Legions)",400,"Skill",null,0,true,true,{"$f":"AND(COUNTIF(adv!A:A,B119))","v":false},false,{"$f":"COUNTIF(elite_adv!A:A,B119)","v":1}]
["Chaplain","Lore: Forbidden (The Traitor Legions) +10",400,"Skill","Lore: Forbidden (The Traitor Legions)",0,{"$f":"AND(COUNTIF(adv!A:A,E120))","v":false},true,{"$f":"AND(COUNTIF(adv!A:A,B120))","v":false},false,{"$f":"COUNTIF(elite_adv!A:A,B120)","v":1}]
["Chaplain","Lore: Forbidden (The Primarchs)",400,"Skill",null,0,true,true,{"$f":"AND(COUNTIF(adv!A:A,B121))","v":false},false,{"$f":"COUNTIF(elite_adv!A:A,B121)","v":1}]
["Chaplain","Lore: Forbidden (The Primarchs) +10",400,"Skill","Lore: Forbidden (The Primarchs)",0,{"$f":"AND(COUNTIF(adv!A:A,E122))","v":false},true,{"$f":"AND(COUNTIF(adv!A:A,B122))","v":false},false,{"$f":"COUNTIF(elite_adv!A:A,B122)","v":1}]
["Chaplain","Lore: Forbidden (The Primarchs) +20",400,"Skill","Lore: Forbidden (The Primarchs) +10",0,{"$f":"AND(COUNTIF(adv!A:A,E123))","v":false},true,{"$f":"AND(COUNTIF(adv!A:A,B123))","v":false},false,{"$f":"COUNTIF(elite_adv!A:A,B123)","v":1}]
["Chaplain","Lore: Scholastic (Imperial Creed)",200,"Skill",null,0,true,true,{"$f":"AND(COUNTIF(adv!A:A,B124))","v":false},false,{"$f":"COUNTIF(elite_adv!A:A,B124)","v":1}]
["Chaplain","Lore: Scholastic (Legends)",400,"Skill",null,0,true,true,{"$f":"AND(COUNTIF(adv!A:A,B125))","v":false},false,{"$f":"COUNTIF(elite_adv!A:A,B125)","v":1}]
["Chaplain","Lore: Scholastic (Legends) +10",400,"Skill","Lore: Scholastic (Legends)",0,{"$f":"AND(COUNTIF(adv!A:A,E126))","v":false},true,{"$f":"AND(COUNTIF(adv!A:A,B126))","v":false},false,{"$f":"COUNTIF(elite_adv!A:A,B126)","v":1}]
["Chaplain","Air of Authority",800,"Talent","Fel 30",0,{"$f":"AND(cha_fel>=30)","v":true},false,{"$f":"AND(COUNTIF(adv!A:A,B127))","v":false},false,{"$f":"COUNTIF(elite_adv!A:A,B127)","v":1}]
["Chaplain","Call to Vengeance",800,"Talent","Fel 40",0,{"$f":"AND(cha_fel>=40)","v":false},false,{"$f":"AND(COUNTIF(adv!A:A,B128))","v":false},false,{"$f":"COUNTIF(elite_adv!A:A,B128)","v":1}]
["Chaplain","Good Reputation (Adeptus Astartes)",200,"Talent","Peer (Adeptus Astartes), Fel 50",0,{"$f":"AND(COUNTIF(adv!A:A,E129),cha_fel>=50)","v":false},false,{"$f":"AND(COUNTIF(adv!A:A,B129))","v":false},false,{"$f":"COUNTIF(elite_adv!A:A,B129)","v":1}]
["Chaplain","Hatred (any)",500,"Talent",null,0,true,true,{"$f":"AND(COUNTIF(adv!A:A,B130))","v":false},false,{"$f":"COUNTIF(elite_adv!A:A,B130)","v":0}]
["Chaplain","Icon of Duty",1500,"Talent",null,0,true,false,{"$f":"AND(COUNTIF(adv!A:A,B131))","v":false},false,{"$f":"COUNTIF(elite_adv!A:A,B131)","v":1}]
["Chaplain","Peer (Adeptus Astartes)",500,"Talent","Fel 30",0,{"$f":"AND(cha_fel>=30)","v":true},false,{"$f":"AND(COUNTIF(adv!A:A,B132))","v":false},false,{"$f":"COUNTIF(elite_adv!A:A,B132)","v":1}]
["Chaplain","Scourge of Heretics",1500,"Talent",null,0,true,false,{"$f":"AND(COUNTIF(adv!A:A,B133))","v":false},false,{"$f":"COUNTIF(elite_adv!A:A,B133)","v":1}]
["Dark Angels","Interrogation",200,"Skill",null,0,true,false,{"$f":"AND(COUNTIF(adv!A:A,B134))","v":false},false,{"$f":"COUNTIF(elite_adv!A:A,B134)","v":1}]
["Dark Angels","Interrogation +10",200,"Skill","Interrogation",0,{"$f":"AND(COUNTIF(adv!A:A,E135))","v":false},false,{"$f":"AND(COUNTIF(adv!A:A,B135))","v":false},false,{"$f":"COUNTIF(elite_adv!A:A,B135)","v":1}]
["Dark Angels","Interrogation +20",200,"Skill","Interrogation +10",0,{"$f":"AND(COUNTIF(adv!A:A,E136))","v":false},false,{"$f":"AND(COUNTIF(adv!A:A,B136))","v":false},false,{"$f":"COUNTIF(elite_adv!A:A,B136)","v":1}]
["Dark Angels","Lore: Forbidden (Adeptus Astartes)",200,"Skill",null,0,true,true,{"$f":"AND(COUNTIF(adv!A:A,B137))","v":false},false,{"$f":"COUNTIF(elite_adv!A:A,B137)","v":1}]
["Dark Angels","Lore: Forbidden (Adeptus Astartes) +10",200,"Skill","Lore: Forbidden (Adeptus Astartes)",0,{"$f":"AND(COUNTIF(adv!A:A,E138))","v":false},true,{"$f":"AND(COUNTIF(adv!A:A,B138))","v":false},false,{"$f":"COUNTIF(elite_adv!A:A,B138)","v":1}]
["Dark Angels","Lore: Forbidden (Adeptus Astartes) +20",200,"Skill","Lore: Forbidden (Adeptus Astartes) +10",0,{"$f":"AND(COUNTIF(adv!A:A,E139))","v":false},true,{"$f":"AND(COUNTIF(adv!A:A,B139))","v":false},false,{"$f":"COUNTIF(elite_adv!A:A,B139)","v":1}]
["Dark Angels","Lore: Forbidden (The Inquisition)",400,"Skill",null,0,true,true,{"$f":"AND(COUNTIF(adv!A:A,B140))","v":false},false,{"$f":"COUNTIF(elite_adv!A:A,B140)","v":1}]
["Dark Angels","Lore: Forbidden (The Inquisition) +10",400,"Skill","Lore: Forbidden (The Inquisition)",0,{"$f":"AND(COUNTIF(adv!A:A,E141))","v":false},true,{"$f":"AND(COUNTIF(adv!A:A,B141))","v":false},false,{"$f":"COUNTIF(elite_adv!A:A,B141)","v":1}]
["Dark Angels","Lore: Forbidden (The Inquisition) +20",400,"Skill","Lore: Forbidden (The Inquisition) +10",0,{"$f":"AND(COUNTIF(adv!A:A,E142))","v":false},true,{"$f":"AND(COUNTIF(adv!A:A,B142))","v":false},false,{"$f":"COUNTIF(elite_adv!A:A,B142)","v":1}]
["Dark Angels","Lore: Forbidden (The Traitor Legions)",400,"Skill",null,0,true,true,{"$f":"AND(COUNTIF(adv!A:A,B143))","v":false},false,{"$f":"COUNTIF(elite_adv!A:A,B143)","v":1}]
["Dark Angels","Lore: Forbidden (The Traitor Legions) +10",400,"Skill","Lore: Forbidden (The Traitor Legions)",0,{"$f":"AND(COUNTIF(adv!A:A,E144))","v":false},true,{"$f":"AND(COUNTIF(adv!A:A,B144))","v":false},false,{"$f":"COUNTIF(elite_adv!A:A,B144)","v":1}]
["Dark Angels","Lore: Forbidden (The Traitor Legions) +20",400,"Skill","Lore: Forbidden (The Traitor Legions) +10",0,{"$f":"AND(COUNTIF(adv!A:A,E145))","v":false},true,{"$f":"AND(COUNTIF(adv!A:A,B145))","v":false},false,{"$f":"COUNTIF(elite_adv!A:A,B145)","v":1}]
["Dark Angels","Hatred (Chaos Space Marines)",500,"Talent",null,0,true,false,{"$f":"AND(COUNTIF(adv!A:A,B146))","v":false},false,{"$f":"COUNTIF(elite_adv!A:A,B146)","v":1}]
["Dark Angels","Hatred (Mutants)",500,"Talent",null,0,true,false,{"$f":"AND(COUNTIF(adv!A:A,B147))","v":false},false,{"$f":"COUNTIF(elite_adv!A:A,B147)","v":1}]
["Dark Angels","Paranoia",500,"Talent",null,0,true,false,{"$f":"AND(COUNTIF(adv!A:A,B148))","v":false},false,{"$f":"COUNTIF(elite_adv!A:A,B148)","v":1}]
["Dark Angels","Talented (Drive (Ground Vehicles))",500,"Talent",null,0,true,false,{"$f":"AND(COUNTIF(adv!A:A,B149))","v":false},false,{"$f":"COUNTIF(elite_adv!A:A,B149)","v":1}]
["Dark Angels","Talented (Pilot)",500,"Talent",null,0,true,false,{"$f":"AND(COUNTIF(adv!A:A,B150))","v":false},false,{"$f":"COUNTIF(elite_adv!A:A,B150)","v":0}]
["Deathwatch","Ciphers (Deathwatch)",200,"Skill",null,1,true,true,{"$f":"AND(COUNTIF(adv!A:A,B151))","v":false},false,{"$f":"COUNTIF(elite_adv!A:A,B151)","v":1}]
["Deathwatch","Ciphers (Inquisition)",200,"Skill",null,1,true,true,{"$f":"AND(COUNTIF(adv!A:A,B152))","v":false},false,{"$f":"COUNTIF(elite_adv!A:A,B152)","v":1}]
["Deathwatch","Ciphers (Xenos Markings)",200,"Skill",null,1,true,true,{"$f":"AND(COUNTIF(adv!A:A,B153))","v":false},false,{"$f":"COUNTIF(elite_adv!A:A,B153)","v":1}]
["Deathwatch","Interrogation",400,"Skill",null,1,true,false,{"$f":"AND(COUNTIF(adv!A:A,B154))","v":false},false,{"$f":"COUNTIF(elite_adv!A:A,B154)","v":1}]
["Deathwatch","Lore: Common (Deathwatch)",200,"Skill",null,1,true,true,{"$f":"AND(COUNTIF(adv!A:A,B155))","v":false},false,{"$f":"COUNTIF(elite_adv!A:A,B155)","v":1}]
["Deathwatch","Lore: Common (Jericho Reach)",400,"Skill",null,1,true,true,{"$f":"AND(COUNTIF(adv!A:A,B156))","v":false},false,{"$f":"COUNTIF(elite_adv!A:A,B156)","v":1}]
["Deathwatch","Lore: Forbidden (Xenos)",400,"Skill",null,1,true,true,{"$f":"AND(COUNTIF(adv!A:A,B157))","v":false},false,{"$f":"COUNTIF(elite_adv!A:A,B157)","v":1}]
["Deathwatch","Resistance (Cold)",300,"Talent",null,1,true,false,{"$f":"AND(COUNTIF(adv!A:A,B158))","v":false},false,{"$f":"COUNTIF(elite_adv!A:A,B158)","v":1}]
["Deathwatch","Resistance (Heat)",300,"Talent",null,1,true,false,{"$f":"AND(COUNTIF(adv!A:A,B159))","v":false},false,{"$f":"COUNTIF(elite_adv!A:A,B159)","v":1}]
["Deathwatch","Sleight of Hand",400,"Skill",null,1,true,false,{"$f":"AND(COUNTIF(adv!A:A,B160))","v":false},false,{"$f":"COUNTIF(elite_adv!A:A,B160)","v":1}]
["Deathwatch","Hunter of Aliens",1000,"Talent",null,1,true,false,{"$f":"AND(COUNTIF(adv!A:A,B161))","v":false},false,{"$f":"COUNTIF(elite_adv!A:A,B161)","v":1}]
["Deathwatch","Ciphers (Deathwatch) +10",200,"Skill","Ciphers (Deathwatch)",2,{"$f":"AND(COUNTIF(adv!A:A,E162))","v":false},true,{"$f":"AND(COUNTIF(adv!A:A,B162))","v":false},false,{"$f":"COUNTIF(elite_adv!A:A,B162)","v":1}]
["Deathwatch","Ciphers (Xenos Markings) +10",400,"Skill","Ciphers (Xenos Markings)",2,{"$f":"AND(COUNTIF(adv!A:A,E163))","v":false},true,{"$f":"AND(COUNTIF(adv!A:A,B163))","v":false},false,{"$f":"COUNTIF(elite_adv!A:A,B163)","v":1}]
["Deathwatch","Interrogation +10",400,"Skill","Interrogation",2,{"$f":"AND(COUNTIF(adv!A:A,E164))","v":false},false,{"$f":"AND(COUNTIF(adv!A:A,B164))","v":false},false,{"$f":"COUNTIF(elite_adv!A:A,B164)","v":1}]
["Deathwatch","Lore: Common (Deathwatch) +10",200,"Skill","Lore: Common (Deathwatch)",2,{"$f":"AND(COUNTIF(adv!A:A,E165))","v":false},true,{"$f":"AND(COUNTIF(adv!A:A,B165))","v":false},false,{"$f":"COUNTIF(elite_adv!A:A,B165)","v":1}]
["Deathwatch","Lore: Common (Jericho Reach) +10",400,"Skill","Lore: Common (Jericho Reach)",2,{"$f":"AND(COUNTIF(adv!A:A,E166))","v":false},true,{"$f":"AND(COUNTIF(adv!A:A,B166))","v":false},false,{"$f":"COUNTIF(elite_adv!A:A,B166)","v":1}]
["Deathwatch","Sleight of Hand +10",400,"Skill","Sleight of Hand",2,{"$f":"AND(COUNTIF(adv!A:A,E167))","v":false},false,{"$f":"AND(COUNTIF(adv!A:A,B167))","v":false},false,{"$f":"COUNTIF(elite_adv!A:A,B167)","v":1}]
["Deathwatch","Hatred (Orks)",500,"Talent","",2,true,false,{"$f":"AND(COUNTIF(adv!A:A,B168))","v":false},false,{"$f":"COUNTIF(elite_adv!A:A,B168)","v":1}]
["Deathwatch","Hatred (Tyranids)",500,"Talent","",2,true,false,{"$f":"AND(COUNTIF(adv!A:A,B169))","v":false},false,{"$f":"COUNTIF(elite_adv!A:A,B169)","v":1}]
["Deathwatch","Ciphers (Deathwatch) +20",200,"Skill","Ciphers (Deathwatch) +10",3,{"$f":"AND(COUNTIF(adv!A:A,E170))","v":false},true,{"$f":"AND(COUNTIF(adv!A:A,B170))","v":false},false,{"$f":"COUNTIF(elite_adv!A:A,B170)","v":1}]
["Deathwatch","Ciphers (Xenos Markings) +20",400,"Skill","Ciphers (Xenos Markings) +10",3,{"$f":"AND(COUNTIF(adv!A:A,E171))","v":false},true,{"$f":"AND(COUNTIF(adv!A:A,B171))","v":false},false,{"$f":"COUNTIF(elite_adv!A:A,B171)","v":1}]
["Deathwatch","Interrogation +20",400,"Skill","Interrogation +10",3,{"$f":"AND(COUNTIF(adv!A:A,E172))","v":false},false,{"$f":"AND(COUNTIF(adv!A:A,B172))","v":false},false,{"$f":"COUNTIF(elite_adv!A:A,B172)","v":1}]
["Deathwatch","Lore: Common (Deathwatch) +20",200,"Skill","Lore: Common (Deathwatch) +10",3,{"$f":"AND(COUNTIF(adv!A:A,E173))","v":false},true,{"$f":"AND(COUNTIF(adv!A:A,B173))","v":false},false,{"$f":"COUNTIF(elite_adv!A:A,B173)","v":1}]
["Deathwatch","Lore: Common (Jericho Reach) +20",400,"Skill","Lore: Common (Jericho Reach) +10",3,{"$f":"AND(COUNTIF(adv!A:A,E174))","v":false},true,{"$f":"AND(COUNTIF(adv!A:A,B174))","v":false},false,{"$f":"COUNTIF(elite_adv!A:A,B174)","v":1}]
["Deathwatch","Sleight of Hand +20",400,"Skill","Sleight of Hand +10",3,{"$f":"AND(COUNTIF(adv!A:A,E175))","v":false},false,{"$f":"AND(COUNTIF(adv!A:A,B175))","v":false},false,{"$f":"COUNTIF(elite_adv!A:A,B175)","v":1}]
["Deathwatch","Exotic Weapon Training (Astartes Conversion Beamer)",500,"Talent",null,3,true,false,{"$f":"AND(COUNTIF(adv!A:A,B176))","v":false},false,{"$f":"COUNTIF(elite_adv!A:A,B176)","v":1}]
["Deathwatch","Exotic Weapon Training (Astartes Digital Flamer)",500,"Talent",null,3,true,false,{"$f":"AND(COUNTIF(adv!A:A,B177))","v":false},false,{"$f":"COUNTIF(elite_adv!A:A,B177)","v":1}]
["Deathwatch","Exotic Weapon Training (Astartes Digital Laser)",500,"Talent",null,3,true,false,{"$f":"AND(COUNTIF(adv!A:A,B178))","v":false},false,{"$f":"COUNTIF(elite_adv!A:A,B178)","v":1}]
["Deathwatch","Exotic Weapon Training (Astartes Digital Melta)",500,"Talent",null,3,true,false,{"$f":"AND(COUNTIF(adv!A:A,B179))","v":false},false,{"$f":"COUNTIF(elite_adv!A:A,B179)","v":1}]
["Deathwatch","Exotic Weapon Training (Astartes Sniper Rifle)",500,"Talent",null,3,true,false,{"$f":"AND(COUNTIF(adv!A:A,B180))","v":false},false,{"$f":"COUNTIF(elite_adv!A:A,B180)","v":1}]
["Deathwatch","Hatred (Eldar)",500,"Talent","",3,true,false,{"$f":"AND(COUNTIF(adv!A:A,B181))","v":false},false,{"$f":"COUNTIF(elite_adv!A:A,B181)","v":1}]
["Deathwatch","Hatred (Tau)",500,"Talent","",3,true,false,{"$f":"AND(COUNTIF(adv!A:A,B182))","v":false},false,{"$f":"COUNTIF(elite_adv!A:A,B182)","v":1}]
["Deathwatch","Lore: Forbidden (The Black Library)",400,"Skill","",4,true,true,{"$f":"AND(COUNTIF(adv!A:A,B183))","v":false},false,{"$f":"COUNTIF(elite_adv!A:A,B183)","v":1}]
["Deathwatch","Lore: Forbidden (The Inquisition)",800,"Skill","",4,true,true,{"$f":"AND(COUNTIF(adv!A:A,B184))","v":false},false,{"$f":"COUNTIF(elite_adv!A:A,B184)","v":1}]
["Deathwatch","Lore: Forbidden (The Traitor Legions)",800,"Skill","",4,true,true,{"$f":"AND(COUNTIF(adv!A:A,B185))","v":false},false,{"$f":"COUNTIF(elite_adv!A:A,B185)","v":1}]
["Deathwatch","Lore: Forbidden (The Warp)",400,"Skill","",4,true,true,{"$f":"AND(COUNTIF(adv!A:A,B186))","v":false},false,{"$f":"COUNTIF(elite_adv!A:A,B186)","v":1}]
["Deathwatch","Scourge of Heretics",1000,"Talent","",4,true,false,{"$f":"AND(COUNTIF(adv!A:A,B187))","v":false},false,{"$f":"COUNTIF(elite_adv!A:A,B187)","v":1}]
["Deathwatch","Lore: Forbidden (The Inquisition) +10",800,"Skill","Lore: Forbidden (The Inquisition)",5,{"$f":"AND(COUNTIF(adv!A:A,E188))","v":false},true,{"$f":"AND(COUNTIF(adv!A:A,B188))","v":false},false,{"$f":"COUNTIF(elite_adv!A:A,B188)","v":1}]
["Deathwatch","Lore: Forbidden (The Warp) +10",400,"Skill","Lore: Forbidden (The Warp)",5,{"$f":"AND(COUNTIF(adv!A:A,E189))","v":false},true,{"$f":"AND(COUNTIF(adv!A:A,B189))","v":false},false,{"$f":"COUNTIF(elite_adv!A:A,B189)","v":1}]
["Deathwatch","Lore: Forbidden (Xenos) +10",400,"Skill","Lore: Forbidden (Xenos)",5,{"$f":"AND(COUNTIF(adv!A:A,E190))","v":false},true,{"$f":"AND(COUNTIF(adv!A:A,B190))","v":false},false,{"$f":"COUNTIF(elite_adv!A:A,B190)","v":1}]
["Deathwatch","Peer (Inquisition)",1000,"Talent","Fel 30",5,{"$f":"AND(cha_fel>=50)","v":false},false,{"$f":"AND(COUNTIF(adv!A:A,B191))","v":false},false,{"$f":"COUNTIF(elite_adv!A:A,B191)","v":1}]
["Deathwatch","Slayer of Daemons",1000,"Talent","",5,true,false,{"$f":"AND(COUNTIF(adv!A:A,B192))","v":false},false,{"$f":"COUNTIF(elite_adv!A:A,B192)","v":1}]
["Deathwatch","Lore: Forbidden (The Black Library) +10",400,"Skill","Lore: Forbidden (The Black Library)",6,{"$f":"AND(COUNTIF(adv!A:A,E193))","v":false},true,{"$f":"AND(COUNTIF(adv!A:A,B193))","v":false},false,{"$f":"COUNTIF(elite_adv!A:A,B193)","v":1}]
["Deathwatch","Lore: Forbidden (The Inquisition) +20",800,"Skill","Lore: Forbidden (The Inquisition) +10",6,{"$f":"AND(COUNTIF(adv!A:A,E194))","v":false},true,{"$f":"AND(COUNTIF(adv!A:A,B194))","v":false},false,{"$f":"COUNTIF(elite_adv!A:A,B194)","v":1}]
["Deathwatch","Lore: Forbidden (The Traitor Legions) +10",800,"Skill","Lore: Forbidden (The Traitor Legions)",6,{"$f":"AND(COUNTIF(adv!A:A,E195))","v":false},true,{"$f":"AND(COUNTIF(adv!A:A,B195))","v":false},false,{"$f":"COUNTIF(elite_adv!A:A,B195)","v":1}]
["Deathwatch","Lore: Forbidden (The Warp) +20",400,"Skill","Lore: Forbidden (The Warp) +10",6,{"$f":"AND(COUNTIF(adv!A:A,E196))","v":false},true,{"$f":"AND(COUNTIF(adv!A:A,B196))","v":false},false,{"$f":"COUNTIF(elite_adv!A:A,B196)","v":1}]
["Deathwatch","Lore: Forbidden (Xenos) +20",400,"Skill","Lore: Forbidden (Xenos) +10",6,{"$f":"AND(COUNTIF(adv!A:A,E197))","v":false},true,{"$f":"AND(COUNTIF(adv!A:A,B197))","v":false},false,{"$f":"COUNTIF(elite_adv!A:A,B197)","v":1}]
["Deathwatch","Lore: Forbidden (The Traitor Legions) +20",800,"Skill","Lore: Forbidden (The Traitor Legions) +10",7,{"$f":"AND(COUNTIF(adv!A:A,E198))","v":false},true,{"$f":"AND(COUNTIF(adv!A:A,B198))","v":false},false,{"$f":"COUNTIF(elite_adv!A:A,B198)","v":1}]
["Deathwatch","Sound Constitution",1000,"Talent",null,7,true,false,{"$f":"AND(COUNTIF(adv!A:A,B199))","v":false},false,{"$f":"COUNTIF(elite_adv!A:A,B199)","v":1}]
["Deathwatch","Strong Minded",1500,"Talent","WP 30, Resistance (Psychic Powers)",7,{"$f":"AND(cha_wp>=30,COUNTIF(adv!A:A,\"Resistance (Psychic Powers)\"))","v":false},false,{"$f":"AND(COUNTIF(adv!A:A,B200))","v":false},false,{"$f":"COUNTIF(elite_adv!A:A,B200)","v":1}]
["Deathwatch","Lore: Forbidden (The Black Library) +20",400,"Skill","Lore: Forbidden (The Black Library) +10",8,{"$f":"AND(COUNTIF(adv!A:A,E201))","v":false},true,{"$f":"AND(COUNTIF(adv!A:A,B201))","v":false},false,{"$f":"COUNTIF(elite_adv!A:A,B201)","v":1}]
["Deathwatch","Good Reputation (Inquisition)",1500,"Talent","Fel 50, Peer (Inquisition)",8,{"$f":"AND(cha_fel>=50,COUNTIF(adv!A:A,\"Peer (Inquisition)\"))","v":false},false,{"$f":"AND(COUNTIF(adv!A:A,B202))","v":false},false,{"$f":"COUNTIF(elite_adv!A:A,B202)","v":1}]
["Deathwatch","Sound Constitution (DW1)",1000,"Talent",null,8,true,false,{"$f":"AND(COUNTIF(adv!A:A,B203))","v":false},false,{"$f":"COUNTIF(elite_adv!A:A,B203)","v":0}]
["Deathwatch","Sound Constitution (DW2)",1000,"Talent",null,8,true,false,{"$f":"AND(COUNTIF(adv!A:A,B204))","v":false},false,{"$f":"COUNTIF(elite_adv!A:A,B204)","v":0}]
["Deathwatch Apothecary","Chem-Use",400,"Skill",null,0,true,false,{"$f":"AND(COUNTIF(adv!A:A,B205))","v":false},false,{"$f":"COUNTIF(elite_adv!A:A,B205)","v":1}]
["Deathwatch Apothecary","Interrogation",200,"Skill",null,0,true,false,{"$f":"AND(COUNTIF(adv!A:A,B206))","v":false},false,{"$f":"COUNTIF(elite_adv!A:A,B206)","v":1}]
["Deathwatch Apothecary","Autosanguine",500,"Talent",null,0,true,false,{"$f":"AND(COUNTIF(adv!A:A,B207))","v":false},false,{"$f":"COUNTIF(elite_adv!A:A,B207)","v":1}]
["Deathwatch Apothecary","Hardy",100,"Talent","T 40",0,{"$f":"AND(cha_t>=40)","v":false},false,{"$f":"AND(COUNTIF(adv!A:A,B208))","v":false},false,{"$f":"COUNTIF(elite_adv!A:A,B208)","v":1}]
["Deathwatch Apothecary","Medicae",400,"Skill",null,0,true,false,{"$f":"AND(COUNTIF(adv!A:A,B209))","v":false},false,{"$f":"COUNTIF(elite_adv!A:A,B209)","v":1}]
["Deathwatch Apothecary","Resistance (Cold)",500,"Talent",null,0,true,false,{"$f":"AND(COUNTIF(adv!A:A,B210))","v":false},false,{"$f":"COUNTIF(elite_adv!A:A,B210)","v":1}]
["Deathwatch Apothecary","Resistance (Heat)",500,"Talent",null,0,true,false,{"$f":"AND(COUNTIF(adv!A:A,B211))","v":false},false,{"$f":"COUNTIF(elite_adv!A:A,B211)","v":1}]
["Deathwatch Apothecary","Resistance (Poisons)",500,"Talent",null,0,true,false,{"$f":"AND(COUNTIF(adv!A:A,B212))","v":false},false,{"$f":"COUNTIF(elite_adv!A:A,B212)","v":1}]
["Deathwatch Apothecary","Chem-Use +10",400,"Skill","Chem-Use",2,{"$f":"AND(COUNTIF(adv!A:A,E213))","v":false},false,{"$f":"AND(COUNTIF(adv!A:A,B213))","v":false},false,{"$f":"COUNTIF(elite_adv!A:A,B213)","v":1}]
["Deathwatch Apothecary","Interrogation +10",200,"Skill","Interrogation",2,{"$f":"AND(COUNTIF(adv!A:A,E214))","v":false},false,{"$f":"AND(COUNTIF(adv!A:A,B214))","v":false},false,{"$f":"COUNTIF(elite_adv!A:A,B214)","v":1}]
["Deathwatch Apothecary","Lore: Scholastic (Beasts)",200,"Skill","",2,true,true,{"$f":"AND(COUNTIF(adv!A:A,B215))","v":false},false,{"$f":"COUNTIF(elite_adv!A:A,B215)","v":1}]
["Deathwatch Apothecary","Lore: Scholastic (Chymistry)",200,"Skill","",2,true,true,{"$f":"AND(COUNTIF(adv!A:A,B216))","v":false},false,{"$f":"COUNTIF(elite_adv!A:A,B216)","v":1}]
["Deathwatch Apothecary","Medicae +10",400,"Skill","Medicae",2,{"$f":"AND(COUNTIF(adv!A:A,E217))","v":false},false,{"$f":"AND(COUNTIF(adv!A:A,B217))","v":false},false,{"$f":"COUNTIF(elite_adv!A:A,B217)","v":1}]
["Deathwatch Apothecary","Chem-Use +20",400,"Skill","Chem-Use +10",3,{"$f":"AND(COUNTIF(adv!A:A,E218))","v":false},false,{"$f":"AND(COUNTIF(adv!A:A,B218))","v":false},false,{"$f":"COUNTIF(elite_adv!A:A,B218)","v":1}]
["Deathwatch Apothecary","Interrogation +20",200,"Skill","Interrogation +10",3,{"$f":"AND(COUNTIF(adv!A:A,E219))","v":false},false,{"$f":"AND(COUNTIF(adv!A:A,B219))","v":false},false,{"$f":"COUNTIF(elite_adv!A:A,B219)","v":1}]
["Deathwatch Apothecary","Lore: Scholastic (Beasts) +10",200,"Skill","Lore: Scholastic (Beasts)",3,{"$f":"AND(COUNTIF(adv!A:A,E220))","v":false},true,{"$f":"AND(COUNTIF(adv!A:A,B220))","v":false},false,{"$f":"COUNTIF(elite_adv!A:A,B220)","v":1}]
["Deathwatch Apothecary","Lore: Scholastic (Chymistry) +10",200,"Skill","Lore: Scholastic (Chymistry)",3,{"$f":"AND(COUNTIF(adv!A:A,E221))","v":false},true,{"$f":"AND(COUNTIF(adv!A:A,B221))","v":false},false,{"$f":"COUNTIF(elite_adv!A:A,B221)","v":1}]
["Deathwatch Apothecary","Medicae +20",600,"Skill","Medicae +10",3,{"$f":"AND(COUNTIF(adv!A:A,E222))","v":false},false,{"$f":"AND(COUNTIF(adv!A:A,B222))","v":false},false,{"$f":"COUNTIF(elite_adv!A:A,B222)","v":1}]
["Deathwatch Apothecary","Tech-Use",500,"Skill","",3,true,false,{"$f":"AND(COUNTIF(adv!A:A,B223))","v":false},false,{"$f":"COUNTIF(elite_adv!A:A,B223)","v":1}]
["Deathwatch Apothecary","Lore: Forbidden (Mutants)",400,"Skill","",4,true,true,{"$f":"AND(COUNTIF(adv!A:A,B224))","v":false},false,{"$f":"COUNTIF(elite_adv!A:A,B224)","v":1}]
["Deathwatch Apothecary","Lore: Scholastic (Beasts) +20",200,"Skill","Lore: Scholastic (Beasts) +10",4,{"$f":"AND(COUNTIF(adv!A:A,E225))","v":false},true,{"$f":"AND(COUNTIF(adv!A:A,B225))","v":false},false,{"$f":"COUNTIF(elite_adv!A:A,B225)","v":1}]
["Deathwatch Apothecary","Lore: Scholastic (Chymistry) +20",200,"Skill","Lore: Scholastic (Chymistry) +10",4,{"$f":"AND(COUNTIF(adv!A:A,E226))","v":false},true,{"$f":"AND(COUNTIF(adv!A:A,B226))","v":false},false,{"$f":"COUNTIF(elite_adv!A:A,B226)","v":1}]
["Deathwatch Apothecary","Sure Strike",600,"Talent","WS 30",4,{"$f":"AND(cha_ws>=30)","v":true},false,{"$f":"AND(COUNTIF(adv!A:A,B227))","v":false},false,{"$f":"COUNTIF(elite_adv!A:A,B227)","v":1}]
["Deathwatch Apothecary","Lore: Forbidden (Mutants) +10",400,"Skill","Lore: Forbidden (Mutants)",5,{"$f":"AND(COUNTIF(adv!A:A,E228))","v":false},true,{"$f":"AND(COUNTIF(adv!A:A,B228))","v":false},false,{"$f":"COUNTIF(elite_adv!A:A,B228)","v":1}]
["Deathwatch Apothecary","Disarm",1000,"Talent","Ag 40",5,{"$f":"AND(cha_ag>=40)","v":false},false,{"$f":"AND(COUNTIF(adv!A:A,B229))","v":false},false,{"$f":"COUNTIF(elite_adv!A:A,B229)","v":1}]
["Deathwatch Apothecary","Infused Knowledge",1000,"Talent","Int 40",5,{"$f":"AND(cha_int>=40)","v":false},false,{"$f":"AND(COUNTIF(adv!A:A,B230))","v":false},false,{"$f":"COUNTIF(elite_adv!A:A,B230)","v":1}]
["Deathwatch Apothecary","Iron Jaw",300,"Talent","T 40",5,{"$f":"AND(cha_t>=40)","v":false},false,{"$f":"AND(COUNTIF(adv!A:A,B231))","v":false},false,{"$f":"COUNTIF(elite_adv!A:A,B231)","v":1}]
["Deathwatch Apothecary","Lore: Forbidden (Mutants) +20",400,"Skill","Lore: Forbidden (Mutants) +10",6,{"$f":"AND(COUNTIF(adv!A:A,E232))","v":false},true,{"$f":"AND(COUNTIF(adv!A:A,B232))","v":false},false,{"$f":"COUNTIF(elite_adv!A:A,B232)","v":1}]
["Deathwatch Apothecary","Crippling Strike",400,"Talent","WS 50",6,{"$f":"AND(cha_ws>=50)","v":false},false,{"$f":"AND(COUNTIF(adv!A:A,B233))","v":false},false,{"$f":"COUNTIF(elite_adv!A:A,B233)","v":1}]
["Deathwatch Apothecary","Prosanguine",800,"Talent","Autosanguine",6,{"$f":"AND(COUNTIF(adv!A:A,E234))","v":false},false,{"$f":"AND(COUNTIF(adv!A:A,B234))","v":false},false,{"$f":"COUNTIF(elite_adv!A:A,B234)","v":1}]
["Deathwatch Apothecary","Sound Constitution (Apo1)",500,"Talent","",6,true,false,{"$f":"AND(COUNTIF(adv!A:A,B235))","v":false},false,{"$f":"COUNTIF(elite_adv!A:A,B235)","v":0}]
["Deathwatch Apothecary","Swift Attack",500,"Talent","WS 35",6,{"$f":"AND(cha_ws>=35)","v":false},false,{"$f":"AND(COUNTIF(adv!A:A,B236))","v":false},false,{"$f":"COUNTIF(elite_adv!A:A,B236)","v":1}]
["Deathwatch Apothecary","Lightning Attack",800,"Talent","Swift Attack",7,{"$f":"AND(COUNTIF(adv!A:A,E237))","v":false},false,{"$f":"AND(COUNTIF(adv!A:A,B237))","v":false},false,{"$f":"COUNTIF(elite_adv!A:A,B237)","v":1}]
["Deathwatch Apothecary","Master Chirurgeon",800,"Talent","Medicae +10",7,{"$f":"AND(COUNTIF(adv!A:A,E238))","v":false},false,{"$f":"AND(COUNTIF(adv!A:A,B238))","v":false},false,{"$f":"COUNTIF(elite_adv!A:A,B238)","v":1}]
["Deathwatch Apothecary","Sound Constitution (Apo2)",1000,"Talent","",7,true,false,{"$f":"AND(COUNTIF(adv!A:A,B239))","v":false},false,{"$f":"COUNTIF(elite_adv!A:A,B239)","v":0}]
["Deathwatch Apothecary","Flesh Render",800,"Talent","",8,true,false,{"$f":"AND(COUNTIF(adv!A:A,B240))","v":false},false,{"$f":"COUNTIF(elite_adv!A:A,B240)","v":1}]
["Deathwatch Apothecary","Precise Blow",500,"Talent","WS 40, Sure Strike",8,{"$f":"AND(cha_ws>=40,COUNTIF(adv!A:A,\"Sure Strike\"))","v":false},false,{"$f":"AND(COUNTIF(adv!A:A,B241))","v":false},false,{"$f":"COUNTIF(elite_adv!A:A,B241)","v":1}]
["Deathwatch Apothecary","Sound Constitution (Apo3)",1000,"Talent","",8,true,false,{"$f":"AND(COUNTIF(adv!A:A,B242))","v":false},false,{"$f":"COUNTIF(elite_adv!A:A,B242)","v":0}]
["Deathwatch Assault Marine","Catfall",200,"Talent","Ag 30",0,{"$f":"AND(cha_ag>=30)","v":true},false,{"$f":"AND(COUNTIF(adv!A:A,B243))","v":false},false,{"$f":"COUNTIF(elite_adv!A:A,B243)","v":1}]
["Deathwatch Assault Marine","Double Team",200,"Talent",null,0,true,false,{"$f":"AND(COUNTIF(adv!A:A,B244))","v":false},false,{"$f":"COUNTIF(elite_adv!A:A,B244)","v":1}]
["Deathwatch Assault Marine","Takedown",500,"Talent",null,0,true,false,{"$f":"AND(COUNTIF(adv!A:A,B245))","v":false},false,{"$f":"COUNTIF(elite_adv!A:A,B245)","v":1}]
["Deathwatch Assault Marine","Two-weapon Wielder (Ballistic)",500,"Talent","BS 35, Ag 35",0,{"$f":"AND(cha_bs>=35,cha_ag>=30)","v":false},false,{"$f":"AND(COUNTIF(adv!A:A,B246))","v":false},false,{"$f":"COUNTIF(elite_adv!A:A,B246)","v":1}]
["Deathwatch Assault Marine","Two-weapon Wielder (Melee)",500,"Talent","WS 35, Ag 35",0,{"$f":"AND(cha_ws>=35,cha_ag>=30)","v":false},false,{"$f":"AND(COUNTIF(adv!A:A,B247))","v":false},false,{"$f":"COUNTIF(elite_adv!A:A,B247)","v":1}]
["Deathwatch Assault Marine","Pilot (Personal) +10",500,"Skill","Pilot (Personal)",2,{"$f":"AND(COUNTIF(adv!A:A,E248))","v":false},true,{"$f":"AND(COUNTIF(adv!A:A,B248))","v":false},false,{"$f":"COUNTIF(elite_adv!A:A,B248)","v":1}]
["Deathwatch Assault Marine","Crushing Blow",600,"Talent","S 40",2,{"$f":"AND(cha_s>=40)","v":false},false,{"$f":"AND(COUNTIF(adv!A:A,B249))","v":false},false,{"$f":"COUNTIF(elite_adv!A:A,B249)","v":1}]
["Deathwatch Assault Marine","Lightning Attack",600,"Talent","Swift Attack",2,{"$f":"AND(COUNTIF(adv!A:A,E250))","v":false},false,{"$f":"AND(COUNTIF(adv!A:A,B250))","v":false},false,{"$f":"COUNTIF(elite_adv!A:A,B250)","v":1}]
["Deathwatch Assault Marine","Lightning Reflexes",500,"Talent","",2,true,false,{"$f":"AND(COUNTIF(adv!A:A,B251))","v":false},false,{"$f":"COUNTIF(elite_adv!A:A,B251)","v":1}]
["Deathwatch Assault Marine","Sure Strike",500,"Talent","WS 30",2,{"$f":"AND(cha_ws>=30)","v":true},false,{"$f":"AND(COUNTIF(adv!A:A,B252))","v":false},false,{"$f":"COUNTIF(elite_adv!A:A,B252)","v":1}]
["Deathwatch Assault Marine","Acrobatics",400,"Skill","",3,true,false,{"$f":"AND(COUNTIF(adv!A:A,B253))","v":false},false,{"$f":"COUNTIF(elite_adv!A:A,B253)","v":1}]
["Deathwatch Assault Marine","Pilot (Personal) +20",500,"Skill","Pilot (Personal) +10",3,{"$f":"AND(COUNTIF(adv!A:A,E254))","v":false},true,{"$f":"AND(COUNTIF(adv!A:A,B254))","v":false},false,{"$f":"COUNTIF(elite_adv!A:A,B254)","v":1}]
["Deathwatch Assault Marine","Berserk Charge",700,"Talent","",3,true,false,{"$f":"AND(COUNTIF(adv!A:A,B255))","v":false},false,{"$f":"COUNTIF(elite_adv!A:A,B255)","v":1}]
["Deathwatch Assault Marine","Leap Up",500,"Talent","Ag 30",3,{"$f":"AND(cha_ag>=30)","v":true},false,{"$f":"AND(COUNTIF(adv!A:A,B256))","v":false},false,{"$f":"COUNTIF(elite_adv!A:A,B256)","v":1}]
["Deathwatch Assault Marine","Precise Blow",700,"Talent","WS 40, Sure Strike",3,{"$f":"AND(cha_ws>=40,COUNTIF(adv!A:A,\"Sure Strike\"))","v":false},false,{"$f":"AND(COUNTIF(adv!A:A,B257))","v":false},false,{"$f":"COUNTIF(elite_adv!A:A,B257)","v":1}]
["Deathwatch Assault Marine","Sound Constitution (Ass1)",1000,"Talent","",3,true,false,{"$f":"AND(COUNTIF(adv!A:A,B258))","v":false},false,{"$f":"COUNTIF(elite_adv!A:A,B258)","v":0}]
["Deathwatch Assault Marine","Wall of Steel",700,"Talent","Ag 35",3,{"$f":"AND(cha_ag>=35)","v":false},false,{"$f":"AND(COUNTIF(adv!A:A,B259))","v":false},false,{"$f":"COUNTIF(elite_adv!A:A,B259)","v":1}]
["Deathwatch Assault Marine","Counter Attack",600,"Talent","WS 40",4,{"$f":"AND(cha_ws>=40)","v":false},false,{"$f":"AND(COUNTIF(adv!A:A,B260))","v":false},false,{"$f":"COUNTIF(elite_adv!A:A,B260)","v":1}]
["Deathwatch Assault Marine","Dual Strike",500,"Talent","Ag 40, Two-weapon Wielder (Melee)",4,{"$f":"AND(cha_ws>=40,COUNTIF(adv!A:A,\"Two-weapon Wielder (Melee)\"))","v":false},false,{"$f":"AND(COUNTIF(adv!A:A,B261))","v":false},false,{"$f":"COUNTIF(elite_adv!A:A,B261)","v":1}]
["Deathwatch Assault Marine","Hammer Blow",800,"Talent","",4,true,false,{"$f":"AND(COUNTIF(adv!A:A,B262))","v":false},false,{"$f":"COUNTIF(elite_adv!A:A,B262)","v":1}]
["Deathwatch Assault Marine","Acrobatics +10",400,"Skill","Acrobatics",5,{"$f":"AND(COUNTIF(adv!A:A,E263))","v":false},false,{"$f":"AND(COUNTIF(adv!A:A,B263))","v":false},false,{"$f":"COUNTIF(elite_adv!A:A,B263)","v":1}]
["Deathwatch Assault Marine","Assassin Strike",500,"Talent","Ag 40, Acrobatics",5,{"$f":"AND(cha_ag>=40,COUNTIF(adv!A:A,\"Acrobatics\"))","v":false},false,{"$f":"AND(COUNTIF(adv!A:A,B264))","v":false},false,{"$f":"COUNTIF(elite_adv!A:A,B264)","v":1}]
["Deathwatch Assault Marine","Death From Above",900,"Talent","Pilot (Personal)",5,{"$f":"AND(COUNTIF(adv!A:A,E265))","v":false},false,{"$f":"AND(COUNTIF(adv!A:A,B265))","v":false},false,{"$f":"COUNTIF(elite_adv!A:A,B265)","v":1}]
["Deathwatch Assault Marine","Disarm",500,"Talent","Ag 30",5,{"$f":"AND(cha_ag>=30)","v":true},false,{"$f":"AND(COUNTIF(adv!A:A,B266))","v":false},false,{"$f":"COUNTIF(elite_adv!A:A,B266)","v":1}]
["Deathwatch Assault Marine","Furious Assault",500,"Talent","WS 35",5,{"$f":"AND(cha_ws>=35)","v":false},false,{"$f":"AND(COUNTIF(adv!A:A,B267))","v":false},false,{"$f":"COUNTIF(elite_adv!A:A,B267)","v":1}]
["Deathwatch Assault Marine","Blademaster",800,"Talent","WS 30",6,{"$f":"AND(cha_ws>=30)","v":true},false,{"$f":"AND(COUNTIF(adv!A:A,B268))","v":false},false,{"$f":"COUNTIF(elite_adv!A:A,B268)","v":1}]
["Deathwatch Assault Marine","Hard Target",600,"Talent","Ag 40",6,{"$f":"AND(cha_ag>=40)","v":false},false,{"$f":"AND(COUNTIF(adv!A:A,B269))","v":false},false,{"$f":"COUNTIF(elite_adv!A:A,B269)","v":1}]
["Deathwatch Assault Marine","Step Aside",800,"Talent","Ag 40, Dodge",6,{"$f":"AND(cha_ag>=40,COUNTIF(adv!A:A,\"Dodge\"))","v":false},false,{"$f":"AND(COUNTIF(adv!A:A,B270))","v":false},false,{"$f":"COUNTIF(elite_adv!A:A,B270)","v":1}]
["Deathwatch Assault Marine","Acrobatics +20",400,"Skill","Acrobatics +10",7,{"$f":"AND(COUNTIF(adv!A:A,E271))","v":false},false,{"$f":"AND(COUNTIF(adv!A:A,B271))","v":false},false,{"$f":"COUNTIF(elite_adv!A:A,B271)","v":1}]
["Deathwatch Assault Marine","Crippling Strike",400,"Talent","WS 50",7,{"$f":"AND(cha_ws>=50)","v":false},false,{"$f":"AND(COUNTIF(adv!A:A,B272))","v":false},false,{"$f":"COUNTIF(elite_adv!A:A,B272)","v":1}]
["Deathwatch Assault Marine","Dual Shot",600,"Talent","Ag 40, Two-weapon Wielder (Ballistic)",7,{"$f":"AND(cha_ag>=40,COUNTIF(adv!A:A,\"Two-weapon Wielder (Ballistic)\"))","v":false},false,{"$f":"AND(COUNTIF(adv!A:A,B273))","v":false},false,{"$f":"COUNTIF(elite_adv!A:A,B273)","v":1}]
["Deathwatch Assault Marine","Independent Targeting",800,"Talent","BS 40",7,{"$f":"AND(cha_bs>=40)","v":false},false,{"$f":"AND(COUNTIF(adv!A:A,B274))","v":false},false,{"$f":"COUNTIF(elite_adv!A:A,B274)","v":1}]
["Deathwatch Assault Marine","Combat Master",500,"Talent","WS 30",8,{"$f":"AND(cha_ws>=30)","v":true},false,{"$f":"AND(COUNTIF(adv!A:A,B275))","v":false},false,{"$f":"COUNTIF(elite_adv!A:A,B275)","v":1}]
["Deathwatch Assault Marine","Gunslinger",700,"Talent","BS 40, Two-weapon Wielder (Ballistic)",8,{"$f":"AND(cha_bs>=40,COUNTIF(adv!A:A,\"Two-weapon Wielder (Ballistic)\"))","v":false},false,{"$f":"AND(COUNTIF(adv!A:A,B276))","v":false},false,{"$f":"COUNTIF(elite_adv!A:A,B276)","v":1}]
["Deathwatch Assault Marine","Preternatural Speed",1000,"Talent","WS 40, Ag 50",8,{"$f":"AND(cha_ws>=40,cha_ag>=50)","v":false},false,{"$f":"AND(COUNTIF(adv!A:A,B277))","v":false},false,{"$f":"COUNTIF(elite_adv!A:A,B277)","v":1}]
["Deathwatch Assault Marine","Whirlwind of Death",1000,"Talent","",8,true,false,{"$f":"AND(COUNTIF(adv!A:A,B278))","v":false},false,{"$f":"COUNTIF(elite_adv!A:A,B278)","v":1}]
["Deathwatch Devastator Marine","Cleanse and Purify",500,"Talent",null,0,true,false,{"$f":"AND(COUNTIF(adv!A:A,B279))","v":false},false,{"$f":"COUNTIF(elite_adv!A:A,B279)","v":1}]
["Deathwatch Devastator Marine","Exotic Weapon Training (Astartes Conversion Beamer)",500,"Talent",null,0,true,false,{"$f":"AND(COUNTIF(adv!A:A,B280))","v":false},false,{"$f":"COUNTIF(elite_adv!A:A,B280)","v":1}]
["Deathwatch Devastator Marine","Exotic Weapon Training (Astartes Digital Flamer)",500,"Talent",null,0,true,false,{"$f":"AND(COUNTIF(adv!A:A,B281))","v":false},false,{"$f":"COUNTIF(elite_adv!A:A,B281)","v":1}]
["Deathwatch Devastator Marine","Exotic Weapon Training (Astartes Digital Laser)",500,"Talent",null,0,true,false,{"$f":"AND(COUNTIF(adv!A:A,B282))","v":false},false,{"$f":"COUNTIF(elite_adv!A:A,B282)","v":1}]
["Deathwatch Devastator Marine","Exotic Weapon Training (Astartes Digital Melta)",500,"Talent",null,0,true,false,{"$f":"AND(COUNTIF(adv!A:A,B283))","v":false},false,{"$f":"COUNTIF(elite_adv!A:A,B283)","v":1}]
["Deathwatch Devastator Marine","Exotic Weapon Training (Astartes Sniper Rifle)",500,"Talent",null,0,true,false,{"$f":"AND(COUNTIF(adv!A:A,B284))","v":false},false,{"$f":"COUNTIF(elite_adv!A:A,B284)","v":1}]
["Deathwatch Devastator Marine","Mighty Shot",500,"Talent","BS 40",0,{"$f":"AND(cha_bs>=40)","v":false},false,{"$f":"AND(COUNTIF(adv!A:A,B285))","v":false},false,{"$f":"COUNTIF(elite_adv!A:A,B285)","v":1}]
["Deathwatch Devastator Marine","Stalwart Defence",500,"Talent",null,0,true,false,{"$f":"AND(COUNTIF(adv!A:A,B286))","v":false},false,{"$f":"COUNTIF(elite_adv!A:A,B286)","v":1}]
["Deathwatch Devastator Marine","Combat Formation",600,"Talent","Int 40",2,{"$f":"AND(cha_int>=40)","v":false},false,{"$f":"AND(COUNTIF(adv!A:A,B287))","v":false},false,{"$f":"COUNTIF(elite_adv!A:A,B287)","v":1}]
["Deathwatch Devastator Marine","Crack Shot",500,"Talent","BS 40",2,{"$f":"AND(cha_bs>=40)","v":false},false,{"$f":"AND(COUNTIF(adv!A:A,B288))","v":false},false,{"$f":"COUNTIF(elite_adv!A:A,B288)","v":1}]
["Deathwatch Devastator Marine","Deadeye Shot",500,"Talent","BS 30",2,{"$f":"AND(cha_bs>=30)","v":true},false,{"$f":"AND(COUNTIF(adv!A:A,B289))","v":false},false,{"$f":"COUNTIF(elite_adv!A:A,B289)","v":1}]
["Deathwatch Devastator Marine","Die Hard",500,"Talent","WP 40",2,{"$f":"AND(cha_wp>=40)","v":false},false,{"$f":"AND(COUNTIF(adv!A:A,B290))","v":false},false,{"$f":"COUNTIF(elite_adv!A:A,B290)","v":1}]
["Deathwatch Devastator Marine","Iron Jaw",500,"Talent","T 40",2,{"$f":"AND(cha_t>=40)","v":false},false,{"$f":"AND(COUNTIF(adv!A:A,B291))","v":false},false,{"$f":"COUNTIF(elite_adv!A:A,B291)","v":1}]
["Deathwatch Devastator Marine","Bolter Drill",800,"Talent","",3,true,false,{"$f":"AND(COUNTIF(adv!A:A,B292))","v":false},false,{"$f":"COUNTIF(elite_adv!A:A,B292)","v":1}]
["Deathwatch Devastator Marine","Hip Shooting",500,"Talent","BS 40, Ag 40",3,{"$f":"AND(cha_bs>=40,cha_ag>=40)","v":false},false,{"$f":"AND(COUNTIF(adv!A:A,B293))","v":false},false,{"$f":"COUNTIF(elite_adv!A:A,B293)","v":1}]
["Deathwatch Devastator Marine","Sound Constitution (Dev1)",1000,"Talent","",3,true,false,{"$f":"AND(COUNTIF(adv!A:A,B294))","v":false},false,{"$f":"COUNTIF(elite_adv!A:A,B294)","v":0}]
["Deathwatch Devastator Marine","Target Selection",500,"Talent","BS 50",3,{"$f":"AND(cha_bs>=50)","v":false},false,{"$f":"AND(COUNTIF(adv!A:A,B295))","v":false},false,{"$f":"COUNTIF(elite_adv!A:A,B295)","v":1}]
["Deathwatch Devastator Marine","Marksman",500,"Talent","BS 35",4,{"$f":"AND(cha_bs>=35)","v":false},false,{"$f":"AND(COUNTIF(adv!A:A,B296))","v":false},false,{"$f":"COUNTIF(elite_adv!A:A,B296)","v":1}]
["Deathwatch Devastator Marine","Rapid Reload",200,"Talent","",4,true,false,{"$f":"AND(COUNTIF(adv!A:A,B297))","v":false},false,{"$f":"COUNTIF(elite_adv!A:A,B297)","v":1}]
["Deathwatch Devastator Marine","Storm of Iron",500,"Talent","",4,true,false,{"$f":"AND(COUNTIF(adv!A:A,B298))","v":false},false,{"$f":"COUNTIF(elite_adv!A:A,B298)","v":1}]
["Deathwatch Devastator Marine","Hardy",600,"Talent","T 40",5,{"$f":"AND(cha_t>=40)","v":false},false,{"$f":"AND(COUNTIF(adv!A:A,B299))","v":false},false,{"$f":"COUNTIF(elite_adv!A:A,B299)","v":1}]
["Deathwatch Devastator Marine","Sharpshooter",600,"Talent","BS 40, Deadeye Shot",5,{"$f":"AND(cha_bs>=40,COUNTIF(adv!A:A,\"Deadeye Shot\"))","v":false},false,{"$f":"AND(COUNTIF(adv!A:A,B300))","v":false},false,{"$f":"COUNTIF(elite_adv!A:A,B300)","v":1}]
["Deathwatch Devastator Marine","Sound Constitution (Dev2)",1000,"Talent","",5,true,false,{"$f":"AND(COUNTIF(adv!A:A,B301))","v":false},false,{"$f":"COUNTIF(elite_adv!A:A,B301)","v":0}]
["Deathwatch Devastator Marine","Tech-Use",500,"Skill","",6,true,false,{"$f":"AND(COUNTIF(adv!A:A,B302))","v":false},false,{"$f":"COUNTIF(elite_adv!A:A,B302)","v":1}]
["Deathwatch Devastator Marine","Rapid Reaction",200,"Talent","Ag 40",6,{"$f":"AND(cha_ag>=40)","v":false},false,{"$f":"AND(COUNTIF(adv!A:A,B303))","v":false},false,{"$f":"COUNTIF(elite_adv!A:A,B303)","v":1}]
["Deathwatch Devastator Marine","Sound Constitution (Dev3)",1000,"Talent","",6,true,false,{"$f":"AND(COUNTIF(adv!A:A,B304))","v":false},false,{"$f":"COUNTIF(elite_adv!A:A,B304)","v":0}]
["Deathwatch Devastator Marine","Tech-Use +10",700,"Skill","Tech-Use",7,{"$f":"AND(COUNTIF(adv!A:A,E305))","v":false},false,{"$f":"AND(COUNTIF(adv!A:A,B305))","v":false},false,{"$f":"COUNTIF(elite_adv!A:A,B305)","v":1}]
["Deathwatch Devastator Marine","Eye of Vengeance",1000,"Talent","BS 50",7,{"$f":"AND(cha_bs>=50)","v":false},false,{"$f":"AND(COUNTIF(adv!A:A,B306))","v":false},false,{"$f":"COUNTIF(elite_adv!A:A,B306)","v":1}]
["Deathwatch Devastator Marine","Sound Constitution (Dev4)",1000,"Talent","",7,true,false,{"$f":"AND(COUNTIF(adv!A:A,B307))","v":false},false,{"$f":"COUNTIF(elite_adv!A:A,B307)","v":0}]
["Deathwatch Devastator Marine","Sound Constitution (Dev5)",1000,"Talent","",7,true,false,{"$f":"AND(COUNTIF(adv!A:A,B308))","v":false},false,{"$f":"COUNTIF(elite_adv!A:A,B308)","v":0}]
["Deathwatch Devastator Marine","Tech-Use +20",800,"Skill","Tech-Use +10",8,{"$f":"AND(COUNTIF(adv!A:A,E309))","v":false},false,{"$f":"AND(COUNTIF(adv!A:A,B309))","v":false},false,{"$f":"COUNTIF(elite_adv!A:A,B309)","v":1}]
["Deathwatch Devastator Marine","Sound Constitution (Dev6)",800,"Talent","",8,true,false,{"$f":"AND(COUNTIF(adv!A:A,B310))","v":false},false,{"$f":"COUNTIF(elite_adv!A:A,B310)","v":0}]
["Deathwatch Devastator Marine","Swift Attack",700,"Talent","WS 35",8,{"$f":"AND(cha_ws>=35)","v":false},false,{"$f":"AND(COUNTIF(adv!A:A,B311))","v":false},false,{"$f":"COUNTIF(elite_adv!A:A,B311)","v":1}]
["Deathwatch Librarian","Invocation",400,"Skill",null,0,true,false,{"$f":"AND(COUNTIF(adv!A:A,B312))","v":false},false,{"$f":"COUNTIF(elite_adv!A:A,B312)","v":1}]
["Deathwatch Librarian","Lore: Common (any)",400,"Skill",null,0,true,true,{"$f":"AND(COUNTIF(adv!A:A,B313))","v":false},false,{"$f":"COUNTIF(elite_adv!A:A,B313)","v":0}]
["Deathwatch Librarian","Lore: Forbidden (Adeptus Astartes)",200,"Skill",null,0,true,true,{"$f":"AND(COUNTIF(adv!A:A,B314))","v":false},false,{"$f":"COUNTIF(elite_adv!A:A,B314)","v":1}]
["Deathwatch Librarian","Lore: Forbidden (Psykers)",400,"Skill",null,0,true,true,{"$f":"AND(COUNTIF(adv!A:A,B315))","v":false},false,{"$f":"COUNTIF(elite_adv!A:A,B315)","v":1}]
["Deathwatch Librarian","Lore: Forbidden (The Warp)",400,"Skill",null,0,true,true,{"$f":"AND(COUNTIF(adv!A:A,B316))","v":false},false,{"$f":"COUNTIF(elite_adv!A:A,B316)","v":1}]
["Deathwatch Librarian","Lore: Scholastic (any)",400,"Skill",null,0,true,true,{"$f":"AND(COUNTIF(adv!A:A,B317))","v":false},false,{"$f":"COUNTIF(elite_adv!A:A,B317)","v":0}]
["Deathwatch Librarian","Psyniscience",400,"Skill",null,0,true,false,{"$f":"AND(COUNTIF(adv!A:A,B318))","v":false},false,{"$f":"COUNTIF(elite_adv!A:A,B318)","v":1}]
["Deathwatch Librarian","Foresight",600,"Talent","Int 30",0,{"$f":"AND(cha_int>=30)","v":true},false,{"$f":"AND(COUNTIF(adv!A:A,B319))","v":false},false,{"$f":"COUNTIF(elite_adv!A:A,B319)","v":1}]
["Deathwatch Librarian","Psychic Power (any)",null,"Talent","Varies",0,true,true,{"$f":"AND(COUNTIF(adv!A:A,B320))","v":false},false,{"$f":"COUNTIF(elite_adv!A:A,B320)","v":0}]
["Deathwatch Librarian","Rite of Sanctioning",400,"Talent","Psy Rating",0,{"$f":"AND(psyrating)","v":false},false,{"$f":"AND(COUNTIF(adv!A:A,B321))","v":false},false,{"$f":"COUNTIF(elite_adv!A:A,B321)","v":1}]
["Deathwatch Librarian","Warp Sense",500,"Talent","Psy Rating, Psyniscience, Per 30",0,{"$f":"AND(psyrating,COUNTIF(adv!A:A,\"Psyniscience\"),cha_per>=30)","v":false},false,{"$f":"AND(COUNTIF(adv!A:A,B322))","v":false},false,{"$f":"COUNTIF(elite_adv!A:A,B322)","v":1}]
["Deathwatch Librarian","Invocation +10",400,"Skill","Invocation",2,{"$f":"AND(COUNTIF(adv!A:A,E323))","v":false},false,{"$f":"AND(COUNTIF(adv!A:A,B323))","v":false},false,{"$f":"COUNTIF(elite_adv!A:A,B323)","v":1}]
["Deathwatch Librarian","Lore: Forbidden (Adeptus Astartes) +10",200,"Skill","Lore: Forbidden (Adeptus Astartes)",2,{"$f":"AND(COUNTIF(adv!A:A,E324))","v":false},true,{"$f":"AND(COUNTIF(adv!A:A,B324))","v":false},false,{"$f":"COUNTIF(elite_adv!A:A,B324)","v":1}]
["Deathwatch Librarian","Lore: Forbidden (Daemonology)",400,"Skill","",2,true,true,{"$f":"AND(COUNTIF(adv!A:A,B325))","v":false},false,{"$f":"COUNTIF(elite_adv!A:A,B325)","v":1}]
["Deathwatch Librarian","Lore: Forbidden (Psykers) +10",400,"Skill","Lore: Forbidden (Psykers)",2,{"$f":"AND(COUNTIF(adv!A:A,E326))","v":false},true,{"$f":"AND(COUNTIF(adv!A:A,B326))","v":false},false,{"$f":"COUNTIF(elite_adv!A:A,B326)","v":1}]
["Deathwatch Librarian","Lore: Forbidden (The Traitor Legions)",400,"Skill","",2,true,true,{"$f":"AND(COUNTIF(adv!A:A,B327))","v":false},false,{"$f":"COUNTIF(elite_adv!A:A,B327)","v":1}]
["Deathwatch Librarian","Lore: Forbidden (The Warp) +10",400,"Skill","Lore: Forbidden (The Warp)",2,{"$f":"AND(COUNTIF(adv!A:A,E328))","v":false},true,{"$f":"AND(COUNTIF(adv!A:A,B328))","v":false},false,{"$f":"COUNTIF(elite_adv!A:A,B328)","v":1}]
["Deathwatch Librarian","Lore: Scholastic (any) +10",400,"Skill","Lore: Scholastic (same skill group)",2,true,true,{"$f":"AND(COUNTIF(adv!A:A,B329))","v":false},false,{"$f":"COUNTIF(elite_adv!A:A,B329)","v":0}]
["Deathwatch Librarian","Psyniscience +10",400,"Skill","Psyniscience",2,{"$f":"AND(COUNTIF(adv!A:A,E330))","v":false},false,{"$f":"AND(COUNTIF(adv!A:A,B330))","v":false},false,{"$f":"COUNTIF(elite_adv!A:A,B330)","v":1}]
["Deathwatch Librarian","Psy Rating 4",500,"Talent","Psy Rating 3",2,{"$f":"AND(psyrating>=3)","v":false},false,{"$f":"AND(COUNTIF(adv!A:A,B331))","v":false},false,{"$f":"COUNTIF(elite_adv!A:A,B331)","v":1}]
["Deathwatch Librarian","Ciphers (Chapter Runes)",400,"Skill",null,3,true,true,{"$f":"AND(COUNTIF(adv!A:A,B332))","v":false},false,{"$f":"COUNTIF(elite_adv!A:A,B332)","v":1}]
["Deathwatch Librarian","Ciphers (Deathwatch)",400,"Skill",null,3,true,true,{"$f":"AND(COUNTIF(adv!A:A,B333))","v":false},false,{"$f":"COUNTIF(elite_adv!A:A,B333)","v":1}]
["Deathwatch Librarian","Ciphers (Imperial Codes)",400,"Skill",null,3,true,true,{"$f":"AND(COUNTIF(adv!A:A,B334))","v":false},false,{"$f":"COUNTIF(elite_adv!A:A,B334)","v":1}]
["Deathwatch Librarian","Ciphers (Inquisition)",400,"Skill",null,3,true,true,{"$f":"AND(COUNTIF(adv!A:A,B335))","v":false},false,{"$f":"COUNTIF(elite_adv!A:A,B335)","v":1}]
["Deathwatch Librarian","Ciphers (Mercenary Cant)",400,"Skill",null,3,true,true,{"$f":"AND(COUNTIF(adv!A:A,B336))","v":false},false,{"$f":"COUNTIF(elite_adv!A:A,B336)","v":1}]
["Deathwatch Librarian","Ciphers (Underworld)",400,"Skill",null,3,true,true,{"$f":"AND(COUNTIF(adv!A:A,B337))","v":false},false,{"$f":"COUNTIF(elite_adv!A:A,B337)","v":1}]
["Deathwatch Librarian","Ciphers (Xenos Markings)",400,"Skill",null,3,true,true,{"$f":"AND(COUNTIF(adv!A:A,B338))","v":false},false,{"$f":"COUNTIF(elite_adv!A:A,B338)","v":1}]
["Deathwatch Librarian","Invocation +20",400,"Skill","Invocation +10",3,{"$f":"AND(COUNTIF(adv!A:A,E339))","v":false},false,{"$f":"AND(COUNTIF(adv!A:A,B339))","v":false},false,{"$f":"COUNTIF(elite_adv!A:A,B339)","v":1}]
["Deathwatch Librarian","Lore: Common (any) +10",400,"Skill","Lore: Common (same skill group)",3,true,true,{"$f":"AND(COUNTIF(adv!A:A,B340))","v":false},false,{"$f":"COUNTIF(elite_adv!A:A,B340)","v":0}]
["Deathwatch Librarian","Lore: Forbidden (Adeptus Astartes) +20",200,"Skill","Lore: Forbidden (Adeptus Astartes) +10",3,{"$f":"AND(COUNTIF(adv!A:A,E341))","v":false},true,{"$f":"AND(COUNTIF(adv!A:A,B341))","v":false},false,{"$f":"COUNTIF(elite_adv!A:A,B341)","v":1}]
["Deathwatch Librarian","Lore: Forbidden (Daemonology) +10",800,"Skill","Lore: Forbidden (Daemonology)",3,{"$f":"AND(COUNTIF(adv!A:A,E342))","v":false},true,{"$f":"AND(COUNTIF(adv!A:A,B342))","v":false},false,{"$f":"COUNTIF(elite_adv!A:A,B342)","v":1}]
["Deathwatch Librarian","Lore: Forbidden (Heresy)",800,"Skill","",3,true,true,{"$f":"AND(COUNTIF(adv!A:A,B343))","v":false},false,{"$f":"COUNTIF(elite_adv!A:A,B343)","v":1}]
["Deathwatch Librarian","Lore: Forbidden (Psykers) +20",400,"Skill","Lore: Forbidden (Psykers) +10",3,{"$f":"AND(COUNTIF(adv!A:A,E344))","v":false},true,{"$f":"AND(COUNTIF(adv!A:A,B344))","v":false},false,{"$f":"COUNTIF(elite_adv!A:A,B344)","v":1}]
["Deathwatch Librarian","Lore: Forbidden (The Traitor Legions) +10",400,"Skill","Lore: Forbidden (The Traitor Legions)",3,{"$f":"AND(COUNTIF(adv!A:A,E345))","v":false},true,{"$f":"AND(COUNTIF(adv!A:A,B345))","v":false},false,{"$f":"COUNTIF(elite_adv!A:A,B345)","v":1}]
["Deathwatch Librarian","Lore: Forbidden (The Warp) +20",400,"Skill","Lore: Forbidden (The Warp) +10",3,{"$f":"AND(COUNTIF(adv!A:A,E346))","v":false},true,{"$f":"AND(COUNTIF(adv!A:A,B346))","v":false},false,{"$f":"COUNTIF(elite_adv!A:A,B346)","v":1}]
["Deathwatch Librarian","Lore: Scholastic (any) +20",400,"Skill","Lore: Scholastic (same skill group) +10",3,true,true,{"$f":"AND(COUNTIF(adv!A:A,B347))","v":false},false,{"$f":"COUNTIF(elite_adv!A:A,B347)","v":0}]
["Deathwatch Librarian","Psyniscience +20",400,"Skill","Psyniscience +10",3,{"$f":"AND(COUNTIF(adv!A:A,E348))","v":false},false,{"$f":"AND(COUNTIF(adv!A:A,B348))","v":false},false,{"$f":"COUNTIF(elite_adv!A:A,B348)","v":1}]
["Deathwatch Librarian","Meditation",500,"Talent","",3,true,false,{"$f":"AND(COUNTIF(adv!A:A,B349))","v":false},false,{"$f":"COUNTIF(elite_adv!A:A,B349)","v":1}]
["Deathwatch Librarian","Psy Rating 5",500,"Talent","Psy Rating 4",3,{"$f":"AND(psyrating>=4)","v":false},false,{"$f":"AND(COUNTIF(adv!A:A,B350))","v":false},false,{"$f":"COUNTIF(elite_adv!A:A,B350)","v":1}]
["Deathwatch Librarian","Strong Minded",800,"Talent","",3,true,false,{"$f":"AND(COUNTIF(adv!A:A,B351))","v":false},false,{"$f":"COUNTIF(elite_adv!A:A,B351)","v":1}]
["Deathwatch Librarian","Swift Attack",700,"Talent","WS 35",3,{"$f":"AND(cha_ws>=35)","v":false},false,{"$f":"AND(COUNTIF(adv!A:A,B352))","v":false},false,{"$f":"COUNTIF(elite_adv!A:A,B352)","v":1}]
["Deathwatch Librarian","Lore: Forbidden (Daemonology) +20",800,"Skill","Lore: Forbidden (Daemonology) +10",4,{"$f":"AND(COUNTIF(adv!A:A,E353))","v":false},true,{"$f":"AND(COUNTIF(adv!A:A,B353))","v":false},false,{"$f":"COUNTIF(elite_adv!A:A,B353)","v":1}]
["Deathwatch Librarian","Lore: Forbidden (Heresy) +10",800,"Skill","Lore: Forbidden (Heresy)",4,{"$f":"AND(COUNTIF(adv!A:A,E354))","v":false},true,{"$f":"AND(COUNTIF(adv!A:A,B354))","v":false},false,{"$f":"COUNTIF(elite_adv!A:A,B354)","v":1}]
["Deathwatch Librarian","Lore: Forbidden (The Traitor Legions) +20",400,"Skill","Lore: Forbidden (The Traitor Legions) +10",4,{"$f":"AND(COUNTIF(adv!A:A,E355))","v":false},true,{"$f":"AND(COUNTIF(adv!A:A,B355))","v":false},false,{"$f":"COUNTIF(elite_adv!A:A,B355)","v":1}]
["Deathwatch Librarian","Combat Sense",100,"Talent","Per 40",4,{"$f":"AND(cha_per>=40)","v":false},false,{"$f":"AND(COUNTIF(adv!A:A,B356))","v":false},false,{"$f":"COUNTIF(elite_adv!A:A,B356)","v":1}]
["Deathwatch Librarian","Improved Warp Sense",1500,"Talent","Warp Sense",4,{"$f":"AND(COUNTIF(adv!A:A,E357))","v":false},false,{"$f":"AND(COUNTIF(adv!A:A,B357))","v":false},false,{"$f":"COUNTIF(elite_adv!A:A,B357)","v":1}]
["Deathwatch Librarian","Infused Knowledge",1000,"Talent","Int 40",4,{"$f":"AND(cha_int>=40)","v":false},false,{"$f":"AND(COUNTIF(adv!A:A,B358))","v":false},false,{"$f":"COUNTIF(elite_adv!A:A,B358)","v":1}]
["Deathwatch Librarian","Lightning Reflexes",1000,"Talent","",4,true,false,{"$f":"AND(COUNTIF(adv!A:A,B359))","v":false},false,{"$f":"COUNTIF(elite_adv!A:A,B359)","v":1}]
["Deathwatch Librarian","Psy Rating 6",1000,"Talent","Psy Rating 5",4,{"$f":"AND(psyrating>=5)","v":false},false,{"$f":"AND(COUNTIF(adv!A:A,B360))","v":false},false,{"$f":"COUNTIF(elite_adv!A:A,B360)","v":1}]
["Deathwatch Librarian","Warp Conduit",1000,"Talent","WP 30, Resistance (Psychic Powers)",4,{"$f":"AND(cha_wp>=30,COUNTIF(adv!A:A,\"Resistance (Psychic Powers)\"))","v":false},false,{"$f":"AND(COUNTIF(adv!A:A,B361))","v":false},false,{"$f":"COUNTIF(elite_adv!A:A,B361)","v":1}]
["Deathwatch Librarian","Ciphers (any) +10",400,"Skill","Ciphers (same skill group)",5,true,true,{"$f":"AND(COUNTIF(adv!A:A,B362))","v":false},false,{"$f":"COUNTIF(elite_adv!A:A,B362)","v":0}]
["Deathwatch Librarian","Lore: Common (any) +20",400,"Skill","Lore: Common (same skill group) +10",5,true,true,{"$f":"AND(COUNTIF(adv!A:A,B363))","v":false},false,{"$f":"COUNTIF(elite_adv!A:A,B363)","v":0}]
["Deathwatch Librarian","Lore: Forbidden (Heresy) +20",800,"Skill","Lore: Forbidden (Heresy) +10",5,{"$f":"AND(COUNTIF(adv!A:A,E364))","v":false},true,{"$f":"AND(COUNTIF(adv!A:A,B364))","v":false},false,{"$f":"COUNTIF(elite_adv!A:A,B364)","v":1}]
["Deathwatch Librarian","Psy Rating 7",1200,"Talent","Psy Rating 6",5,{"$f":"AND(psyrating>=6)","v":false},false,{"$f":"AND(COUNTIF(adv!A:A,B365))","v":false},false,{"$f":"COUNTIF(elite_adv!A:A,B365)","v":1}]
["Deathwatch Librarian","Bastion of Iron Will",1000,"Talent","Psy Rating, Strong Minded, WP 40",6,{"$f":"AND(psyrating>=1,COUNTIF(adv!A:A,\"Strong Minded\"),cha_wp>=40)","v":false},false,{"$f":"AND(COUNTIF(adv!A:A,B366))","v":false},false,{"$f":"COUNTIF(elite_adv!A:A,B366)","v":1}]
["Deathwatch Librarian","Disturbing Voice",500,"Talent","",6,true,false,{"$f":"AND(COUNTIF(adv!A:A,B367))","v":false},false,{"$f":"COUNTIF(elite_adv!A:A,B367)","v":1}]
["Deathwatch Librarian","Psy Rating 8",1500,"Talent","Psy Rating 7",6,{"$f":"AND(psyrating>=7)","v":false},false,{"$f":"AND(COUNTIF(adv!A:A,B368))","v":false},false,{"$f":"COUNTIF(elite_adv!A:A,B368)","v":1}]
["Deathwatch Librarian","Step Aside",500,"Talent","Ag 40, Dodge",6,{"$f":"AND(cha_ag>=40,COUNTIF(adv!A:A,\"Dodge\"))","v":false},false,{"$f":"AND(COUNTIF(adv!A:A,B369))","v":false},false,{"$f":"COUNTIF(elite_adv!A:A,B369)","v":1}]
["Deathwatch Librarian","Ciphers (any) +20",400,"Skill","Ciphers (same skill group) +10",7,true,true,{"$f":"AND(COUNTIF(adv!A:A,B370))","v":false},false,{"$f":"COUNTIF(elite_adv!A:A,B370)","v":0}]
["Deathwatch Librarian","Crushing Blow",800,"Talent","S 40",7,{"$f":"AND(cha_s>=40)","v":false},false,{"$f":"AND(COUNTIF(adv!A:A,B371))","v":false},false,{"$f":"COUNTIF(elite_adv!A:A,B371)","v":1}]
["Deathwatch Librarian","Favoured by the Warp",800,"Talent","WP 35",7,{"$f":"AND(cha_wp>=35)","v":false},false,{"$f":"AND(COUNTIF(adv!A:A,B372))","v":false},false,{"$f":"COUNTIF(elite_adv!A:A,B372)","v":1}]
["Deathwatch Librarian","Lightning Attack",800,"Talent","Swift Attack",7,{"$f":"AND(COUNTIF(adv!A:A,E373))","v":false},false,{"$f":"AND(COUNTIF(adv!A:A,B373))","v":false},false,{"$f":"COUNTIF(elite_adv!A:A,B373)","v":1}]
["Deathwatch Librarian","Psy Rating 9",2000,"Talent","Psy Rating 8",7,{"$f":"AND(psyrating>=8)","v":false},false,{"$f":"AND(COUNTIF(adv!A:A,B374))","v":false},false,{"$f":"COUNTIF(elite_adv!A:A,B374)","v":1}]
["Deathwatch Librarian","Furious Assault",800,"Talent","WS 35",8,{"$f":"AND(cha_ws>=35)","v":false},false,{"$f":"AND(COUNTIF(adv!A:A,B375))","v":false},false,{"$f":"COUNTIF(elite_adv!A:A,B375)","v":1}]
["Deathwatch Librarian","Preternatural Speed",2000,"Talent","WS 40, Ag 50",8,{"$f":"AND(cha_ws>=40,cha_ag>=50)","v":false},false,{"$f":"AND(COUNTIF(adv!A:A,B376))","v":false},false,{"$f":"COUNTIF(elite_adv!A:A,B376)","v":1}]
["Deathwatch Librarian","Psy Rating 10",2500,"Talent","Psy Rating 9",8,{"$f":"AND(psyrating>=9)","v":false},false,{"$f":"AND(COUNTIF(adv!A:A,B377))","v":false},false,{"$f":"COUNTIF(elite_adv!A:A,B377)","v":1}]
["Deathwatch Tactical Marine","Air of Authority",500,"Talent","Fel 30",0,{"$f":"AND(cha_fel>=30)","v":true},false,{"$f":"AND(COUNTIF(adv!A:A,B378))","v":false},false,{"$f":"COUNTIF(elite_adv!A:A,B378)","v":1}]
["Deathwatch Tactical Marine","Astartes Weapon Specialisation",1000,"Talent","Astartes Weapon Training",0,{"$f":"AND(COUNTIF(adv!A:A,E379))","v":false},false,{"$f":"AND(COUNTIF(adv!A:A,B379))","v":false},false,{"$f":"COUNTIF(elite_adv!A:A,B379)","v":1}]
["Deathwatch Tactical Marine","Double Team",200,"Talent",null,0,true,false,{"$f":"AND(COUNTIF(adv!A:A,B380))","v":false},false,{"$f":"COUNTIF(elite_adv!A:A,B380)","v":1}]
["Deathwatch Tactical Marine","Rapid Reload",200,"Talent",null,0,true,false,{"$f":"AND(COUNTIF(adv!A:A,B381))","v":false},false,{"$f":"COUNTIF(elite_adv!A:A,B381)","v":1}]
["Deathwatch Tactical Marine","Combat Sense",500,"Talent","Per 40",2,{"$f":"AND(cha_per>=40)","v":false},false,{"$f":"AND(COUNTIF(adv!A:A,B382))","v":false},false,{"$f":"COUNTIF(elite_adv!A:A,B382)","v":1}]
["Deathwatch Tactical Marine","Hip Shooting",500,"Talent","BS 40, Ag 40",2,{"$f":"AND(cha_bs>=40,cha_ag>=40)","v":false},false,{"$f":"AND(COUNTIF(adv!A:A,B383))","v":false},false,{"$f":"COUNTIF(elite_adv!A:A,B383)","v":1}]
["Deathwatch Tactical Marine","Mighty Shot",500,"Talent","BS 40",2,{"$f":"AND(cha_bs>=40)","v":false},false,{"$f":"AND(COUNTIF(adv!A:A,B384))","v":false},false,{"$f":"COUNTIF(elite_adv!A:A,B384)","v":1}]
["Deathwatch Tactical Marine","Cleanse and Purify",400,"Talent","",3,true,false,{"$f":"AND(COUNTIF(adv!A:A,B385))","v":false},false,{"$f":"COUNTIF(elite_adv!A:A,B385)","v":1}]
["Deathwatch Tactical Marine","Combat Formation",600,"Talent","Int 40",3,{"$f":"AND(cha_int>=40)","v":false},false,{"$f":"AND(COUNTIF(adv!A:A,B386))","v":false},false,{"$f":"COUNTIF(elite_adv!A:A,B386)","v":1}]
["Deathwatch Tactical Marine","Iron Discipline",600,"Talent","WP 30, Command",3,{"$f":"AND(cha_wp>=30,COUNTIF(adv!A:A,\"Command\"))","v":false},false,{"$f":"AND(COUNTIF(adv!A:A,B387))","v":false},false,{"$f":"COUNTIF(elite_adv!A:A,B387)","v":1}]
["Deathwatch Tactical Marine","Marksman",600,"Talent","BS 35",3,{"$f":"AND(cha_bs>=35)","v":false},false,{"$f":"AND(COUNTIF(adv!A:A,B388))","v":false},false,{"$f":"COUNTIF(elite_adv!A:A,B388)","v":1}]
["Deathwatch Tactical Marine","Call to Vengeance",1000,"Talent","Fel 40",4,{"$f":"AND(cha_fel>=40)","v":false},false,{"$f":"AND(COUNTIF(adv!A:A,B389))","v":false},false,{"$f":"COUNTIF(elite_adv!A:A,B389)","v":1}]
["Deathwatch Tactical Marine","Deadeye Shot",500,"Talent","BS 30",4,{"$f":"AND(cha_bs>=30)","v":true},false,{"$f":"AND(COUNTIF(adv!A:A,B390))","v":false},false,{"$f":"COUNTIF(elite_adv!A:A,B390)","v":1}]
["Deathwatch Tactical Marine","Storm of Iron",800,"Talent","",4,true,false,{"$f":"AND(COUNTIF(adv!A:A,B391))","v":false},false,{"$f":"COUNTIF(elite_adv!A:A,B391)","v":1}]
["Deathwatch Tactical Marine","Target Selection",800,"Talent","BS 50",4,{"$f":"AND(cha_bs>=50)","v":false},false,{"$f":"AND(COUNTIF(adv!A:A,B392))","v":false},false,{"$f":"COUNTIF(elite_adv!A:A,B392)","v":1}]
["Deathwatch Tactical Marine","Bolter Drill",1000,"Talent","",5,true,false,{"$f":"AND(COUNTIF(adv!A:A,B393))","v":false},false,{"$f":"COUNTIF(elite_adv!A:A,B393)","v":1}]
["Deathwatch Tactical Marine","Sound Constitution (Tac1)",1000,"Talent","",5,true,false,{"$f":"AND(COUNTIF(adv!A:A,B394))","v":false},false,{"$f":"COUNTIF(elite_adv!A:A,B394)","v":0}]
["Deathwatch Tactical Marine","Two-weapon Wielder (Ballistic)",800,"Talent","BS 35, Ag 35",5,{"$f":"AND(cha_bs>=35,cha_ag>=35)","v":false},false,{"$f":"AND(COUNTIF(adv!A:A,B395))","v":false},false,{"$f":"COUNTIF(elite_adv!A:A,B395)","v":1}]
["Deathwatch Tactical Marine","Unbowed and Unbroken",800,"Talent","Fel 40",5,{"$f":"AND(cha_fel>=40)","v":false},false,{"$f":"AND(COUNTIF(adv!A:A,B396))","v":false},false,{"$f":"COUNTIF(elite_adv!A:A,B396)","v":1}]
["Deathwatch Tactical Marine","Into the Jaws of Hell",600,"Talent","Iron Discipline",6,{"$f":"AND(COUNTIF(adv!A:A,E397))","v":false},false,{"$f":"AND(COUNTIF(adv!A:A,B397))","v":false},false,{"$f":"COUNTIF(elite_adv!A:A,B397)","v":1}]
["Deathwatch Tactical Marine","Master Orator",700,"Talent","Fel 30",6,{"$f":"AND(cha_fel>=30)","v":true},false,{"$f":"AND(COUNTIF(adv!A:A,B398))","v":false},false,{"$f":"COUNTIF(elite_adv!A:A,B398)","v":1}]
["Deathwatch Tactical Marine","Sharpshooter",600,"Talent","BS 40, Deadeye Shot",6,{"$f":"AND(cha_bs>=40,COUNTIF(adv!A:A,\"Deadeye Shot\"))","v":false},false,{"$f":"AND(COUNTIF(adv!A:A,B399))","v":false},false,{"$f":"COUNTIF(elite_adv!A:A,B399)","v":1}]
["Deathwatch Tactical Marine","Swift Attack",500,"Talent","WS 35",6,{"$f":"AND(cha_ws>=35)","v":false},false,{"$f":"AND(COUNTIF(adv!A:A,B400))","v":false},false,{"$f":"COUNTIF(elite_adv!A:A,B400)","v":1}]
["Deathwatch Tactical Marine","Foresight",800,"Talent","Int 40",7,{"$f":"AND(cha_int>=40)","v":false},false,{"$f":"AND(COUNTIF(adv!A:A,B401))","v":false},false,{"$f":"COUNTIF(elite_adv!A:A,B401)","v":1}]
["Deathwatch Tactical Marine","Hard Target",800,"Talent","Ag 40",7,{"$f":"AND(cha_ag>=40)","v":false},false,{"$f":"AND(COUNTIF(adv!A:A,B402))","v":false},false,{"$f":"COUNTIF(elite_adv!A:A,B402)","v":1}]
["Deathwatch Tactical Marine","Independent Targeting",800,"Talent","BS 40",7,{"$f":"AND(cha_bs>=40)","v":false},false,{"$f":"AND(COUNTIF(adv!A:A,B403))","v":false},false,{"$f":"COUNTIF(elite_adv!A:A,B403)","v":1}]
["Deathwatch Tactical Marine","Eye of Vengeance",1000,"Talent","BS 50",8,{"$f":"AND(cha_bs>=50)","v":false},false,{"$f":"AND(COUNTIF(adv!A:A,B404))","v":false},false,{"$f":"COUNTIF(elite_adv!A:A,B404)","v":1}]
["Deathwatch Tactical Marine","Gunslinger",1000,"Talent","BS 40, Two-weapon Wielder (Ballistic)",8,{"$f":"AND(cha_bs>=40,COUNTIF(adv!A:A,\"Two-weapon Wielder (Ballistic)\"))","v":false},false,{"$f":"AND(COUNTIF(adv!A:A,B405))","v":false},false,{"$f":"COUNTIF(elite_adv!A:A,B405)","v":1}]
["Deathwatch Tactical Marine","Stalwart Defence",800,"Talent","",8,true,false,{"$f":"AND(COUNTIF(adv!A:A,B406))","v":false},false,{"$f":"COUNTIF(elite_adv!A:A,B406)","v":1}]
["Deathwatch Techmarine","Lore: Forbidden (Adeptus Mechanicus)",400,"Skill",null,0,true,true,{"$f":"AND(COUNTIF(adv!A:A,B407))","v":false},false,{"$f":"COUNTIF(elite_adv!A:A,B407)","v":1}]
["Deathwatch Techmarine","Security",400,"Skill",null,0,true,false,{"$f":"AND(COUNTIF(adv!A:A,B408))","v":false},false,{"$f":"COUNTIF(elite_adv!A:A,B408)","v":1}]
["Deathwatch Techmarine","Speak Language (Techna-Lingua)",200,"Skill",null,0,true,true,{"$f":"AND(COUNTIF(adv!A:A,B409))","v":false},false,{"$f":"COUNTIF(elite_adv!A:A,B409)","v":1}]
["Deathwatch Techmarine","Tech-Use",400,"Skill",null,0,true,false,{"$f":"AND(COUNTIF(adv!A:A,B410))","v":false},false,{"$f":"COUNTIF(elite_adv!A:A,B410)","v":1}]
["Deathwatch Techmarine","Autosanguine",500,"Talent",null,0,true,false,{"$f":"AND(COUNTIF(adv!A:A,B411))","v":false},false,{"$f":"COUNTIF(elite_adv!A:A,B411)","v":1}]
["Deathwatch Techmarine","Electro Graft Use",600,"Talent",null,0,true,false,{"$f":"AND(COUNTIF(adv!A:A,B412))","v":false},false,{"$f":"COUNTIF(elite_adv!A:A,B412)","v":1}]
["Deathwatch Techmarine","Feedback Screech",500,"Talent","Techmarine",0,{"$f":"AND(specialty=\"Deathwatch Techmarine\")","v":false},false,{"$f":"AND(COUNTIF(adv!A:A,B413))","v":false},false,{"$f":"COUNTIF(elite_adv!A:A,B413)","v":1}]
["Deathwatch Techmarine","Mechadendrite Use (any)",500,"Talent","Techmarine",0,true,true,{"$f":"AND(COUNTIF(adv!A:A,B414))","v":false},false,{"$f":"COUNTIF(elite_adv!A:A,B414)","v":0}]
["Deathwatch Techmarine","Technical Knock",500,"Talent","Int 30",0,{"$f":"AND(cha_int>=30)","v":true},false,{"$f":"AND(COUNTIF(adv!A:A,B415))","v":false},false,{"$f":"COUNTIF(elite_adv!A:A,B415)","v":1}]
["Deathwatch Techmarine","The Flesh is Weak 1",800,"Talent",null,0,true,false,{"$f":"AND(COUNTIF(adv!A:A,B416))","v":false},false,{"$f":"COUNTIF(elite_adv!A:A,B416)","v":1}]
["Deathwatch Techmarine","Lore: Forbidden (Adeptus Mechanicus) +10",400,"Skill","Lore: Forbidden (Adeptus Mechanicus)",2,{"$f":"AND(COUNTIF(adv!A:A,E417))","v":false},true,{"$f":"AND(COUNTIF(adv!A:A,B417))","v":false},false,{"$f":"COUNTIF(elite_adv!A:A,B417)","v":1}]
["Deathwatch Techmarine","Lore: Forbidden (Archeotech)",400,"Skill","",2,true,true,{"$f":"AND(COUNTIF(adv!A:A,B418))","v":false},false,{"$f":"COUNTIF(elite_adv!A:A,B418)","v":1}]
["Deathwatch Techmarine","Speak Language (Techna-Lingua) +10",200,"Skill","Speak Language (Techna-Lingua)",2,{"$f":"AND(COUNTIF(adv!A:A,E419))","v":false},true,{"$f":"AND(COUNTIF(adv!A:A,B419))","v":false},false,{"$f":"COUNTIF(elite_adv!A:A,B419)","v":1}]
["Deathwatch Techmarine","Ferric Lure",500,"Talent","Techmarine",2,{"$f":"AND(specialty=\"Deathwatch Techmarine\")","v":false},false,{"$f":"AND(COUNTIF(adv!A:A,B420))","v":false},false,{"$f":"COUNTIF(elite_adv!A:A,B420)","v":1}]
["Deathwatch Techmarine","Logis Implant",500,"Talent","",2,true,false,{"$f":"AND(COUNTIF(adv!A:A,B421))","v":false},false,{"$f":"COUNTIF(elite_adv!A:A,B421)","v":1}]
["Deathwatch Techmarine","Luminen Charge",500,"Talent","Techmarine",2,{"$f":"AND(specialty=\"Deathwatch Techmarine\")","v":false},false,{"$f":"AND(COUNTIF(adv!A:A,B422))","v":false},false,{"$f":"COUNTIF(elite_adv!A:A,B422)","v":1}]
["Deathwatch Techmarine","Mimic",500,"Talent","",2,true,false,{"$f":"AND(COUNTIF(adv!A:A,B423))","v":false},false,{"$f":"COUNTIF(elite_adv!A:A,B423)","v":1}]
["Deathwatch Techmarine","Rite of Awe",1000,"Talent","Techmarine",2,{"$f":"AND(specialty=\"Deathwatch Techmarine\")","v":false},false,{"$f":"AND(COUNTIF(adv!A:A,B424))","v":false},false,{"$f":"COUNTIF(elite_adv!A:A,B424)","v":1}]
["Deathwatch Techmarine","Lore: Forbidden (Adeptus Mechanicus) +20",400,"Skill","Lore: Forbidden (Adeptus Mechanicus) +10",3,{"$f":"AND(COUNTIF(adv!A:A,E425))","v":false},true,{"$f":"AND(COUNTIF(adv!A:A,B425))","v":false},false,{"$f":"COUNTIF(elite_adv!A:A,B425)","v":1}]
["Deathwatch Techmarine","Lore: Forbidden (Archeotech) +10",400,"Skill","Lore: Forbidden (Archeotech)",3,{"$f":"AND(COUNTIF(adv!A:A,E426))","v":false},true,{"$f":"AND(COUNTIF(adv!A:A,B426))","v":false},false,{"$f":"COUNTIF(elite_adv!A:A,B426)","v":1}]
["Deathwatch Techmarine","Security +10",400,"Skill","Security",3,{"$f":"AND(COUNTIF(adv!A:A,E427))","v":false},false,{"$f":"AND(COUNTIF(adv!A:A,B427))","v":false},false,{"$f":"COUNTIF(elite_adv!A:A,B427)","v":1}]
["Deathwatch Techmarine","Speak Language (Techna-Lingua) +20",200,"Skill","Speak Language (Techna-Lingua) +10",3,{"$f":"AND(COUNTIF(adv!A:A,E428))","v":false},true,{"$f":"AND(COUNTIF(adv!A:A,B428))","v":false},false,{"$f":"COUNTIF(elite_adv!A:A,B428)","v":1}]
["Deathwatch Techmarine","Tech-Use +10",400,"Skill","Tech-Use",3,{"$f":"AND(COUNTIF(adv!A:A,E429))","v":false},false,{"$f":"AND(COUNTIF(adv!A:A,B429))","v":false},false,{"$f":"COUNTIF(elite_adv!A:A,B429)","v":1}]
["Deathwatch Techmarine","Infused Knowledge",1000,"Talent","Int 40",3,{"$f":"AND(cha_int>=40)","v":false},false,{"$f":"AND(COUNTIF(adv!A:A,B430))","v":false},false,{"$f":"COUNTIF(elite_adv!A:A,B430)","v":1}]
["Deathwatch Techmarine","The Flesh is Weak 2",800,"Talent","The Flesh is Weak 1",3,{"$f":"AND(COUNTIF(adv!A:A,E431))","v":false},false,{"$f":"AND(COUNTIF(adv!A:A,B431))","v":false},false,{"$f":"COUNTIF(elite_adv!A:A,B431)","v":1}]
["Deathwatch Techmarine","Weapon-Tech",600,"Talent","Techmarine",3,{"$f":"AND(specialty=\"Deathwatch Techmarine\")","v":false},false,{"$f":"AND(COUNTIF(adv!A:A,B432))","v":false},false,{"$f":"COUNTIF(elite_adv!A:A,B432)","v":1}]
["Deathwatch Techmarine","Lore: Forbidden (Archeotech) +20",400,"Skill","Lore: Forbidden (Archeotech) +10",4,{"$f":"AND(COUNTIF(adv!A:A,E433))","v":false},true,{"$f":"AND(COUNTIF(adv!A:A,B433))","v":false},false,{"$f":"COUNTIF(elite_adv!A:A,B433)","v":1}]
["Deathwatch Techmarine","Binary Chatter",500,"Talent","",4,true,false,{"$f":"AND(COUNTIF(adv!A:A,B434))","v":false},false,{"$f":"COUNTIF(elite_adv!A:A,B434)","v":1}]
["Deathwatch Techmarine","Disturbing Voice",400,"Talent","",4,true,false,{"$f":"AND(COUNTIF(adv!A:A,B435))","v":false},false,{"$f":"COUNTIF(elite_adv!A:A,B435)","v":1}]
["Deathwatch Techmarine","Luminen Shock",800,"Talent","Techmarine",4,{"$f":"AND(specialty=\"Deathwatch Techmarine\")","v":false},false,{"$f":"AND(COUNTIF(adv!A:A,B436))","v":false},false,{"$f":"COUNTIF(elite_adv!A:A,B436)","v":1}]
["Deathwatch Techmarine","Rite of Fear",1000,"Talent","Techmarine",4,{"$f":"AND(specialty=\"Deathwatch Techmarine\")","v":false},false,{"$f":"AND(COUNTIF(adv!A:A,B437))","v":false},false,{"$f":"COUNTIF(elite_adv!A:A,B437)","v":1}]
["Deathwatch Techmarine","Servo-Harness Integration",1000,"Talent","Mechadendrite Use (Servo-arm)",4,{"$f":"AND(COUNTIF(adv!A:A,E438))","v":false},false,{"$f":"AND(COUNTIF(adv!A:A,B438))","v":false},false,{"$f":"COUNTIF(elite_adv!A:A,B438)","v":1}]
["Deathwatch Techmarine","Signature Wargear: Hero (Artificer Armour)",1200,"Talent","",4,true,false,{"$f":"AND(COUNTIF(adv!A:A,B439))","v":false},false,{"$f":"COUNTIF(elite_adv!A:A,B439)","v":1}]
["Deathwatch Techmarine","Security +20",400,"Skill","Security +10",5,{"$f":"AND(COUNTIF(adv!A:A,E440))","v":false},false,{"$f":"AND(COUNTIF(adv!A:A,B440))","v":false},false,{"$f":"COUNTIF(elite_adv!A:A,B440)","v":1}]
["Deathwatch Techmarine","Tech-Use +20",400,"Skill","Tech-Use +10",5,{"$f":"AND(COUNTIF(adv!A:A,E441))","v":false},false,{"$f":"AND(COUNTIF(adv!A:A,B441))","v":false},false,{"$f":"COUNTIF(elite_adv!A:A,B441)","v":1}]
["Deathwatch Techmarine","Gun Blessing",800,"Talent","Techmarine",5,{"$f":"AND(specialty=\"Deathwatch Techmarine\")","v":false},false,{"$f":"AND(COUNTIF(adv!A:A,B442))","v":false},false,{"$f":"COUNTIF(elite_adv!A:A,B442)","v":1}]
["Deathwatch Techmarine","Master Enginseer",1000,"Talent","Tech-Use +10",5,{"$f":"AND(COUNTIF(adv!A:A,E443))","v":false},false,{"$f":"AND(COUNTIF(adv!A:A,B443))","v":false},false,{"$f":"COUNTIF(elite_adv!A:A,B443)","v":1}]
["Deathwatch Techmarine","Prosanguine",1000,"Talent","Autosanguine",5,{"$f":"AND(COUNTIF(adv!A:A,E444))","v":false},false,{"$f":"AND(COUNTIF(adv!A:A,B444))","v":false},false,{"$f":"COUNTIF(elite_adv!A:A,B444)","v":1}]
["Deathwatch Techmarine","The Flesh is Weak 3",1000,"Talent","The Flesh is Weak 2",5,{"$f":"AND(COUNTIF(adv!A:A,E445))","v":false},false,{"$f":"AND(COUNTIF(adv!A:A,B445))","v":false},false,{"$f":"COUNTIF(elite_adv!A:A,B445)","v":1}]
["Deathwatch Techmarine","Armour-Monger",500,"Talent","Techmarine",6,{"$f":"AND(specialty=\"Deathwatch Techmarine\")","v":false},false,{"$f":"AND(COUNTIF(adv!A:A,B446))","v":false},false,{"$f":"COUNTIF(elite_adv!A:A,B446)","v":1}]
["Deathwatch Techmarine","Ferric Summons",1200,"Talent","Ferric Lure, Techmarine",6,{"$f":"AND(COUNTIF(adv!A:A,\"Ferric Lure\"),specialty=\"Deathwatch Techmarine\")","v":false},false,{"$f":"AND(COUNTIF(adv!A:A,B447))","v":false},false,{"$f":"COUNTIF(elite_adv!A:A,B447)","v":1}]
["Deathwatch Techmarine","Luminen Blast",1000,"Talent","Techmarine",6,{"$f":"AND(specialty=\"Deathwatch Techmarine\")","v":false},false,{"$f":"AND(COUNTIF(adv!A:A,B448))","v":false},false,{"$f":"COUNTIF(elite_adv!A:A,B448)","v":1}]
["Deathwatch Techmarine","Machinator Array",1200,"Talent","Techmarine",6,{"$f":"AND(specialty=\"Deathwatch Techmarine\")","v":false},false,{"$f":"AND(COUNTIF(adv!A:A,B449))","v":false},false,{"$f":"COUNTIF(elite_adv!A:A,B449)","v":1}]
["Deathwatch Techmarine","Sound Constitution (Tec1)",1000,"Talent","",6,true,false,{"$f":"AND(COUNTIF(adv!A:A,B450))","v":false},false,{"$f":"COUNTIF(elite_adv!A:A,B450)","v":0}]
["Deathwatch Techmarine","Concealed Cavity",500,"Talent","",7,true,false,{"$f":"AND(COUNTIF(adv!A:A,B451))","v":false},false,{"$f":"COUNTIF(elite_adv!A:A,B451)","v":1}]
["Deathwatch Techmarine","Electrical Succour",1000,"Talent","Techmarine",7,{"$f":"AND(specialty=\"Deathwatch Techmarine\")","v":false},false,{"$f":"AND(COUNTIF(adv!A:A,B452))","v":false},false,{"$f":"COUNTIF(elite_adv!A:A,B452)","v":1}]
["Deathwatch Techmarine","Energy Cache",1500,"Talent","Techmarine",7,{"$f":"AND(specialty=\"Deathwatch Techmarine\")","v":false},false,{"$f":"AND(COUNTIF(adv!A:A,B453))","v":false},false,{"$f":"COUNTIF(elite_adv!A:A,B453)","v":1}]
["Deathwatch Techmarine","Sound Constitution (Tec2)",1000,"Talent","",7,true,false,{"$f":"AND(COUNTIF(adv!A:A,B454))","v":false},false,{"$f":"COUNTIF(elite_adv!A:A,B454)","v":0}]
["Deathwatch Techmarine","The Flesh is Weak 4",1000,"Talent","The Flesh is Weak 3",7,{"$f":"AND(COUNTIF(adv!A:A,E455))","v":false},false,{"$f":"AND(COUNTIF(adv!A:A,B455))","v":false},false,{"$f":"COUNTIF(elite_adv!A:A,B455)","v":1}]
["Deathwatch Techmarine","Enhanced Bionic Frame",1000,"Talent","Machinator Array",8,{"$f":"AND(COUNTIF(adv!A:A,E456))","v":false},false,{"$f":"AND(COUNTIF(adv!A:A,B456))","v":false},false,{"$f":"COUNTIF(elite_adv!A:A,B456)","v":1}]
["Deathwatch Techmarine","Rite of Pure Thought",1000,"Talent","Techmarine",8,{"$f":"AND(specialty=\"Deathwatch Techmarine\")","v":false},false,{"$f":"AND(COUNTIF(adv!A:A,B457))","v":false},false,{"$f":"COUNTIF(elite_adv!A:A,B457)","v":1}]
["Deathwatch Techmarine","Sound Constitution (Tec3)",1000,"Talent","",8,true,false,{"$f":"AND(COUNTIF(adv!A:A,B458))","v":false},false,{"$f":"COUNTIF(elite_adv!A:A,B458)","v":0}]
["Deathwatch Techmarine","The Flesh is Weak 5",1000,"Talent","The Flesh is Weak 4",8,{"$f":"AND(COUNTIF(adv!A:A,E459))","v":false},false,{"$f":"AND(COUNTIF(adv!A:A,B459))","v":false},false,{"$f":"COUNTIF(elite_adv!A:A,B459)","v":1}]
["Dreadnaught","Lore: Common (any)",600,"Skill",null,0,true,true,{"$f":"AND(COUNTIF(adv!A:A,B460))","v":false},true,{"$f":"COUNTIF(elite_adv!A:A,B460)","v":0}]
["Dreadnaught","Lore: Forbidden (any)",600,"Skill",null,0,true,true,{"$f":"AND(COUNTIF(adv!A:A,B461))","v":false},true,{"$f":"COUNTIF(elite_adv!A:A,B461)","v":0}]
["Dreadnaught","Lore: Scholastic (any)",600,"Skill",null,0,true,true,{"$f":"AND(COUNTIF(adv!A:A,B462))","v":false},true,{"$f":"COUNTIF(elite_adv!A:A,B462)","v":0}]
["Dreadnaught","Tactics (any)",600,"Skill",null,0,true,true,{"$f":"AND(COUNTIF(adv!A:A,B463))","v":false},true,{"$f":"COUNTIF(elite_adv!A:A,B463)","v":0}]
["Dreadnaught","Berserk Charge",1000,"Talent",null,0,true,false,{"$f":"AND(COUNTIF(adv!A:A,B464))","v":false},true,{"$f":"COUNTIF(elite_adv!A:A,B464)","v":1}]
["Dreadnaught","Cleanse and Purify",1000,"Talent",null,0,true,false,{"$f":"AND(COUNTIF(adv!A:A,B465))","v":false},true,{"$f":"COUNTIF(elite_adv!A:A,B465)","v":1}]
["Dreadnaught","Crushing Blow",1000,"Talent",null,0,true,false,{"$f":"AND(COUNTIF(adv!A:A,B466))","v":false},true,{"$f":"COUNTIF(elite_adv!A:A,B466)","v":1}]
["Dreadnaught","Disturbing Voice",500,"Talent",null,0,true,false,{"$f":"AND(COUNTIF(adv!A:A,B467))","v":false},true,{"$f":"COUNTIF(elite_adv!A:A,B467)","v":1}]
["Dreadnaught","Furious Assault",1500,"Talent",null,0,true,false,{"$f":"AND(COUNTIF(adv!A:A,B468))","v":false},true,{"$f":"COUNTIF(elite_adv!A:A,B468)","v":1}]
["Dreadnaught","Good Reputation (Adeptus Astartes)",500,"Talent","Peer (Adeptus Astartes)",0,{"$f":"AND(COUNTIF(adv!A:A,E469))","v":false},false,{"$f":"AND(COUNTIF(adv!A:A,B469))","v":false},true,{"$f":"COUNTIF(elite_adv!A:A,B469)","v":1}]
["Dreadnaught","Hatred (any)",500,"Talent",null,0,true,true,{"$f":"AND(COUNTIF(adv!A:A,B470))","v":false},true,{"$f":"COUNTIF(elite_adv!A:A,B470)","v":0}]
["Dreadnaught","Lightning Attack",1500,"Talent","Swift Attack",0,{"$f":"AND(COUNTIF(adv!A:A,E471))","v":false},false,{"$f":"AND(COUNTIF(adv!A:A,B471))","v":false},true,{"$f":"COUNTIF(elite_adv!A:A,B471)","v":1}]
["Dreadnaught","Storm of Iron",2000,"Talent",null,0,true,false,{"$f":"AND(COUNTIF(adv!A:A,B472))","v":false},true,{"$f":"COUNTIF(elite_adv!A:A,B472)","v":1}]
["Dreadnaught","Swift Attack",1500,"Talent",null,0,true,false,{"$f":"AND(COUNTIF(adv!A:A,B473))","v":false},true,{"$f":"COUNTIF(elite_adv!A:A,B473)","v":1}]
["Dreadnaught","Thunder Charge",2000,"Talent",null,0,true,false,{"$f":"AND(COUNTIF(adv!A:A,B474))","v":false},true,{"$f":"COUNTIF(elite_adv!A:A,B474)","v":1}]
["Dreadnaught","Whirlwind of Death",2000,"Talent",null,0,true,false,{"$f":"AND(COUNTIF(adv!A:A,B475))","v":false},true,{"$f":"COUNTIF(elite_adv!A:A,B475)","v":1}]
["Epistolary","Command",400,"Skill",null,0,true,false,{"$f":"AND(COUNTIF(adv!A:A,B476))","v":false},false,{"$f":"COUNTIF(elite_adv!A:A,B476)","v":1}]
["Epistolary","Lore: Forbidden (Xenos)",400,"Skill",null,0,true,true,{"$f":"AND(COUNTIF(adv!A:A,B477))","v":false},false,{"$f":"COUNTIF(elite_adv!A:A,B477)","v":1}]
["Epistolary","Lore: Forbidden (Xenos) +10",400,"Skill","Lore: Forbidden (Xenos)",0,{"$f":"AND(COUNTIF(adv!A:A,E478))","v":false},true,{"$f":"AND(COUNTIF(adv!A:A,B478))","v":false},false,{"$f":"COUNTIF(elite_adv!A:A,B478)","v":1}]
["Epistolary","Lore: Forbidden (Xenos) +20",400,"Skill","Lore: Forbidden (Xenos) +10",0,{"$f":"AND(COUNTIF(adv!A:A,E479))","v":false},true,{"$f":"AND(COUNTIF(adv!A:A,B479))","v":false},false,{"$f":"COUNTIF(elite_adv!A:A,B479)","v":1}]
["Epistolary","Lore: Forbidden (Mutants)",400,"Skill",null,0,true,true,{"$f":"AND(COUNTIF(adv!A:A,B480))","v":false},false,{"$f":"COUNTIF(elite_adv!A:A,B480)","v":1}]
["Epistolary","Lore: Forbidden (Mutants) +10",400,"Skill","Lore: Forbidden (Mutants)",0,{"$f":"AND(COUNTIF(adv!A:A,E481))","v":false},true,{"$f":"AND(COUNTIF(adv!A:A,B481))","v":false},false,{"$f":"COUNTIF(elite_adv!A:A,B481)","v":1}]
["Epistolary","Lore: Forbidden (Mutants) +20",400,"Skill","Lore: Forbidden (Mutants) +10",0,{"$f":"AND(COUNTIF(adv!A:A,E482))","v":false},true,{"$f":"AND(COUNTIF(adv!A:A,B482))","v":false},false,{"$f":"COUNTIF(elite_adv!A:A,B482)","v":1}]
["Epistolary","Lore: Forbidden (The Black Library)",800,"Skill",null,0,true,true,{"$f":"AND(COUNTIF(adv!A:A,B483))","v":false},false,{"$f":"COUNTIF(elite_adv!A:A,B483)","v":1}]
["Epistolary","Psychic Power (any)",null,"Talent","Varies",0,true,true,{"$f":"AND(COUNTIF(adv!A:A,B484))","v":false},false,{"$f":"COUNTIF(elite_adv!A:A,B484)","v":0}]
["Epistolary","Sound Constitution [Epi1]",1000,"Talent",null,0,true,false,{"$f":"AND(COUNTIF(adv!A:A,B485))","v":false},false,{"$f":"COUNTIF(elite_adv!A:A,B485)","v":0}]
["Epistolary","Sound Constitution [Epi1]",1000,"Talent",null,0,true,false,{"$f":"AND(COUNTIF(adv!A:A,B486))","v":false},false,{"$f":"COUNTIF(elite_adv!A:A,B486)","v":0}]
["Forge Master","Trade (Forge Master)",400,"Skill",null,0,true,true,{"$f":"AND(COUNTIF(adv!A:A,B487))","v":false},false,{"$f":"COUNTIF(elite_adv!A:A,B487)","v":1}]
["Forge Master","Trade (Forge Master) +10",400,"Skill","Trade (Forge Master)",0,{"$f":"AND(COUNTIF(adv!A:A,E488))","v":false},true,{"$f":"AND(COUNTIF(adv!A:A,B488))","v":false},false,{"$f":"COUNTIF(elite_adv!A:A,B488)","v":1}]
["Forge Master","Trade (Forge Master) +20",400,"Skill","Trade (Forge Master) +10",0,{"$f":"AND(COUNTIF(adv!A:A,E489))","v":false},true,{"$f":"AND(COUNTIF(adv!A:A,B489))","v":false},false,{"$f":"COUNTIF(elite_adv!A:A,B489)","v":1}]
["Forge Master","Armour-Monger",500,"Talent","Techmarine",0,{"$f":"AND(specialty=\"Deathwatch Techmarine\")","v":false},false,{"$f":"AND(COUNTIF(adv!A:A,B490))","v":false},false,{"$f":"COUNTIF(elite_adv!A:A,B490)","v":1}]
["Forge Master","Electrical Succour",1000,"Talent","Techmarine",0,{"$f":"AND(specialty=\"Deathwatch Techmarine\")","v":false},false,{"$f":"AND(COUNTIF(adv!A:A,B491))","v":false},false,{"$f":"COUNTIF(elite_adv!A:A,B491)","v":1}]
["Forge Master","Energy Cache",1200,"Talent","Techmarine",0,{"$f":"AND(specialty=\"Deathwatch Techmarine\")","v":false},false,{"$f":"AND(COUNTIF(adv!A:A,B492))","v":false},false,{"$f":"COUNTIF(elite_adv!A:A,B492)","v":1}]
["Forge Master","Ferric Summons",1200,"Talent","Ferric Lure, Techmarine",0,{"$f":"AND(COUNTIF(adv!A:A,\"Ferric Lure\"),specialty=\"Deathwatch Techmarine\")","v":false},false,{"$f":"AND(COUNTIF(adv!A:A,B493))","v":false},false,{"$f":"COUNTIF(elite_adv!A:A,B493)","v":1}]
["Forge Master","Luminen Blast",1000,"Talent","Techmarine",0,{"$f":"AND(specialty=\"Deathwatch Techmarine\")","v":false},false,{"$f":"AND(COUNTIF(adv!A:A,B494))","v":false},false,{"$f":"COUNTIF(elite_adv!A:A,B494)","v":1}]
["Forge Master","Machinator Array",1000,"Talent","Techmarine",0,{"$f":"AND(specialty=\"Deathwatch Techmarine\")","v":false},false,{"$f":"AND(COUNTIF(adv!A:A,B495))","v":false},false,{"$f":"COUNTIF(elite_adv!A:A,B495)","v":1}]
["Forge Master","Sound Constitution [FM1]",1000,"Talent",null,0,true,false,{"$f":"AND(COUNTIF(adv!A:A,B496))","v":false},false,{"$f":"COUNTIF(elite_adv!A:A,B496)","v":0}]
["Forge Master","Sound Constitution [FM2]",1000,"Talent",null,0,true,false,{"$f":"AND(COUNTIF(adv!A:A,B497))","v":false},false,{"$f":"COUNTIF(elite_adv!A:A,B497)","v":0}]
["Forge Master","Talented (Tech-Use)",500,"Talent",null,0,true,false,{"$f":"AND(COUNTIF(adv!A:A,B498))","v":false},false,{"$f":"COUNTIF(elite_adv!A:A,B498)","v":1}]
["Forge Master","Talented (Security)",500,"Talent",null,0,true,false,{"$f":"AND(COUNTIF(adv!A:A,B499))","v":false},false,{"$f":"COUNTIF(elite_adv!A:A,B499)","v":1}]
["Forge Master","Talented (Lore: Forbidden)",500,"Talent",null,0,true,false,{"$f":"AND(COUNTIF(adv!A:A,B500))","v":false},false,{"$f":"COUNTIF(elite_adv!A:A,B500)","v":0}]
["Forge Master","The Flesh is Weak 4",1000,"Talent","The Flesh is Weak 3",0,{"$f":"AND(COUNTIF(adv!A:A,E501))","v":false},false,{"$f":"AND(COUNTIF(adv!A:A,B501))","v":false},false,{"$f":"COUNTIF(elite_adv!A:A,B501)","v":1}]
["Imperial Fists","Tactics (any)",100,"Skill",null,0,true,true,{"$f":"AND(COUNTIF(adv!A:A,B502))","v":false},false,{"$f":"COUNTIF(elite_adv!A:A,B502)","v":0}]
["Imperial Fists","Tactics (any) +10",100,"Skill","Tactics (same skill group)",0,true,true,{"$f":"AND(COUNTIF(adv!A:A,B503))","v":false},false,{"$f":"COUNTIF(elite_adv!A:A,B503)","v":0}]
["Imperial Fists","Tactics (any) +20",100,"Skill","Tactics (same skill group) +10",0,true,true,{"$f":"AND(COUNTIF(adv!A:A,B504))","v":false},false,{"$f":"COUNTIF(elite_adv!A:A,B504)","v":0}]
["Imperial Fists","Lore: Forbidden (The Inquisition) +10",100,"Skill","Lore: Forbidden (The Inquisition)",0,{"$f":"AND(COUNTIF(adv!A:A,E505))","v":false},true,{"$f":"AND(COUNTIF(adv!A:A,B505))","v":false},false,{"$f":"COUNTIF(elite_adv!A:A,B505)","v":1}]
["Imperial Fists","Lore: Forbidden (The Inquisition) +20",100,"Skill","Lore: Forbidden (The Inquisition) +10",0,{"$f":"AND(COUNTIF(adv!A:A,E506))","v":false},true,{"$f":"AND(COUNTIF(adv!A:A,B506))","v":false},false,{"$f":"COUNTIF(elite_adv!A:A,B506)","v":1}]
["Imperial Fists","Lore: Forbidden (The Traitor Legions)",100,"Skill",null,0,true,true,{"$f":"AND(COUNTIF(adv!A:A,B507))","v":false},false,{"$f":"COUNTIF(elite_adv!A:A,B507)","v":1}]
["Imperial Fists","Siegecraft",500,"Talent",null,0,true,false,{"$f":"AND(COUNTIF(adv!A:A,B508))","v":false},false,{"$f":"COUNTIF(elite_adv!A:A,B508)","v":1}]
["Imperial Fists","Hatred (The Traitor Legions)",300,"Talent",null,0,true,false,{"$f":"AND(COUNTIF(adv!A:A,B509))","v":false},false,{"$f":"COUNTIF(elite_adv!A:A,B509)","v":1}]
["Imperial Fists","Eye of Vengeance",1000,"Talent","Adeptus Astartes, BS 50",0,{"$f":"AND(COUNTIF(adv!A:A,\"Adeptus Astartes\"),cha_bs>=50)","v":false},false,{"$f":"AND(COUNTIF(adv!A:A,B510))","v":false},false,{"$f":"COUNTIF(elite_adv!A:A,B510)","v":1}]
["Imperial Fists","Peer (Adeptus Astartes)",400,"Talent","Fel 30",0,{"$f":"AND(cha_fel>=30)","v":true},false,{"$f":"AND(COUNTIF(adv!A:A,B511))","v":false},false,{"$f":"COUNTIF(elite_adv!A:A,B511)","v":1}]
["Keeper","Charm",200,"Skill",null,0,true,false,{"$f":"AND(COUNTIF(adv!A:A,B512))","v":false},false,{"$f":"COUNTIF(elite_adv!A:A,B512)","v":1}]
["Keeper","Charm +10",200,"Skill","Charm",0,{"$f":"AND(COUNTIF(adv!A:A,E513))","v":false},false,{"$f":"AND(COUNTIF(adv!A:A,B513))","v":false},false,{"$f":"COUNTIF(elite_adv!A:A,B513)","v":1}]
["Keeper","Charm +20",200,"Skill","Charm +10",0,{"$f":"AND(COUNTIF(adv!A:A,E514))","v":false},false,{"$f":"AND(COUNTIF(adv!A:A,B514))","v":false},false,{"$f":"COUNTIF(elite_adv!A:A,B514)","v":1}]
["Keeper","Command",400,"Skill",null,0,true,false,{"$f":"AND(COUNTIF(adv!A:A,B515))","v":false},false,{"$f":"COUNTIF(elite_adv!A:A,B515)","v":1}]
["Keeper","Command +10",400,"Skill","Command",0,{"$f":"AND(COUNTIF(adv!A:A,E516))","v":false},false,{"$f":"AND(COUNTIF(adv!A:A,B516))","v":false},false,{"$f":"COUNTIF(elite_adv!A:A,B516)","v":1}]
["Keeper","Command +20",400,"Skill","Command +10",0,{"$f":"AND(COUNTIF(adv!A:A,E517))","v":false},false,{"$f":"AND(COUNTIF(adv!A:A,B517))","v":false},false,{"$f":"COUNTIF(elite_adv!A:A,B517)","v":1}]
["Keeper","Ciphers (Imperial Codes)",200,"Skill",null,0,true,true,{"$f":"AND(COUNTIF(adv!A:A,B518))","v":false},false,{"$f":"COUNTIF(elite_adv!A:A,B518)","v":1}]
["Keeper","Deceive",400,"Skill",null,0,true,false,{"$f":"AND(COUNTIF(adv!A:A,B519))","v":false},false,{"$f":"COUNTIF(elite_adv!A:A,B519)","v":1}]
["Keeper","Evaluate",400,"Skill","Evaluate",0,{"$f":"AND(COUNTIF(adv!A:A,E520))","v":false},false,{"$f":"AND(COUNTIF(adv!A:A,B520))","v":false},false,{"$f":"COUNTIF(elite_adv!A:A,B520)","v":1}]
["Keeper","Evaluate +10",400,"Skill",null,0,true,false,{"$f":"AND(COUNTIF(adv!A:A,B521))","v":false},false,{"$f":"COUNTIF(elite_adv!A:A,B521)","v":1}]
["Keeper","Drive (any)",800,"Skill",null,0,true,true,{"$f":"AND(COUNTIF(adv!A:A,B522))","v":false},false,{"$f":"COUNTIF(elite_adv!A:A,B522)","v":0}]
["Keeper","Drive (any) +10",800,"Skill","Drive (any)",0,true,true,{"$f":"AND(COUNTIF(adv!A:A,B523))","v":false},false,{"$f":"COUNTIF(elite_adv!A:A,B523)","v":0}]
["Keeper","Navigation (Stellar)",400,"Skill",null,0,true,true,{"$f":"AND(COUNTIF(adv!A:A,B524))","v":false},false,{"$f":"COUNTIF(elite_adv!A:A,B524)","v":1}]
["Keeper","Navigation (Stellar) +10",400,"Skill","Navigation (Stellar)",0,{"$f":"AND(COUNTIF(adv!A:A,E525))","v":false},true,{"$f":"AND(COUNTIF(adv!A:A,B525))","v":false},false,{"$f":"COUNTIF(elite_adv!A:A,B525)","v":1}]
["Keeper","Navigation (Stellar) +20",400,"Skill","Navigation (Stellar) +10",0,{"$f":"AND(COUNTIF(adv!A:A,E526))","v":false},true,{"$f":"AND(COUNTIF(adv!A:A,B526))","v":false},false,{"$f":"COUNTIF(elite_adv!A:A,B526)","v":1}]
["Keeper","Pilot (any)",800,"Skill",null,0,true,true,{"$f":"AND(COUNTIF(adv!A:A,B527))","v":false},false,{"$f":"COUNTIF(elite_adv!A:A,B527)","v":0}]
["Keeper","Pilot (any) +10",800,"Skill","Pilot (any)",0,true,true,{"$f":"AND(COUNTIF(adv!A:A,B528))","v":false},false,{"$f":"COUNTIF(elite_adv!A:A,B528)","v":0}]
["Keeper","Pilot (any) +20",800,"Skill","Pilot (any) +10",0,true,true,{"$f":"AND(COUNTIF(adv!A:A,B529))","v":false},false,{"$f":"COUNTIF(elite_adv!A:A,B529)","v":0}]
["Keeper","Tactics (Orbital Drop Procedures)",200,"Skill",null,0,true,true,{"$f":"AND(COUNTIF(adv!A:A,B530))","v":false},false,{"$f":"COUNTIF(elite_adv!A:A,B530)","v":1}]
["Keeper","Chosen Representative",1000,"Talent","Fel 30",0,{"$f":"AND(cha_fel>=30)","v":true},false,{"$f":"AND(COUNTIF(adv!A:A,B531))","v":false},false,{"$f":"COUNTIF(elite_adv!A:A,B531)","v":1}]
["Keeper","Foresight",500,"Talent",null,0,true,false,{"$f":"AND(COUNTIF(adv!A:A,B532))","v":false},false,{"$f":"COUNTIF(elite_adv!A:A,B532)","v":1}]
["Keeper","Good Reputation (Adeptus Astartes)",1000,"Talent","Fel 50+, Peer (Adeptus Astartes)",0,{"$f":"AND(cha_fel>=50,COUNTIF(adv!A:A,\"Peer (Adeptus Astartes)\"))","v":false},false,{"$f":"AND(COUNTIF(adv!A:A,B533))","v":false},false,{"$f":"COUNTIF(elite_adv!A:A,B533)","v":1}]
["Keeper","Good Reputation (Imperial Navy)",1000,"Talent","Fel 50+, Peer (Imperial Navy)",0,{"$f":"AND(cha_fel>=50,COUNTIF(adv!A:A,\"Peer (Imperial Navy)\"))","v":false},false,{"$f":"AND(COUNTIF(adv!A:A,B534))","v":false},false,{"$f":"COUNTIF(elite_adv!A:A,B534)","v":1}]
["Keeper","Good Reputation (Imperial Guard)",1000,"Talent","Fel 50+, Peer (Imperial Guard)",0,{"$f":"AND(cha_fel>=50,COUNTIF(adv!A:A,\"Peer (Imperial Guard)\"))","v":false},false,{"$f":"AND(COUNTIF(adv!A:A,B535))","v":false},false,{"$f":"COUNTIF(elite_adv!A:A,B535)","v":1}]
["Keeper","Peer (Adeptus Astartes)",500,"Talent","Fel 30+",0,{"$f":"AND(cha_fel>=30)","v":true},false,{"$f":"AND(COUNTIF(adv!A:A,B536))","v":false},false,{"$f":"COUNTIF(elite_adv!A:A,B536)","v":1}]
["Keeper","Peer (Imperial Navy)",500,"Talent","Fel 30+",0,{"$f":"AND(cha_fel>=30)","v":true},false,{"$f":"AND(COUNTIF(adv!A:A,B537))","v":false},false,{"$f":"COUNTIF(elite_adv!A:A,B537)","v":1}]
["Keeper","Peer (Imperial Guard)",500,"Talent","Fel 30+",0,{"$f":"AND(cha_fel>=30)","v":true},false,{"$f":"AND(COUNTIF(adv!A:A,B538))","v":false},false,{"$f":"COUNTIF(elite_adv!A:A,B538)","v":1}]
["Keeper","Sound Constitution [K1]",1000,"Talent",null,0,true,false,{"$f":"AND(COUNTIF(adv!A:A,B539))","v":false},false,{"$f":"COUNTIF(elite_adv!A:A,B539)","v":0}]
["Keeper","Sound Constitution [K2]",1000,"Talent",null,0,true,false,{"$f":"AND(COUNTIF(adv!A:A,B540))","v":false},false,{"$f":"COUNTIF(elite_adv!A:A,B540)","v":0}]
["Kill-marine","Concealment",400,"Skill",null,0,true,false,{"$f":"AND(COUNTIF(adv!A:A,B541))","v":false},false,{"$f":"COUNTIF(elite_adv!A:A,B541)","v":1}]
["Kill-marine","Concealment +10",400,"Skill","Concealment",0,{"$f":"AND(COUNTIF(adv!A:A,E542))","v":false},false,{"$f":"AND(COUNTIF(adv!A:A,B542))","v":false},false,{"$f":"COUNTIF(elite_adv!A:A,B542)","v":1}]
["Kill-marine","Concealment +20",400,"Skill","Concealment +10",0,{"$f":"AND(COUNTIF(adv!A:A,E543))","v":false},false,{"$f":"AND(COUNTIF(adv!A:A,B543))","v":false},false,{"$f":"COUNTIF(elite_adv!A:A,B543)","v":1}]
["Kill-marine","Deceive",400,"Skill",null,0,true,false,{"$f":"AND(COUNTIF(adv!A:A,B544))","v":false},false,{"$f":"COUNTIF(elite_adv!A:A,B544)","v":1}]
["Kill-marine","Deceive +10",400,"Skill","Deceive",0,{"$f":"AND(COUNTIF(adv!A:A,E545))","v":false},false,{"$f":"AND(COUNTIF(adv!A:A,B545))","v":false},false,{"$f":"COUNTIF(elite_adv!A:A,B545)","v":1}]
["Kill-marine","Deceive +20",400,"Skill","Deceive +10",0,{"$f":"AND(COUNTIF(adv!A:A,E546))","v":false},false,{"$f":"AND(COUNTIF(adv!A:A,B546))","v":false},false,{"$f":"COUNTIF(elite_adv!A:A,B546)","v":1}]
["Kill-marine","Inquiry",400,"Skill",null,0,true,false,{"$f":"AND(COUNTIF(adv!A:A,B547))","v":false},false,{"$f":"COUNTIF(elite_adv!A:A,B547)","v":1}]
["Kill-marine","Inquiry +10",400,"Skill","Inquiry",0,{"$f":"AND(COUNTIF(adv!A:A,E548))","v":false},false,{"$f":"AND(COUNTIF(adv!A:A,B548))","v":false},false,{"$f":"COUNTIF(elite_adv!A:A,B548)","v":1}]
["Kill-marine","Lore: Common (any)",400,"Skill",null,0,true,true,{"$f":"AND(COUNTIF(adv!A:A,B549))","v":false},false,{"$f":"COUNTIF(elite_adv!A:A,B549)","v":0}]
["Kill-marine","Lore: Common (any) +10",400,"Skill","Lore: Common (any)",0,true,true,{"$f":"AND(COUNTIF(adv!A:A,B550))","v":false},false,{"$f":"COUNTIF(elite_adv!A:A,B550)","v":0}]
["Kill-marine","Lore: Scholastic (Astromancy)",400,"Skill",null,0,true,true,{"$f":"AND(COUNTIF(adv!A:A,B551))","v":false},false,{"$f":"COUNTIF(elite_adv!A:A,B551)","v":1}]
["Kill-marine","Shadowing",400,"Skill",null,0,true,false,{"$f":"AND(COUNTIF(adv!A:A,B552))","v":false},false,{"$f":"COUNTIF(elite_adv!A:A,B552)","v":1}]
["Kill-marine","Shadowing +10",400,"Skill","Shadowing",0,{"$f":"AND(COUNTIF(adv!A:A,E553))","v":false},false,{"$f":"AND(COUNTIF(adv!A:A,B553))","v":false},false,{"$f":"COUNTIF(elite_adv!A:A,B553)","v":1}]
["Kill-marine","Silent Move",400,"Skill",null,0,true,false,{"$f":"AND(COUNTIF(adv!A:A,B554))","v":false},false,{"$f":"COUNTIF(elite_adv!A:A,B554)","v":1}]
["Kill-marine","Silent Move +10",400,"Skill","Silent Move",0,{"$f":"AND(COUNTIF(adv!A:A,E555))","v":false},false,{"$f":"AND(COUNTIF(adv!A:A,B555))","v":false},false,{"$f":"COUNTIF(elite_adv!A:A,B555)","v":1}]
["Kill-marine","Silent Move +20",400,"Skill","Silent Move +10",0,{"$f":"AND(COUNTIF(adv!A:A,E556))","v":false},false,{"$f":"AND(COUNTIF(adv!A:A,B556))","v":false},false,{"$f":"COUNTIF(elite_adv!A:A,B556)","v":1}]
["Kill-marine","Speak Language (any)",200,"Skill",null,0,true,true,{"$f":"AND(COUNTIF(adv!A:A,B557))","v":false},false,{"$f":"COUNTIF(elite_adv!A:A,B557)","v":0}]
["Kill-marine","Survival",400,"Skill",null,0,true,false,{"$f":"AND(COUNTIF(adv!A:A,B558))","v":false},false,{"$f":"COUNTIF(elite_adv!A:A,B558)","v":1}]
["Kill-marine","Survival +10",400,"Skill","Survival",0,{"$f":"AND(COUNTIF(adv!A:A,E559))","v":false},false,{"$f":"AND(COUNTIF(adv!A:A,B559))","v":false},false,{"$f":"COUNTIF(elite_adv!A:A,B559)","v":1}]
["Kill-marine","Good Reputation (any)",2000,"Talent","Fel 50, Peer (same group)",0,true,true,{"$f":"AND(COUNTIF(adv!A:A,B560))","v":false},false,{"$f":"COUNTIF(elite_adv!A:A,B560)","v":0}]
["Kill-marine","Peer (any)",1000,"Talent","Fel 30",0,true,true,{"$f":"AND(COUNTIF(adv!A:A,B561))","v":false},false,{"$f":"COUNTIF(elite_adv!A:A,B561)","v":0}]
["Kill-marine","Polyglot",500,"Talent","Int 30, Fel 30",0,{"$f":"AND(cha_int>=30,cha_fel>=30)","v":true},false,{"$f":"AND(COUNTIF(adv!A:A,B562))","v":false},false,{"$f":"COUNTIF(elite_adv!A:A,B562)","v":1}]
["Kill-marine","Sound Constitution [KM1]",1000,"Talent",null,0,true,false,{"$f":"AND(COUNTIF(adv!A:A,B563))","v":false},false,{"$f":"COUNTIF(elite_adv!A:A,B563)","v":0}]
["Kill-marine","Sound Constitution [KM2]",1000,"Talent",null,0,true,false,{"$f":"AND(COUNTIF(adv!A:A,B564))","v":false},false,{"$f":"COUNTIF(elite_adv!A:A,B564)","v":0}]
["Kill-marine","Web of Peers",3000,"Talent","Fel 45, Peer (any)",0,{"$f":"AND(cha_fel>=45,COUNTIF(adv!F:F,\"Peer (any)\"))","v":false},false,{"$f":"AND(COUNTIF(adv!A:A,B565))","v":false},false,{"$f":"COUNTIF(elite_adv!A:A,B565)","v":1}]
["Space Marine","Drive (any)",600,"Skill",null,0,true,true,{"$f":"AND(COUNTIF(adv!A:A,B566))","v":false},false,{"$f":"COUNTIF(elite_adv!A:A,B566)","v":0}]
["Space Marine","Speak Language (any)",200,"Skill",null,0,true,true,{"$f":"AND(COUNTIF(adv!A:A,B567))","v":false},true,{"$f":"COUNTIF(elite_adv!A:A,B567)","v":0}]
["Space Marine","Trade (any)",600,"Skill",null,0,true,true,{"$f":"AND(COUNTIF(adv!A:A,B568))","v":false},false,{"$f":"COUNTIF(elite_adv!A:A,B568)","v":0}]
["Space Marine","Awareness",200,"Skill",null,0,true,false,{"$f":"AND(COUNTIF(adv!A:A,B569))","v":false},true,{"$f":"COUNTIF(elite_adv!A:A,B569)","v":1}]
["Space Marine","Carouse",200,"Skill",null,0,true,false,{"$f":"AND(COUNTIF(adv!A:A,B570))","v":false},true,{"$f":"COUNTIF(elite_adv!A:A,B570)","v":1}]
["Space Marine","Ciphers (Chapter Runes)",200,"Skill",null,0,true,true,{"$f":"AND(COUNTIF(adv!A:A,B571))","v":false},true,{"$f":"COUNTIF(elite_adv!A:A,B571)","v":1}]
["Space Marine","Climb",400,"Skill",null,0,true,false,{"$f":"AND(COUNTIF(adv!A:A,B572))","v":false},true,{"$f":"COUNTIF(elite_adv!A:A,B572)","v":1}]
["Space Marine","Concealment",800,"Skill",null,0,true,false,{"$f":"AND(COUNTIF(adv!A:A,B573))","v":false},true,{"$f":"COUNTIF(elite_adv!A:A,B573)","v":1}]
["Space Marine","Dodge",300,"Skill",null,0,true,false,{"$f":"AND(COUNTIF(adv!A:A,B574))","v":false},true,{"$f":"COUNTIF(elite_adv!A:A,B574)","v":1}]
["Space Marine","Intimidate",400,"Skill",null,0,true,false,{"$f":"AND(COUNTIF(adv!A:A,B575))","v":false},true,{"$f":"COUNTIF(elite_adv!A:A,B575)","v":1}]
["Space Marine","Literacy",200,"Skill",null,0,true,false,{"$f":"AND(COUNTIF(adv!A:A,B576))","v":false},true,{"$f":"COUNTIF(elite_adv!A:A,B576)","v":1}]
["Space Marine","Lore: Common (Adeptus Astartes)",400,"Skill",null,0,true,true,{"$f":"AND(COUNTIF(adv!A:A,B577))","v":false},true,{"$f":"COUNTIF(elite_adv!A:A,B577)","v":1}]
["Space Marine","Lore: Common (Imperium)",400,"Skill",null,0,true,true,{"$f":"AND(COUNTIF(adv!A:A,B578))","v":false},true,{"$f":"COUNTIF(elite_adv!A:A,B578)","v":1}]
["Space Marine","Lore: Common (War)",400,"Skill",null,0,true,true,{"$f":"AND(COUNTIF(adv!A:A,B579))","v":false},true,{"$f":"COUNTIF(elite_adv!A:A,B579)","v":1}]
["Space Marine","Navigation (Surface)",400,"Skill",null,0,true,true,{"$f":"AND(COUNTIF(adv!A:A,B580))","v":false},true,{"$f":"COUNTIF(elite_adv!A:A,B580)","v":1}]
["Space Marine","Pilot (Personal)",100,"Skill",null,0,true,true,{"$f":"AND(COUNTIF(adv!A:A,B581))","v":false},false,{"$f":"COUNTIF(elite_adv!A:A,B581)","v":1}]
["Space Marine","Search",400,"Skill",null,0,true,false,{"$f":"AND(COUNTIF(adv!A:A,B582))","v":false},true,{"$f":"COUNTIF(elite_adv!A:A,B582)","v":1}]
["Space Marine","Silent Move",300,"Skill",null,0,true,false,{"$f":"AND(COUNTIF(adv!A:A,B583))","v":false},true,{"$f":"COUNTIF(elite_adv!A:A,B583)","v":1}]
["Space Marine","Survival",300,"Skill",null,0,true,false,{"$f":"AND(COUNTIF(adv!A:A,B584))","v":false},false,{"$f":"COUNTIF(elite_adv!A:A,B584)","v":1}]
["Space Marine","Swim",200,"Skill",null,0,true,false,{"$f":"AND(COUNTIF(adv!A:A,B585))","v":false},false,{"$f":"COUNTIF(elite_adv!A:A,B585)","v":1}]
["Space Marine","Tech-Use",800,"Skill",null,0,true,false,{"$f":"AND(COUNTIF(adv!A:A,B586))","v":false},true,{"$f":"COUNTIF(elite_adv!A:A,B586)","v":1}]
["Space Marine","Astartes Weapon Specialisation",1500,"Talent","Astartes Weapon Training",0,{"$f":"AND(COUNTIF(adv!A:A,E587))","v":false},false,{"$f":"AND(COUNTIF(adv!A:A,B587))","v":false},true,{"$f":"COUNTIF(elite_adv!A:A,B587)","v":1}]
["Space Marine","Signature Wargear",500,"Talent",null,0,true,false,{"$f":"AND(COUNTIF(adv!A:A,B588))","v":false},false,{"$f":"COUNTIF(elite_adv!A:A,B588)","v":1}]
["Space Marine","Sound Constitution (SM1)",500,"Talent",null,0,true,false,{"$f":"AND(COUNTIF(adv!A:A,B589))","v":false},false,{"$f":"COUNTIF(elite_adv!A:A,B589)","v":0}]
["Space Marine","Sound Constitution (SM2)",500,"Talent",null,0,true,false,{"$f":"AND(COUNTIF(adv!A:A,B590))","v":false},false,{"$f":"COUNTIF(elite_adv!A:A,B590)","v":0}]
["Space Marine","Speak Language (any) +10",200,"Skill","Speak Language (same skill group)",2,true,true,{"$f":"AND(COUNTIF(adv!A:A,B591))","v":false},true,{"$f":"COUNTIF(elite_adv!A:A,B591)","v":0}]
["Space Marine","Trade (any) +10",400,"Skill","Trade (same skill group)",2,true,true,{"$f":"AND(COUNTIF(adv!A:A,B592))","v":false},false,{"$f":"COUNTIF(elite_adv!A:A,B592)","v":0}]
["Space Marine","Awareness +10",300,"Skill","Awareness",2,{"$f":"AND(COUNTIF(adv!A:A,E593))","v":false},false,{"$f":"AND(COUNTIF(adv!A:A,B593))","v":false},true,{"$f":"COUNTIF(elite_adv!A:A,B593)","v":1}]
["Space Marine","Carouse +10",200,"Skill","Carouse",2,{"$f":"AND(COUNTIF(adv!A:A,E594))","v":false},false,{"$f":"AND(COUNTIF(adv!A:A,B594))","v":false},true,{"$f":"COUNTIF(elite_adv!A:A,B594)","v":1}]
["Space Marine","Charm",800,"Skill",null,2,true,false,{"$f":"AND(COUNTIF(adv!A:A,B595))","v":false},true,{"$f":"COUNTIF(elite_adv!A:A,B595)","v":1}]
["Space Marine","Climb +10",400,"Skill","Climb",2,{"$f":"AND(COUNTIF(adv!A:A,E596))","v":false},false,{"$f":"AND(COUNTIF(adv!A:A,B596))","v":false},true,{"$f":"COUNTIF(elite_adv!A:A,B596)","v":1}]
["Space Marine","Command",300,"Skill",null,2,true,false,{"$f":"AND(COUNTIF(adv!A:A,B597))","v":false},true,{"$f":"COUNTIF(elite_adv!A:A,B597)","v":1}]
["Space Marine","Deceive",400,"Skill",null,2,true,false,{"$f":"AND(COUNTIF(adv!A:A,B598))","v":false},true,{"$f":"COUNTIF(elite_adv!A:A,B598)","v":1}]
["Space Marine","Demolition",400,"Skill",null,2,true,false,{"$f":"AND(COUNTIF(adv!A:A,B599))","v":false},false,{"$f":"COUNTIF(elite_adv!A:A,B599)","v":1}]
["Space Marine","Gamble",800,"Skill",null,2,true,false,{"$f":"AND(COUNTIF(adv!A:A,B600))","v":false},true,{"$f":"COUNTIF(elite_adv!A:A,B600)","v":1}]
["Space Marine","Inquiry",200,"Skill",null,2,true,false,{"$f":"AND(COUNTIF(adv!A:A,B601))","v":false},true,{"$f":"COUNTIF(elite_adv!A:A,B601)","v":1}]
["Space Marine","Literacy +10",400,"Skill","Literacy",2,{"$f":"AND(COUNTIF(adv!A:A,E602))","v":false},false,{"$f":"AND(COUNTIF(adv!A:A,B602))","v":false},true,{"$f":"COUNTIF(elite_adv!A:A,B602)","v":1}]
["Space Marine","Logic",400,"Skill",null,2,true,false,{"$f":"AND(COUNTIF(adv!A:A,B603))","v":false},true,{"$f":"COUNTIF(elite_adv!A:A,B603)","v":1}]
["Space Marine","Lore: Common (Imperial Guard)",200,"Skill",null,2,true,true,{"$f":"AND(COUNTIF(adv!A:A,B604))","v":false},true,{"$f":"COUNTIF(elite_adv!A:A,B604)","v":1}]
["Space Marine","Lore: Common (Imperial Navy)",200,"Skill",null,2,true,true,{"$f":"AND(COUNTIF(adv!A:A,B605))","v":false},true,{"$f":"COUNTIF(elite_adv!A:A,B605)","v":1}]
["Space Marine","Scrutiny",400,"Skill",null,2,true,false,{"$f":"AND(COUNTIF(adv!A:A,B606))","v":false},true,{"$f":"COUNTIF(elite_adv!A:A,B606)","v":1}]
["Space Marine","Survival +10",400,"Skill","Survival",2,{"$f":"AND(COUNTIF(adv!A:A,E607))","v":false},false,{"$f":"AND(COUNTIF(adv!A:A,B607))","v":false},false,{"$f":"COUNTIF(elite_adv!A:A,B607)","v":1}]
["Space Marine","Swim +10",200,"Skill","Swim",2,{"$f":"AND(COUNTIF(adv!A:A,E608))","v":false},false,{"$f":"AND(COUNTIF(adv!A:A,B608))","v":false},false,{"$f":"COUNTIF(elite_adv!A:A,B608)","v":1}]
["Space Marine","Tracking",400,"Skill",null,2,true,false,{"$f":"AND(COUNTIF(adv!A:A,B609))","v":false},true,{"$f":"COUNTIF(elite_adv!A:A,B609)","v":1}]
["Space Marine","Wrangling",200,"Skill",null,2,true,false,{"$f":"AND(COUNTIF(adv!A:A,B610))","v":false},false,{"$f":"COUNTIF(elite_adv!A:A,B610)","v":1}]
["Space Marine","Air of Authority",1000,"Talent","Fel 30",2,{"$f":"AND(cha_int>=40,cha_fel>=30)","v":false},false,{"$f":"AND(COUNTIF(adv!A:A,B611))","v":false},true,{"$f":"COUNTIF(elite_adv!A:A,B611)","v":1}]
["Space Marine","Polyglot",500,"Talent","Int 40, Fel 30",2,{"$f":"AND(cha_fel>=30)","v":true},false,{"$f":"AND(COUNTIF(adv!A:A,B612))","v":false},true,{"$f":"COUNTIF(elite_adv!A:A,B612)","v":1}]
["Space Marine","Resistance (Poisons)",500,"Talent",null,2,true,false,{"$f":"AND(COUNTIF(adv!A:A,B613))","v":false},false,{"$f":"COUNTIF(elite_adv!A:A,B613)","v":1}]
["Space Marine","Signature Wargear (Master)",1000,"Talent","Signature Wargear",2,{"$f":"AND(sigwargearmaster<sigwargearcnt)","v":false},false,{"$f":"AND(COUNTIF(adv!A:A,B614))","v":false},false,{"$f":"COUNTIF(elite_adv!A:A,B614)","v":1}]
["Space Marine","Sound Constitution (SM3)",1000,"Talent",null,2,true,false,{"$f":"AND(COUNTIF(adv!A:A,B615))","v":false},false,{"$f":"COUNTIF(elite_adv!A:A,B615)","v":0}]
["Space Marine","Sound Constitution (SM4)",1000,"Talent",null,2,true,false,{"$f":"AND(COUNTIF(adv!A:A,B616))","v":false},false,{"$f":"COUNTIF(elite_adv!A:A,B616)","v":0}]
["Space Marine","Total Recall",500,"Talent","Int 30",2,{"$f":"AND(cha_int>=30)","v":true},false,{"$f":"AND(COUNTIF(adv!A:A,B617))","v":false},true,{"$f":"COUNTIF(elite_adv!A:A,B617)","v":1}]
["Space Marine","Drive (any) +10",800,"Skill","Drive (same skill group)",3,true,true,{"$f":"AND(COUNTIF(adv!A:A,B618))","v":false},false,{"$f":"COUNTIF(elite_adv!A:A,B618)","v":0}]
["Space Marine","Performer (any)",400,"Skill",null,3,true,true,{"$f":"AND(COUNTIF(adv!A:A,B619))","v":false},false,{"$f":"COUNTIF(elite_adv!A:A,B619)","v":0}]
["Space Marine","Pilot (any)",800,"Skill",null,3,true,true,{"$f":"AND(COUNTIF(adv!A:A,B620))","v":false},false,{"$f":"COUNTIF(elite_adv!A:A,B620)","v":0}]
["Space Marine","Speak Language (any) +20",200,"Skill","Speak Language (same skill group) +10",3,true,true,{"$f":"AND(COUNTIF(adv!A:A,B621))","v":false},true,{"$f":"COUNTIF(elite_adv!A:A,B621)","v":0}]
["Space Marine","Tactics (any)",400,"Skill",null,3,true,true,{"$f":"AND(COUNTIF(adv!A:A,B622))","v":false},true,{"$f":"COUNTIF(elite_adv!A:A,B622)","v":0}]
["Space Marine","Trade (any) +20",400,"Skill","Trade (same skill group) +10",3,true,true,{"$f":"AND(COUNTIF(adv!A:A,B623))","v":false},false,{"$f":"COUNTIF(elite_adv!A:A,B623)","v":0}]
["Space Marine","Awareness +20",800,"Skill","Awareness +10",3,{"$f":"AND(COUNTIF(adv!A:A,E624))","v":false},false,{"$f":"AND(COUNTIF(adv!A:A,B624))","v":false},true,{"$f":"COUNTIF(elite_adv!A:A,B624)","v":1}]
["Space Marine","Carouse +20",200,"Skill","Carouse +10",3,{"$f":"AND(COUNTIF(adv!A:A,E625))","v":false},false,{"$f":"AND(COUNTIF(adv!A:A,B625))","v":false},true,{"$f":"COUNTIF(elite_adv!A:A,B625)","v":1}]
["Space Marine","Ciphers (Chapter Runes) +10",200,"Skill","Ciphers (Chapter Runes)",3,{"$f":"AND(COUNTIF(adv!A:A,E626))","v":false},true,{"$f":"AND(COUNTIF(adv!A:A,B626))","v":false},true,{"$f":"COUNTIF(elite_adv!A:A,B626)","v":1}]
["Space Marine","Climb +20",400,"Skill","Climb +10",3,{"$f":"AND(COUNTIF(adv!A:A,E627))","v":false},false,{"$f":"AND(COUNTIF(adv!A:A,B627))","v":false},true,{"$f":"COUNTIF(elite_adv!A:A,B627)","v":1}]
["Space Marine","Concealment +10",800,"Skill","Concealment",3,{"$f":"AND(COUNTIF(adv!A:A,E628))","v":false},false,{"$f":"AND(COUNTIF(adv!A:A,B628))","v":false},true,{"$f":"COUNTIF(elite_adv!A:A,B628)","v":1}]
["Space Marine","Contortionist",800,"Skill",null,3,true,false,{"$f":"AND(COUNTIF(adv!A:A,B629))","v":false},false,{"$f":"COUNTIF(elite_adv!A:A,B629)","v":1}]
["Space Marine","Evaluate",400,"Skill",null,3,true,false,{"$f":"AND(COUNTIF(adv!A:A,B630))","v":false},true,{"$f":"COUNTIF(elite_adv!A:A,B630)","v":1}]
["Space Marine","Interrogation",400,"Skill",null,3,true,false,{"$f":"AND(COUNTIF(adv!A:A,B631))","v":false},true,{"$f":"COUNTIF(elite_adv!A:A,B631)","v":1}]
["Space Marine","Intimidate +10",400,"Skill","Intimidate",3,{"$f":"AND(COUNTIF(adv!A:A,E632))","v":false},false,{"$f":"AND(COUNTIF(adv!A:A,B632))","v":false},true,{"$f":"COUNTIF(elite_adv!A:A,B632)","v":1}]
["Space Marine","Literacy +20",200,"Skill","Literacy +10",3,{"$f":"AND(COUNTIF(adv!A:A,E633))","v":false},false,{"$f":"AND(COUNTIF(adv!A:A,B633))","v":false},true,{"$f":"COUNTIF(elite_adv!A:A,B633)","v":1}]
["Space Marine","Lore: Common (Adeptus Astartes) +10",400,"Skill","Lore: Common (Adeptus Astartes)",3,{"$f":"AND(COUNTIF(adv!A:A,E634))","v":false},true,{"$f":"AND(COUNTIF(adv!A:A,B634))","v":false},true,{"$f":"COUNTIF(elite_adv!A:A,B634)","v":1}]
["Space Marine","Lore: Common (Ecclesiarchy)",200,"Skill",null,3,true,true,{"$f":"AND(COUNTIF(adv!A:A,B635))","v":false},true,{"$f":"COUNTIF(elite_adv!A:A,B635)","v":1}]
["Space Marine","Lore: Common (Imperial Guard) +10",200,"Skill","Lore: Common (Imperial Guard)",3,{"$f":"AND(COUNTIF(adv!A:A,E636))","v":false},true,{"$f":"AND(COUNTIF(adv!A:A,B636))","v":false},true,{"$f":"COUNTIF(elite_adv!A:A,B636)","v":1}]
["Space Marine","Lore: Common (Imperial Navy) +10",200,"Skill","Lore: Common (Imperial Navy)",3,{"$f":"AND(COUNTIF(adv!A:A,E637))","v":false},true,{"$f":"AND(COUNTIF(adv!A:A,B637))","v":false},true,{"$f":"COUNTIF(elite_adv!A:A,B637)","v":1}]
["Space Marine","Lore: Common (Imperium) +10",400,"Skill","Lore: Common (Imperium)",3,{"$f":"AND(COUNTIF(adv!A:A,E638))","v":false},true,{"$f":"AND(COUNTIF(adv!A:A,B638))","v":false},true,{"$f":"COUNTIF(elite_adv!A:A,B638)","v":1}]
["Space Marine","Lore: Common (Tech)",200,"Skill",null,3,true,true,{"$f":"AND(COUNTIF(adv!A:A,B639))","v":false},true,{"$f":"COUNTIF(elite_adv!A:A,B639)","v":1}]
["Space Marine","Lore: Common (War) +10",400,"Skill","Lore: Common (War)",3,{"$f":"AND(COUNTIF(adv!A:A,E640))","v":false},true,{"$f":"AND(COUNTIF(adv!A:A,B640))","v":false},true,{"$f":"COUNTIF(elite_adv!A:A,B640)","v":1}]
["Space Marine","Lore: Forbidden (Adeptus Astartes)",400,"Skill",null,3,true,true,{"$f":"AND(COUNTIF(adv!A:A,B641))","v":false},true,{"$f":"COUNTIF(elite_adv!A:A,B641)","v":1}]
["Space Marine","Search +10",400,"Skill","Search",3,{"$f":"AND(COUNTIF(adv!A:A,E642))","v":false},false,{"$f":"AND(COUNTIF(adv!A:A,B642))","v":false},true,{"$f":"COUNTIF(elite_adv!A:A,B642)","v":1}]
["Space Marine","Security",800,"Skill",null,3,true,false,{"$f":"AND(COUNTIF(adv!A:A,B643))","v":false},false,{"$f":"COUNTIF(elite_adv!A:A,B643)","v":1}]
["Space Marine","Silent Move +10",800,"Skill","Silent Move",3,{"$f":"AND(COUNTIF(adv!A:A,E644))","v":false},false,{"$f":"AND(COUNTIF(adv!A:A,B644))","v":false},true,{"$f":"COUNTIF(elite_adv!A:A,B644)","v":1}]
["Space Marine","Swim +20",200,"Skill","Swim +10",3,{"$f":"AND(COUNTIF(adv!A:A,E645))","v":false},false,{"$f":"AND(COUNTIF(adv!A:A,B645))","v":false},false,{"$f":"COUNTIF(elite_adv!A:A,B645)","v":1}]
["Space Marine","Orthoproxy",500,"Talent",null,3,true,false,{"$f":"AND(COUNTIF(adv!A:A,B646))","v":false},false,{"$f":"COUNTIF(elite_adv!A:A,B646)","v":1}]
["Space Marine","Rapid Reaction",500,"Talent","Ag 40",3,{"$f":"AND(cha_ag>=40)","v":false},false,{"$f":"AND(COUNTIF(adv!A:A,B647))","v":false},false,{"$f":"COUNTIF(elite_adv!A:A,B647)","v":1}]
["Space Marine","Rapid Reload",300,"Talent",null,3,true,false,{"$f":"AND(COUNTIF(adv!A:A,B648))","v":false},false,{"$f":"COUNTIF(elite_adv!A:A,B648)","v":1}]
["Space Marine","Charm +10",800,"Skill","Charm",4,{"$f":"AND(COUNTIF(adv!A:A,E649))","v":false},false,{"$f":"AND(COUNTIF(adv!A:A,B649))","v":false},true,{"$f":"COUNTIF(elite_adv!A:A,B649)","v":1}]
["Space Marine","Command +10",500,"Skill","Command",4,{"$f":"AND(COUNTIF(adv!A:A,E650))","v":false},false,{"$f":"AND(COUNTIF(adv!A:A,B650))","v":false},true,{"$f":"COUNTIF(elite_adv!A:A,B650)","v":1}]
["Space Marine","Deceive +10",400,"Skill","Deceive",4,{"$f":"AND(COUNTIF(adv!A:A,E651))","v":false},false,{"$f":"AND(COUNTIF(adv!A:A,B651))","v":false},true,{"$f":"COUNTIF(elite_adv!A:A,B651)","v":1}]
["Space Marine","Demolition +10",400,"Skill","Demolition",4,{"$f":"AND(COUNTIF(adv!A:A,E652))","v":false},false,{"$f":"AND(COUNTIF(adv!A:A,B652))","v":false},false,{"$f":"COUNTIF(elite_adv!A:A,B652)","v":1}]
["Space Marine","Gamble +10",200,"Skill","Gamble",4,{"$f":"AND(COUNTIF(adv!A:A,E653))","v":false},false,{"$f":"AND(COUNTIF(adv!A:A,B653))","v":false},true,{"$f":"COUNTIF(elite_adv!A:A,B653)","v":1}]
["Space Marine","Inquiry +10",800,"Skill","Inquiry",4,{"$f":"AND(COUNTIF(adv!A:A,E654))","v":false},false,{"$f":"AND(COUNTIF(adv!A:A,B654))","v":false},true,{"$f":"COUNTIF(elite_adv!A:A,B654)","v":1}]
["Space Marine","Logic +10",400,"Skill","Logic",4,{"$f":"AND(COUNTIF(adv!A:A,E655))","v":false},false,{"$f":"AND(COUNTIF(adv!A:A,B655))","v":false},true,{"$f":"COUNTIF(elite_adv!A:A,B655)","v":1}]
["Space Marine","Lore: Common (Ecclesiarchy) +10",200,"Skill","Lore: Common (Ecclesiarchy)",4,{"$f":"AND(COUNTIF(adv!A:A,E656))","v":false},true,{"$f":"AND(COUNTIF(adv!A:A,B656))","v":false},true,{"$f":"COUNTIF(elite_adv!A:A,B656)","v":1}]
["Space Marine","Lore: Common (Imperial Guard) +20",200,"Skill","Lore: Common (Imperial Guard) +10",4,{"$f":"AND(COUNTIF(adv!A:A,E657))","v":false},true,{"$f":"AND(COUNTIF(adv!A:A,B657))","v":false},true,{"$f":"COUNTIF(elite_adv!A:A,B657)","v":1}]
["Space Marine","Lore: Common (Imperial Navy) +20",200,"Skill","Lore: Common (Imperial Navy) +10",4,{"$f":"AND(COUNTIF(adv!A:A,E658))","v":false},true,{"$f":"AND(COUNTIF(adv!A:A,B658))","v":false},true,{"$f":"COUNTIF(elite_adv!A:A,B658)","v":1}]
["Space Marine","Lore: Common (Tech) +10",200,"Skill","Lore: Common (Tech)",4,{"$f":"AND(COUNTIF(adv!A:A,E659))","v":false},true,{"$f":"AND(COUNTIF(adv!A:A,B659))","v":false},true,{"$f":"COUNTIF(elite_adv!A:A,B659)","v":1}]
["Space Marine","Performer (Dancer) +10",400,"Skill","Performer (Dancer)",4,{"$f":"AND(COUNTIF(adv!A:A,E660))","v":false},true,{"$f":"AND(COUNTIF(adv!A:A,B660))","v":false},false,{"$f":"COUNTIF(elite_adv!A:A,B660)","v":1}]
["Space Marine","Performer (Musician) +10",400,"Skill","Performer (Musician)",4,{"$f":"AND(COUNTIF(adv!A:A,E661))","v":false},true,{"$f":"AND(COUNTIF(adv!A:A,B661))","v":false},false,{"$f":"COUNTIF(elite_adv!A:A,B661)","v":1}]
["Space Marine","Performer (Singer) +10",400,"Skill","Performer (Singer)",4,{"$f":"AND(COUNTIF(adv!A:A,E662))","v":false},true,{"$f":"AND(COUNTIF(adv!A:A,B662))","v":false},false,{"$f":"COUNTIF(elite_adv!A:A,B662)","v":1}]
["Space Marine","Performer (Storyteller) +10",400,"Skill","Performer (Storyteller)",4,{"$f":"AND(COUNTIF(adv!A:A,E663))","v":false},true,{"$f":"AND(COUNTIF(adv!A:A,B663))","v":false},false,{"$f":"COUNTIF(elite_adv!A:A,B663)","v":1}]
["Space Marine","Scrutiny +10",400,"Skill","Scrutiny",4,{"$f":"AND(COUNTIF(adv!A:A,E664))","v":false},false,{"$f":"AND(COUNTIF(adv!A:A,B664))","v":false},true,{"$f":"COUNTIF(elite_adv!A:A,B664)","v":1}]
["Space Marine","Shadowing",400,"Skill","",4,true,false,{"$f":"AND(COUNTIF(adv!A:A,B665))","v":false},true,{"$f":"COUNTIF(elite_adv!A:A,B665)","v":1}]
["Space Marine","Survival +20",800,"Skill","Survival +10",4,{"$f":"AND(COUNTIF(adv!A:A,E666))","v":false},false,{"$f":"AND(COUNTIF(adv!A:A,B666))","v":false},false,{"$f":"COUNTIF(elite_adv!A:A,B666)","v":1}]
["Space Marine","Iron Discipline",1000,"Talent","WP 30, Command",4,{"$f":"AND(cha_wp>=30,COUNTIF(adv!A:A,\"Command\"))","v":false},false,{"$f":"AND(COUNTIF(adv!A:A,B667))","v":false},true,{"$f":"COUNTIF(elite_adv!A:A,B667)","v":1}]
["Space Marine","Iron Jaw",500,"Talent","T 40",4,{"$f":"AND(cha_t>=40)","v":false},false,{"$f":"AND(COUNTIF(adv!A:A,B668))","v":false},false,{"$f":"COUNTIF(elite_adv!A:A,B668)","v":1}]
["Space Marine","Sprint",600,"Talent","",4,true,false,{"$f":"AND(COUNTIF(adv!A:A,B669))","v":false},false,{"$f":"COUNTIF(elite_adv!A:A,B669)","v":1}]
["Space Marine","Drive (any) +20",800,"Skill","Drive (same skill group) +10",5,true,true,{"$f":"AND(COUNTIF(adv!A:A,B670))","v":false},false,{"$f":"COUNTIF(elite_adv!A:A,B670)","v":0}]
["Space Marine","Lore: Scholastic (any)",800,"Skill",null,5,true,true,{"$f":"AND(COUNTIF(adv!A:A,B671))","v":false},true,{"$f":"COUNTIF(elite_adv!A:A,B671)","v":0}]
["Space Marine","Performer (any) +20",400,"Skill","Performer (same skill group) +10",5,true,true,{"$f":"AND(COUNTIF(adv!A:A,B672))","v":false},false,{"$f":"COUNTIF(elite_adv!A:A,B672)","v":0}]
["Space Marine","Pilot (any) +10",800,"Skill","Pilot (same skill group)",5,true,true,{"$f":"AND(COUNTIF(adv!A:A,B673))","v":false},false,{"$f":"COUNTIF(elite_adv!A:A,B673)","v":0}]
["Space Marine","Ciphers (Chapter Runes) +20",200,"Skill","Ciphers (Chapter Runes) +10",5,{"$f":"AND(COUNTIF(adv!A:A,E674))","v":false},true,{"$f":"AND(COUNTIF(adv!A:A,B674))","v":false},true,{"$f":"COUNTIF(elite_adv!A:A,B674)","v":1}]
["Space Marine","Concealment +20",800,"Skill","Concealment +10",5,{"$f":"AND(COUNTIF(adv!A:A,E675))","v":false},false,{"$f":"AND(COUNTIF(adv!A:A,B675))","v":false},true,{"$f":"COUNTIF(elite_adv!A:A,B675)","v":1}]
["Space Marine","Dodge +10",500,"Skill","Dodge",5,{"$f":"AND(COUNTIF(adv!A:A,E676))","v":false},false,{"$f":"AND(COUNTIF(adv!A:A,B676))","v":false},true,{"$f":"COUNTIF(elite_adv!A:A,B676)","v":1}]
["Space Marine","Evaluate +10",400,"Skill","Evaluate",5,{"$f":"AND(COUNTIF(adv!A:A,E677))","v":false},false,{"$f":"AND(COUNTIF(adv!A:A,B677))","v":false},true,{"$f":"COUNTIF(elite_adv!A:A,B677)","v":1}]
["Space Marine","Intimidate +20",400,"Skill","Intimidate +10",5,{"$f":"AND(COUNTIF(adv!A:A,E678))","v":false},false,{"$f":"AND(COUNTIF(adv!A:A,B678))","v":false},true,{"$f":"COUNTIF(elite_adv!A:A,B678)","v":1}]
["Space Marine","Lore: Common (Adeptus Astartes) +20",400,"Skill","Lore: Common (Adeptus Astartes) +10",5,{"$f":"AND(COUNTIF(adv!A:A,E679))","v":false},true,{"$f":"AND(COUNTIF(adv!A:A,B679))","v":false},true,{"$f":"COUNTIF(elite_adv!A:A,B679)","v":1}]
["Space Marine","Lore: Common (Ecclesiarchy) +20",200,"Skill","Lore: Common (Ecclesiarchy) +10",5,{"$f":"AND(COUNTIF(adv!A:A,E680))","v":false},true,{"$f":"AND(COUNTIF(adv!A:A,B680))","v":false},true,{"$f":"COUNTIF(elite_adv!A:A,B680)","v":1}]
["Space Marine","Lore: Common (Imperium) +20",400,"Skill","Lore: Common (Imperium) +10",5,{"$f":"AND(COUNTIF(adv!A:A,E681))","v":false},true,{"$f":"AND(COUNTIF(adv!A:A,B681))","v":false},true,{"$f":"COUNTIF(elite_adv!A:A,B681)","v":1}]
["Space Marine","Lore: Common (Tech) +20",200,"Skill","Lore: Common (Tech) +10",5,{"$f":"AND(COUNTIF(adv!A:A,E682))","v":false},true,{"$f":"AND(COUNTIF(adv!A:A,B682))","v":false},true,{"$f":"COUNTIF(elite_adv!A:A,B682)","v":1}]
["Space Marine","Lore: Common (War) +20",400,"Skill","Lore: Common (War) +10",5,{"$f":"AND(COUNTIF(adv!A:A,E683))","v":false},true,{"$f":"AND(COUNTIF(adv!A:A,B683))","v":false},true,{"$f":"COUNTIF(elite_adv!A:A,B683)","v":1}]
["Space Marine","Navigation (Stellar)",400,"Skill","",5,true,true,{"$f":"AND(COUNTIF(adv!A:A,B684))","v":false},true,{"$f":"COUNTIF(elite_adv!A:A,B684)","v":1}]
["Space Marine","Search +20",400,"Skill","Search +10",5,{"$f":"AND(COUNTIF(adv!A:A,E685))","v":false},false,{"$f":"AND(COUNTIF(adv!A:A,B685))","v":false},true,{"$f":"COUNTIF(elite_adv!A:A,B685)","v":1}]
["Space Marine","Security +10",800,"Skill","Security",5,{"$f":"AND(COUNTIF(adv!A:A,E686))","v":false},false,{"$f":"AND(COUNTIF(adv!A:A,B686))","v":false},false,{"$f":"COUNTIF(elite_adv!A:A,B686)","v":1}]
["Space Marine","Silent Move +20",800,"Skill","Silent Move +10",5,{"$f":"AND(COUNTIF(adv!A:A,E687))","v":false},false,{"$f":"AND(COUNTIF(adv!A:A,B687))","v":false},true,{"$f":"COUNTIF(elite_adv!A:A,B687)","v":1}]
["Space Marine","Tracking +10",400,"Skill","Tracking",5,{"$f":"AND(COUNTIF(adv!A:A,E688))","v":false},false,{"$f":"AND(COUNTIF(adv!A:A,B688))","v":false},true,{"$f":"COUNTIF(elite_adv!A:A,B688)","v":1}]
["Space Marine","Wrangling +10",200,"Skill","Wrangling",5,{"$f":"AND(COUNTIF(adv!A:A,E689))","v":false},false,{"$f":"AND(COUNTIF(adv!A:A,B689))","v":false},false,{"$f":"COUNTIF(elite_adv!A:A,B689)","v":1}]
["Space Marine","Call to Vengeance",1000,"Talent","Fel 40",5,{"$f":"AND(cha_fel>=40)","v":false},false,{"$f":"AND(COUNTIF(adv!A:A,B690))","v":false},true,{"$f":"COUNTIF(elite_adv!A:A,B690)","v":1}]
["Space Marine","Double Team",500,"Talent","",5,true,false,{"$f":"AND(COUNTIF(adv!A:A,B691))","v":false},true,{"$f":"COUNTIF(elite_adv!A:A,B691)","v":1}]
["Space Marine","Hardy",1000,"Talent","T 40",5,{"$f":"AND(cha_t>=40)","v":false},false,{"$f":"AND(COUNTIF(adv!A:A,B692))","v":false},false,{"$f":"COUNTIF(elite_adv!A:A,B692)","v":1}]
["Space Marine","Mimic",500,"Talent","",5,true,false,{"$f":"AND(COUNTIF(adv!A:A,B693))","v":false},false,{"$f":"COUNTIF(elite_adv!A:A,B693)","v":1}]
["Space Marine","Peer (Adeptus Astartes)",500,"Talent","Fel 30",5,{"$f":"AND(cha_fel>=30)","v":true},false,{"$f":"AND(COUNTIF(adv!A:A,B694))","v":false},true,{"$f":"COUNTIF(elite_adv!A:A,B694)","v":1}]
["Space Marine","Signature Wargear",500,"Talent","",5,true,false,{"$f":"AND(COUNTIF(adv!A:A,B695))","v":false},false,{"$f":"COUNTIF(elite_adv!A:A,B695)","v":1}]
["Space Marine","Sound Constitution (SM5)",1000,"Talent","",5,true,false,{"$f":"AND(COUNTIF(adv!A:A,B696))","v":false},false,{"$f":"COUNTIF(elite_adv!A:A,B696)","v":0}]
["Space Marine","Sound Constitution (SM6)",1000,"Talent","",5,true,false,{"$f":"AND(COUNTIF(adv!A:A,B697))","v":false},false,{"$f":"COUNTIF(elite_adv!A:A,B697)","v":0}]
["Space Marine","Charm +20",800,"Skill","Charm +10",6,{"$f":"AND(COUNTIF(adv!A:A,E698))","v":false},false,{"$f":"AND(COUNTIF(adv!A:A,B698))","v":false},true,{"$f":"COUNTIF(elite_adv!A:A,B698)","v":1}]
["Space Marine","Command +20",800,"Skill","Command +10",6,{"$f":"AND(COUNTIF(adv!A:A,E699))","v":false},false,{"$f":"AND(COUNTIF(adv!A:A,B699))","v":false},true,{"$f":"COUNTIF(elite_adv!A:A,B699)","v":1}]
["Space Marine","Deceive +20",400,"Skill","Deceive +10",6,{"$f":"AND(COUNTIF(adv!A:A,E700))","v":false},false,{"$f":"AND(COUNTIF(adv!A:A,B700))","v":false},true,{"$f":"COUNTIF(elite_adv!A:A,B700)","v":1}]
["Space Marine","Demolition +20",400,"Skill","Demolition +10",6,{"$f":"AND(COUNTIF(adv!A:A,E701))","v":false},false,{"$f":"AND(COUNTIF(adv!A:A,B701))","v":false},false,{"$f":"COUNTIF(elite_adv!A:A,B701)","v":1}]
["Space Marine","Gamble +20",200,"Skill","Gamble +10",6,{"$f":"AND(COUNTIF(adv!A:A,E702))","v":false},false,{"$f":"AND(COUNTIF(adv!A:A,B702))","v":false},true,{"$f":"COUNTIF(elite_adv!A:A,B702)","v":1}]
["Space Marine","Inquiry +20",800,"Skill","Inquiry +10",6,{"$f":"AND(COUNTIF(adv!A:A,E703))","v":false},false,{"$f":"AND(COUNTIF(adv!A:A,B703))","v":false},true,{"$f":"COUNTIF(elite_adv!A:A,B703)","v":1}]
["Space Marine","Logic +20",400,"Skill","Logic +10",6,{"$f":"AND(COUNTIF(adv!A:A,E704))","v":false},false,{"$f":"AND(COUNTIF(adv!A:A,B704))","v":false},true,{"$f":"COUNTIF(elite_adv!A:A,B704)","v":1}]
["Space Marine","Navigation (Surface) +10",400,"Skill","Navigation (Surface)",6,{"$f":"AND(COUNTIF(adv!A:A,E705))","v":false},true,{"$f":"AND(COUNTIF(adv!A:A,B705))","v":false},true,{"$f":"COUNTIF(elite_adv!A:A,B705)","v":1}]
["Space Marine","Scrutiny +20",400,"Skill","Scrutiny +10",6,{"$f":"AND(COUNTIF(adv!A:A,E706))","v":false},false,{"$f":"AND(COUNTIF(adv!A:A,B706))","v":false},true,{"$f":"COUNTIF(elite_adv!A:A,B706)","v":1}]
["Space Marine","Good Reputation (Adeptus Astartes)",500,"Talent","Fel 50, Peer (Adeptus Astartes)",6,{"$f":"AND(cha_fel>=50,COUNTIF(adv!A:A,\"Peer (Adeptus Astartes)\"))","v":false},false,{"$f":"AND(COUNTIF(adv!A:A,B707))","v":false},true,{"$f":"COUNTIF(elite_adv!A:A,B707)","v":1}]
["Space Marine","Hammer Blow",1000,"Talent","",6,true,false,{"$f":"AND(COUNTIF(adv!A:A,B708))","v":false},false,{"$f":"COUNTIF(elite_adv!A:A,B708)","v":1}]
["Space Marine","Last Man Standing",500,"Talent","Nerves of Steel",6,{"$f":"AND(COUNTIF(adv!A:A,E709))","v":false},false,{"$f":"AND(COUNTIF(adv!A:A,B709))","v":false},false,{"$f":"COUNTIF(elite_adv!A:A,B709)","v":1}]
["Space Marine","Paranoia",500,"Talent","",6,true,false,{"$f":"AND(COUNTIF(adv!A:A,B710))","v":false},true,{"$f":"COUNTIF(elite_adv!A:A,B710)","v":1}]
["Space Marine","Sound Constitution (SM7)",1000,"Talent","",6,true,false,{"$f":"AND(COUNTIF(adv!A:A,B711))","v":false},false,{"$f":"COUNTIF(elite_adv!A:A,B711)","v":0}]
["Space Marine","Unbowed and Unbroken",1500,"Talent","Fel 30",6,{"$f":"AND(cha_fel>=30)","v":true},false,{"$f":"AND(COUNTIF(adv!A:A,B712))","v":false},true,{"$f":"COUNTIF(elite_adv!A:A,B712)","v":1}]
["Space Marine","Wisdom of the Ancients",1000,"Talent","Int 40",6,{"$f":"AND(cha_int>=40)","v":false},false,{"$f":"AND(COUNTIF(adv!A:A,B713))","v":false},true,{"$f":"COUNTIF(elite_adv!A:A,B713)","v":1}]
["Space Marine","Pilot (any) +20",800,"Skill","Pilot (same skill group) +10",7,true,true,{"$f":"AND(COUNTIF(adv!A:A,B714))","v":false},false,{"$f":"COUNTIF(elite_adv!A:A,B714)","v":0}]
["Space Marine","Tactics (any) +10",400,"Skill","Tactics (same skill group)",7,true,true,{"$f":"AND(COUNTIF(adv!A:A,B715))","v":false},true,{"$f":"COUNTIF(elite_adv!A:A,B715)","v":0}]
["Space Marine","Chem-Use",800,"Skill","",7,true,false,{"$f":"AND(COUNTIF(adv!A:A,B716))","v":false},false,{"$f":"COUNTIF(elite_adv!A:A,B716)","v":1}]
["Space Marine","Evaluate +20",400,"Skill","Evaluate +10",7,{"$f":"AND(COUNTIF(adv!A:A,E717))","v":false},false,{"$f":"AND(COUNTIF(adv!A:A,B717))","v":false},true,{"$f":"COUNTIF(elite_adv!A:A,B717)","v":1}]
["Space Marine","Interrogation +10",400,"Skill","Interrogation",7,{"$f":"AND(COUNTIF(adv!A:A,E718))","v":false},false,{"$f":"AND(COUNTIF(adv!A:A,B718))","v":false},true,{"$f":"COUNTIF(elite_adv!A:A,B718)","v":1}]
["Space Marine","Lore: Forbidden (Adeptus Astartes) +10",400,"Skill","Lore: Forbidden (Adeptus Astartes)",7,{"$f":"AND(COUNTIF(adv!A:A,E719))","v":false},true,{"$f":"AND(COUNTIF(adv!A:A,B719))","v":false},true,{"$f":"COUNTIF(elite_adv!A:A,B719)","v":1}]
["Space Marine","Navigation (Surface) +20",400,"Skill","Navigation (Surface) +10",7,{"$f":"AND(COUNTIF(adv!A:A,E720))","v":false},true,{"$f":"AND(COUNTIF(adv!A:A,B720))","v":false},true,{"$f":"COUNTIF(elite_adv!A:A,B720)","v":1}]
["Space Marine","Security +20",800,"Skill","Security +10",7,{"$f":"AND(COUNTIF(adv!A:A,E721))","v":false},false,{"$f":"AND(COUNTIF(adv!A:A,B721))","v":false},false,{"$f":"COUNTIF(elite_adv!A:A,B721)","v":1}]
["Space Marine","Tech-Use +10",800,"Skill","Tech-Use",7,{"$f":"AND(COUNTIF(adv!A:A,E722))","v":false},false,{"$f":"AND(COUNTIF(adv!A:A,B722))","v":false},true,{"$f":"COUNTIF(elite_adv!A:A,B722)","v":1}]
["Space Marine","Tracking +20",400,"Skill","Tracking +10",7,{"$f":"AND(COUNTIF(adv!A:A,E723))","v":false},false,{"$f":"AND(COUNTIF(adv!A:A,B723))","v":false},true,{"$f":"COUNTIF(elite_adv!A:A,B723)","v":1}]
["Space Marine","Wrangling +20",200,"Skill","Wrangling +10",7,{"$f":"AND(COUNTIF(adv!A:A,E724))","v":false},false,{"$f":"AND(COUNTIF(adv!A:A,B724))","v":false},false,{"$f":"COUNTIF(elite_adv!A:A,B724)","v":1}]
["Space Marine","Signature Wargear: Hero (any)",1500,"Talent",null,7,true,true,{"$f":"AND(COUNTIF(adv!A:A,B725))","v":false},false,{"$f":"COUNTIF(elite_adv!A:A,B725)","v":0}]
["Space Marine","Blind Fighting",800,"Talent","Per 30",7,{"$f":"AND(cha_per>=30)","v":true},false,{"$f":"AND(COUNTIF(adv!A:A,B726))","v":false},false,{"$f":"COUNTIF(elite_adv!A:A,B726)","v":1}]
["Space Marine","Bolter Drill",1500,"Talent","Astartes Weapon Training",7,{"$f":"AND(COUNTIF(adv!A:A,E727))","v":false},false,{"$f":"AND(COUNTIF(adv!A:A,B727))","v":false},false,{"$f":"COUNTIF(elite_adv!A:A,B727)","v":1}]
["Space Marine","Fearless",1000,"Talent","",7,true,false,{"$f":"AND(COUNTIF(adv!A:A,B728))","v":false},true,{"$f":"COUNTIF(elite_adv!A:A,B728)","v":1}]
["Space Marine","Sound Constitution (SM8)",1000,"Talent","",7,true,false,{"$f":"AND(COUNTIF(adv!A:A,B729))","v":false},false,{"$f":"COUNTIF(elite_adv!A:A,B729)","v":0}]
["Space Marine","Tactics (any) +20",800,"Skill","Tactics (same skill group) +10",8,true,true,{"$f":"AND(COUNTIF(adv!A:A,B730))","v":false},true,{"$f":"COUNTIF(elite_adv!A:A,B730)","v":0}]
["Space Marine","Dodge +20",600,"Skill","Dodge +10",8,{"$f":"AND(COUNTIF(adv!A:A,E731))","v":false},false,{"$f":"AND(COUNTIF(adv!A:A,B731))","v":false},true,{"$f":"COUNTIF(elite_adv!A:A,B731)","v":1}]
["Space Marine","Interrogation +20",400,"Skill","Interrogation +10",8,{"$f":"AND(COUNTIF(adv!A:A,E732))","v":false},false,{"$f":"AND(COUNTIF(adv!A:A,B732))","v":false},true,{"$f":"COUNTIF(elite_adv!A:A,B732)","v":1}]
["Space Marine","Lore: Forbidden (Adeptus Astartes) +20",400,"Skill","Lore: Forbidden (Adeptus Astartes) +10",8,{"$f":"AND(COUNTIF(adv!A:A,E733))","v":false},true,{"$f":"AND(COUNTIF(adv!A:A,B733))","v":false},true,{"$f":"COUNTIF(elite_adv!A:A,B733)","v":1}]
["Space Marine","Medicae",800,"Skill","",8,true,false,{"$f":"AND(COUNTIF(adv!A:A,B734))","v":false},false,{"$f":"COUNTIF(elite_adv!A:A,B734)","v":1}]
["Space Marine","Tactics (Armoured Tactics) +20",800,"Skill","Tactics (Armoured Tactics) +10",8,true,true,{"$f":"AND(COUNTIF(adv!A:A,B735))","v":false},true,{"$f":"COUNTIF(elite_adv!A:A,B735)","v":1}]
["Space Marine","Tactics (Assault Doctrine) +20",800,"Skill","Tactics (Assault Doctrine) +10",8,true,true,{"$f":"AND(COUNTIF(adv!A:A,B736))","v":false},true,{"$f":"COUNTIF(elite_adv!A:A,B736)","v":1}]
["Space Marine","Tactics (Defensive Doctrine) +20",800,"Skill","Tactics (Defensive Doctrine) +10",8,true,true,{"$f":"AND(COUNTIF(adv!A:A,B737))","v":false},true,{"$f":"COUNTIF(elite_adv!A:A,B737)","v":1}]
["Space Marine","Tactics (Orbital Drop Procedures) +20",800,"Skill","Tactics (Orbital Drop Procedures) +10",8,true,true,{"$f":"AND(COUNTIF(adv!A:A,B738))","v":false},true,{"$f":"COUNTIF(elite_adv!A:A,B738)","v":1}]
["Space Marine","Tactics (Recon and Stealth) +20",800,"Skill","Tactics (Recon and Stealth) +10",8,true,true,{"$f":"AND(COUNTIF(adv!A:A,B739))","v":false},true,{"$f":"COUNTIF(elite_adv!A:A,B739)","v":1}]
["Space Marine","Tactics (Void Combat) +20",800,"Skill","Tactics (Void Combat) +10",8,true,true,{"$f":"AND(COUNTIF(adv!A:A,B740))","v":false},true,{"$f":"COUNTIF(elite_adv!A:A,B740)","v":1}]
["Space Marine","Into the Jaws of Hell",1500,"Talent","Iron Discipline",8,{"$f":"AND(COUNTIF(adv!A:A,E741))","v":false},false,{"$f":"AND(COUNTIF(adv!A:A,B741))","v":false},true,{"$f":"COUNTIF(elite_adv!A:A,B741)","v":1}]
["Space Marine","Master Orator",1000,"Talent","Fel 30",8,{"$f":"AND(cha_fel>=30)","v":true},false,{"$f":"AND(COUNTIF(adv!A:A,B742))","v":false},true,{"$f":"COUNTIF(elite_adv!A:A,B742)","v":1}]
["Space Marine","Sound Constitution (SM9)",1000,"Talent","",8,true,false,{"$f":"AND(COUNTIF(adv!A:A,B743))","v":false},false,{"$f":"COUNTIF(elite_adv!A:A,B743)","v":0}]
["Space Wolves","Carouse",200,"Skill",null,0,true,false,{"$f":"AND(COUNTIF(adv!A:A,B744))","v":false},false,{"$f":"COUNTIF(elite_adv!A:A,B744)","v":1}]
["Space Wolves","Carouse +10",200,"Skill","Carouse",0,{"$f":"AND(COUNTIF(adv!A:A,E745))","v":false},false,{"$f":"AND(COUNTIF(adv!A:A,B745))","v":false},false,{"$f":"COUNTIF(elite_adv!A:A,B745)","v":1}]
["Space Wolves","Carouse +20",200,"Skill","Carouse +10",0,{"$f":"AND(COUNTIF(adv!A:A,E746))","v":false},false,{"$f":"AND(COUNTIF(adv!A:A,B746))","v":false},false,{"$f":"COUNTIF(elite_adv!A:A,B746)","v":1}]
["Space Wolves","Performer (Dancer)",200,"Skill",null,0,true,true,{"$f":"AND(COUNTIF(adv!A:A,B747))","v":false},false,{"$f":"COUNTIF(elite_adv!A:A,B747)","v":1}]
["Space Wolves","Performer (Dancer) +10",200,"Skill","Performer (Dancer)",0,{"$f":"AND(COUNTIF(adv!A:A,E748))","v":false},true,{"$f":"AND(COUNTIF(adv!A:A,B748))","v":false},false,{"$f":"COUNTIF(elite_adv!A:A,B748)","v":1}]
["Space Wolves","Performer (Dancer) +20",200,"Skill","Performer (Dancer) +10",0,{"$f":"AND(COUNTIF(adv!A:A,E749))","v":false},true,{"$f":"AND(COUNTIF(adv!A:A,B749))","v":false},false,{"$f":"COUNTIF(elite_adv!A:A,B749)","v":1}]
["Space Wolves","Performer (Musician)",200,"Skill",null,0,true,true,{"$f":"AND(COUNTIF(adv!A:A,B750))","v":false},false,{"$f":"COUNTIF(elite_adv!A:A,B750)","v":1}]
["Space Wolves","Performer (Musician) +10",200,"Skill","Performer (Musician)",0,{"$f":"AND(COUNTIF(adv!A:A,E751))","v":false},true,{"$f":"AND(COUNTIF(adv!A:A,B751))","v":false},false,{"$f":"COUNTIF(elite_adv!A:A,B751)","v":1}]
["Space Wolves","Performer (Musician) +20",200,"Skill","Performer (Musician) +10",0,{"$f":"AND(COUNTIF(adv!A:A,E752))","v":false},true,{"$f":"AND(COUNTIF(adv!A:A,B752))","v":false},false,{"$f":"COUNTIF(elite_adv!A:A,B752)","v":1}]
["Space Wolves","Performer (Singer)",200,"Skill",null,0,true,true,{"$f":"AND(COUNTIF(adv!A:A,B753))","v":false},false,{"$f":"COUNTIF(elite_adv!A:A,B753)","v":1}]
["Space Wolves","Performer (Singer) +10",200,"Skill","Performer (Singer)",0,{"$f":"AND(COUNTIF(adv!A:A,E754))","v":false},true,{"$f":"AND(COUNTIF(adv!A:A,B754))","v":false},false,{"$f":"COUNTIF(elite_adv!A:A,B754)","v":1}]
["Space Wolves","Performer (Singer) +20",200,"Skill","Performer (Singer) +10",0,{"$f":"AND(COUNTIF(adv!A:A,E755))","v":false},true,{"$f":"AND(COUNTIF(adv!A:A,B755))","v":false},false,{"$f":"COUNTIF(elite_adv!A:A,B755)","v":1}]
["Space Wolves","Performer (Storyteller)",200,"Skill",null,0,true,true,{"$f":"AND(COUNTIF(adv!A:A,B756))","v":false},false,{"$f":"COUNTIF(elite_adv!A:A,B756)","v":1}]
["Space Wolves","Performer (Storyteller) +10",200,"Skill","Performer (Storyteller)",0,{"$f":"AND(COUNTIF(adv!A:A,E757))","v":false},true,{"$f":"AND(COUNTIF(adv!A:A,B757))","v":false},false,{"$f":"COUNTIF(elite_adv!A:A,B757)","v":1}]
["Space Wolves","Performer (Storyteller) +20",200,"Skill","Performer (Storyteller) +10",0,{"$f":"AND(COUNTIF(adv!A:A,E758))","v":false},true,{"$f":"AND(COUNTIF(adv!A:A,B758))","v":false},false,{"$f":"COUNTIF(elite_adv!A:A,B758)","v":1}]
["Space Wolves","Tracking",200,"Skill",null,0,true,false,{"$f":"AND(COUNTIF(adv!A:A,B759))","v":false},false,{"$f":"COUNTIF(elite_adv!A:A,B759)","v":1}]
["Space Wolves","Tracking +10",200,"Skill","Tracking",0,{"$f":"AND(COUNTIF(adv!A:A,E760))","v":false},false,{"$f":"AND(COUNTIF(adv!A:A,B760))","v":false},false,{"$f":"COUNTIF(elite_adv!A:A,B760)","v":1}]
["Space Wolves","Tracking +20",200,"Skill","Tracking +10",0,{"$f":"AND(COUNTIF(adv!A:A,E761))","v":false},false,{"$f":"AND(COUNTIF(adv!A:A,B761))","v":false},false,{"$f":"COUNTIF(elite_adv!A:A,B761)","v":1}]
["Space Wolves","Wrangling",100,"Skill",null,0,true,false,{"$f":"AND(COUNTIF(adv!A:A,B762))","v":false},false,{"$f":"COUNTIF(elite_adv!A:A,B762)","v":1}]
["Space Wolves","Wrangling +10",100,"Skill","Wrangling",0,{"$f":"AND(COUNTIF(adv!A:A,E763))","v":false},false,{"$f":"AND(COUNTIF(adv!A:A,B763))","v":false},false,{"$f":"COUNTIF(elite_adv!A:A,B763)","v":1}]
["Space Wolves","Wrangling +20",100,"Skill","Wrangling +10",0,{"$f":"AND(COUNTIF(adv!A:A,E764))","v":false},false,{"$f":"AND(COUNTIF(adv!A:A,B764))","v":false},false,{"$f":"COUNTIF(elite_adv!A:A,B764)","v":1}]
["Space Wolves","Flesh Render",500,"Talent",null,0,true,false,{"$f":"AND(COUNTIF(adv!A:A,B765))","v":false},false,{"$f":"COUNTIF(elite_adv!A:A,B765)","v":1}]
["Space Wolves","Hardy",400,"Talent",null,0,true,false,{"$f":"AND(COUNTIF(adv!A:A,B766))","v":false},false,{"$f":"COUNTIF(elite_adv!A:A,B766)","v":1}]
["Space Wolves","Hatred (Chaos Space Marines)",500,"Talent",null,0,true,false,{"$f":"AND(COUNTIF(adv!A:A,B767))","v":false},false,{"$f":"COUNTIF(elite_adv!A:A,B767)","v":1}]
["Space Wolves","Heightened Senses (Taste)",500,"Talent",null,0,true,false,{"$f":"AND(COUNTIF(adv!A:A,B768))","v":false},false,{"$f":"COUNTIF(elite_adv!A:A,B768)","v":1}]
["Space Wolves","Talented (Carouse)",500,"Talent",null,0,true,false,{"$f":"AND(COUNTIF(adv!A:A,B769))","v":false},false,{"$f":"COUNTIF(elite_adv!A:A,B769)","v":1}]
["Space Wolves","Talented (Tracking)",500,"Talent",null,0,true,false,{"$f":"AND(COUNTIF(adv!A:A,B770))","v":false},false,{"$f":"COUNTIF(elite_adv!A:A,B770)","v":1}]
["Space Wolves","Wisdom of the Ancients",1500,"Talent",null,0,true,false,{"$f":"AND(COUNTIF(adv!A:A,B771))","v":false},false,{"$f":"COUNTIF(elite_adv!A:A,B771)","v":1}]
["Storm Wardens","Gamble",200,"Skill",null,0,true,false,{"$f":"AND(COUNTIF(adv!A:A,B772))","v":false},false,{"$f":"COUNTIF(elite_adv!A:A,B772)","v":1}]
["Storm Wardens","Gamble +10",200,"Skill","Gamble",0,{"$f":"AND(COUNTIF(adv!A:A,E773))","v":false},false,{"$f":"AND(COUNTIF(adv!A:A,B773))","v":false},false,{"$f":"COUNTIF(elite_adv!A:A,B773)","v":1}]
["Storm Wardens","Gamble +20",200,"Skill","Gamble +10",0,{"$f":"AND(COUNTIF(adv!A:A,E774))","v":false},false,{"$f":"AND(COUNTIF(adv!A:A,B774))","v":false},false,{"$f":"COUNTIF(elite_adv!A:A,B774)","v":1}]
["Storm Wardens","Tracking",400,"Skill",null,0,true,false,{"$f":"AND(COUNTIF(adv!A:A,B775))","v":false},false,{"$f":"COUNTIF(elite_adv!A:A,B775)","v":1}]
["Storm Wardens","Tracking +10",400,"Skill","Tracking",0,{"$f":"AND(COUNTIF(adv!A:A,E776))","v":false},false,{"$f":"AND(COUNTIF(adv!A:A,B776))","v":false},false,{"$f":"COUNTIF(elite_adv!A:A,B776)","v":1}]
["Storm Wardens","Tracking +20",400,"Skill","Tracking +10",0,{"$f":"AND(COUNTIF(adv!A:A,E777))","v":false},false,{"$f":"AND(COUNTIF(adv!A:A,B777))","v":false},false,{"$f":"COUNTIF(elite_adv!A:A,B777)","v":1}]
["Storm Wardens","Duty Unto Death",800,"Talent","WP 45",0,{"$f":"AND(cha_wp>=45)","v":false},false,{"$f":"AND(COUNTIF(adv!A:A,B778))","v":false},false,{"$f":"COUNTIF(elite_adv!A:A,B778)","v":1}]
["Storm Wardens","Hammer Blow",500,"Talent",null,0,true,false,{"$f":"AND(COUNTIF(adv!A:A,B779))","v":false},false,{"$f":"COUNTIF(elite_adv!A:A,B779)","v":1}]
["Storm Wardens","Stalwart Defence",800,"Talent",null,0,true,false,{"$f":"AND(COUNTIF(adv!A:A,B780))","v":false},false,{"$f":"COUNTIF(elite_adv!A:A,B780)","v":1}]
["Storm Wardens","Talented (Drive (Ground Vehicles))",500,"Talent",null,0,true,false,{"$f":"AND(COUNTIF(adv!A:A,B781))","v":false},false,{"$f":"COUNTIF(elite_adv!A:A,B781)","v":1}]
["Storm Wardens","Thunder Charge",1000,"Talent",null,0,true,false,{"$f":"AND(COUNTIF(adv!A:A,B782))","v":false},false,{"$f":"COUNTIF(elite_adv!A:A,B782)","v":1}]
["Ultramarines","Performer (any)",200,"Skill",null,0,true,true,{"$f":"AND(COUNTIF(adv!A:A,B783))","v":false},false,{"$f":"COUNTIF(elite_adv!A:A,B783)","v":0}]
["Ultramarines","Performer (any) +10",200,"Skill","Performer (same skill group)",0,true,true,{"$f":"AND(COUNTIF(adv!A:A,B784))","v":false},false,{"$f":"COUNTIF(elite_adv!A:A,B784)","v":0}]
["Ultramarines","Performer (any) +20",200,"Skill","Performer (same skill group) +10",0,true,true,{"$f":"AND(COUNTIF(adv!A:A,B785))","v":false},false,{"$f":"COUNTIF(elite_adv!A:A,B785)","v":0}]
["Ultramarines","Tactics (any)",400,"Skill",null,0,true,true,{"$f":"AND(COUNTIF(adv!A:A,B786))","v":false},false,{"$f":"COUNTIF(elite_adv!A:A,B786)","v":0}]
["Ultramarines","Tactics (any) +10",400,"Skill","Tactics (same skill group)",0,true,true,{"$f":"AND(COUNTIF(adv!A:A,B787))","v":false},false,{"$f":"COUNTIF(elite_adv!A:A,B787)","v":0}]
["Ultramarines","Tactics (any) +20",400,"Skill","Tactics (same skill group) +10",0,true,true,{"$f":"AND(COUNTIF(adv!A:A,B788))","v":false},false,{"$f":"COUNTIF(elite_adv!A:A,B788)","v":0}]
["Ultramarines","Charm",400,"Skill",null,0,true,false,{"$f":"AND(COUNTIF(adv!A:A,B789))","v":false},false,{"$f":"COUNTIF(elite_adv!A:A,B789)","v":1}]
["Ultramarines","Charm +10",400,"Skill","Charm",0,{"$f":"AND(COUNTIF(adv!A:A,E790))","v":false},false,{"$f":"AND(COUNTIF(adv!A:A,B790))","v":false},false,{"$f":"COUNTIF(elite_adv!A:A,B790)","v":1}]
["Ultramarines","Charm +20",400,"Skill","Charm +10",0,{"$f":"AND(COUNTIF(adv!A:A,E791))","v":false},false,{"$f":"AND(COUNTIF(adv!A:A,B791))","v":false},false,{"$f":"COUNTIF(elite_adv!A:A,B791)","v":1}]
["Ultramarines","Command",400,"Skill",null,0,true,false,{"$f":"AND(COUNTIF(adv!A:A,B792))","v":false},false,{"$f":"COUNTIF(elite_adv!A:A,B792)","v":1}]
["Ultramarines","Command +10",400,"Skill","Command",0,{"$f":"AND(COUNTIF(adv!A:A,E793))","v":false},false,{"$f":"AND(COUNTIF(adv!A:A,B793))","v":false},false,{"$f":"COUNTIF(elite_adv!A:A,B793)","v":1}]
["Ultramarines","Command +20",400,"Skill","Command +10",0,{"$f":"AND(COUNTIF(adv!A:A,E794))","v":false},false,{"$f":"AND(COUNTIF(adv!A:A,B794))","v":false},false,{"$f":"COUNTIF(elite_adv!A:A,B794)","v":1}]
["Ultramarines","Good Reputation (any)",800,"Talent","Fellowship 50, Peer (same Skill group)",0,true,true,{"$f":"AND(COUNTIF(adv!A:A,B795))","v":false},false,{"$f":"COUNTIF(elite_adv!A:A,B795)","v":0}]
["Ultramarines","Peer (any)",500,"Talent","Fel 30",0,true,true,{"$f":"AND(COUNTIF(adv!A:A,B796))","v":false},false,{"$f":"COUNTIF(elite_adv!A:A,B796)","v":0}]
["Ultramarines","Duty Unto Death",800,"Talent","WP 45",0,{"$f":"AND(cha_wp>=45)","v":false},false,{"$f":"AND(COUNTIF(adv!A:A,B797))","v":false},false,{"$f":"COUNTIF(elite_adv!A:A,B797)","v":1}]
["Ultramarines","Exemplar of Honour",800,"Talent",null,0,true,false,{"$f":"AND(COUNTIF(adv!A:A,B798))","v":false},false,{"$f":"COUNTIF(elite_adv!A:A,B798)","v":1}]
["Ultramarines","Hatred (Tyranids)",500,"Talent",null,0,true,false,{"$f":"AND(COUNTIF(adv!A:A,B799))","v":false},false,{"$f":"COUNTIF(elite_adv!A:A,B799)","v":1}]
["Ultramarines","Talented (Command)",500,"Talent",null,0,true,false,{"$f":"AND(COUNTIF(adv!A:A,B800))","v":false},false,{"$f":"COUNTIF(elite_adv!A:A,B800)","v":1}]
["Veteran","Command",200,"Skill",null,0,true,false,{"$f":"AND(COUNTIF(adv!A:A,B801))","v":false},false,{"$f":"COUNTIF(elite_adv!A:A,B801)","v":1}]
["Veteran","Command +10",300,"Skill","Command",0,{"$f":"AND(COUNTIF(adv!A:A,E802))","v":false},false,{"$f":"AND(COUNTIF(adv!A:A,B802))","v":false},false,{"$f":"COUNTIF(elite_adv!A:A,B802)","v":1}]
["Veteran","Command +20",400,"Skill","Command +10",0,{"$f":"AND(COUNTIF(adv!A:A,E803))","v":false},false,{"$f":"AND(COUNTIF(adv!A:A,B803))","v":false},false,{"$f":"COUNTIF(elite_adv!A:A,B803)","v":1}]
["Veteran","Concealment",400,"Skill",null,0,true,false,{"$f":"AND(COUNTIF(adv!A:A,B804))","v":false},false,{"$f":"COUNTIF(elite_adv!A:A,B804)","v":1}]
["Veteran","Concealment +10",500,"Skill","Concealment",0,{"$f":"AND(COUNTIF(adv!A:A,E805))","v":false},false,{"$f":"AND(COUNTIF(adv!A:A,B805))","v":false},false,{"$f":"COUNTIF(elite_adv!A:A,B805)","v":1}]
["Veteran","Demolition",200,"Skill",null,0,true,false,{"$f":"AND(COUNTIF(adv!A:A,B806))","v":false},false,{"$f":"COUNTIF(elite_adv!A:A,B806)","v":1}]
["Veteran","Demolition +10",300,"Skill","Demolition",0,{"$f":"AND(COUNTIF(adv!A:A,E807))","v":false},false,{"$f":"AND(COUNTIF(adv!A:A,B807))","v":false},false,{"$f":"COUNTIF(elite_adv!A:A,B807)","v":1}]
["Veteran","Dodge",200,"Skill",null,0,true,false,{"$f":"AND(COUNTIF(adv!A:A,B808))","v":false},false,{"$f":"COUNTIF(elite_adv!A:A,B808)","v":1}]
["Veteran","Dodge +10",300,"Skill","Dodge",0,{"$f":"AND(COUNTIF(adv!A:A,E809))","v":false},false,{"$f":"AND(COUNTIF(adv!A:A,B809))","v":false},false,{"$f":"COUNTIF(elite_adv!A:A,B809)","v":1}]
["Veteran","Drive (any)",200,"Skill",null,0,true,true,{"$f":"AND(COUNTIF(adv!A:A,B810))","v":false},false,{"$f":"COUNTIF(elite_adv!A:A,B810)","v":0}]
["Veteran","Drive (any) +10",300,"Skill","Drive (any)",0,true,true,{"$f":"AND(COUNTIF(adv!A:A,B811))","v":false},false,{"$f":"COUNTIF(elite_adv!A:A,B811)","v":0}]
["Veteran","Lore: Common (any)",200,"Skill",null,0,true,true,{"$f":"AND(COUNTIF(adv!A:A,B812))","v":false},false,{"$f":"COUNTIF(elite_adv!A:A,B812)","v":0}]
["Veteran","Survival",200,"Skill",null,0,true,false,{"$f":"AND(COUNTIF(adv!A:A,B813))","v":false},false,{"$f":"COUNTIF(elite_adv!A:A,B813)","v":1}]
["Veteran","Survival +10",300,"Skill","Survival",0,{"$f":"AND(COUNTIF(adv!A:A,E814))","v":false},false,{"$f":"AND(COUNTIF(adv!A:A,B814))","v":false},false,{"$f":"COUNTIF(elite_adv!A:A,B814)","v":1}]
["Veteran","Tactics (any)",400,"Skill",null,0,true,true,{"$f":"AND(COUNTIF(adv!A:A,B815))","v":false},false,{"$f":"COUNTIF(elite_adv!A:A,B815)","v":0}]
["Veteran","Bolter Drill",1200,"Talent","Astartes Weapon Training",0,{"$f":"AND(COUNTIF(adv!A:A,E816))","v":false},false,{"$f":"AND(COUNTIF(adv!A:A,B816))","v":false},false,{"$f":"COUNTIF(elite_adv!A:A,B816)","v":1}]
["Veteran","Combat Formation",1000,"Talent","Int 40",0,{"$f":"AND(cha_int>=40)","v":false},false,{"$f":"AND(COUNTIF(adv!A:A,B817))","v":false},false,{"$f":"COUNTIF(elite_adv!A:A,B817)","v":1}]
["Veteran","Foresight",600,"Talent","Int 30",0,{"$f":"AND(cha_int>=30)","v":true},false,{"$f":"AND(COUNTIF(adv!A:A,B818))","v":false},false,{"$f":"COUNTIF(elite_adv!A:A,B818)","v":1}]
["Veteran","Nerves of Steel",800,"Talent",null,0,true,false,{"$f":"AND(COUNTIF(adv!A:A,B819))","v":false},false,{"$f":"COUNTIF(elite_adv!A:A,B819)","v":1}]
["Veteran","Sound Constitution [Vet1]",1000,"Talent",null,0,true,false,{"$f":"AND(COUNTIF(adv!A:A,B820))","v":false},false,{"$f":"COUNTIF(elite_adv!A:A,B820)","v":0}]
["Veteran","Sound Constitution [Vet2]",1000,"Talent",null,0,true,false,{"$f":"AND(COUNTIF(adv!A:A,B821))","v":false},false,{"$f":"COUNTIF(elite_adv!A:A,B821)","v":0}]
["Veteran","Survivor",1500,"Talent",null,0,true,false,{"$f":"AND(COUNTIF(adv!A:A,B822))","v":false},false,{"$f":"COUNTIF(elite_adv!A:A,B822)","v":1}]
["Veteran","Wisdom of the Ancients",800,"Talent","Int 40",0,{"$f":"AND(cha_int>=40)","v":false},false,{"$f":"AND(COUNTIF(adv!A:A,B823))","v":false},false,{"$f":"COUNTIF(elite_adv!A:A,B823)","v":1}]
["Watch Captain","Charm",200,"Skill",null,0,true,false,{"$f":"AND(COUNTIF(adv!A:A,B824))","v":false},false,{"$f":"COUNTIF(elite_adv!A:A,B824)","v":1}]
["Watch Captain","Command",200,"Skill",null,0,true,false,{"$f":"AND(COUNTIF(adv!A:A,B825))","v":false},false,{"$f":"COUNTIF(elite_adv!A:A,B825)","v":1}]
["Watch Captain","Command +10",200,"Skill","Command",0,{"$f":"AND(COUNTIF(adv!A:A,E826))","v":false},false,{"$f":"AND(COUNTIF(adv!A:A,B826))","v":false},false,{"$f":"COUNTIF(elite_adv!A:A,B826)","v":1}]
["Watch Captain","Command +20",200,"Skill","Command +10",0,{"$f":"AND(COUNTIF(adv!A:A,E827))","v":false},false,{"$f":"AND(COUNTIF(adv!A:A,B827))","v":false},false,{"$f":"COUNTIF(elite_adv!A:A,B827)","v":1}]
["Watch Captain","Lore: Forbidden (Adeptus Astartes)",400,"Skill",null,0,true,true,{"$f":"AND(COUNTIF(adv!A:A,B828))","v":false},false,{"$f":"COUNTIF(elite_adv!A:A,B828)","v":1}]
["Watch Captain","Lore: Forbidden (Adeptus Astartes) +10",400,"Skill","Lore: Forbidden (Adeptus Astartes)",0,{"$f":"AND(COUNTIF(adv!A:A,E829))","v":false},true,{"$f":"AND(COUNTIF(adv!A:A,B829))","v":false},false,{"$f":"COUNTIF(elite_adv!A:A,B829)","v":1}]
["Watch Captain","Lore: Forbidden (Adeptus Astartes) +20",400,"Skill","Lore: Forbidden (Adeptus Astartes) +10",0,{"$f":"AND(COUNTIF(adv!A:A,E830))","v":false},true,{"$f":"AND(COUNTIF(adv!A:A,B830))","v":false},false,{"$f":"COUNTIF(elite_adv!A:A,B830)","v":1}]
["Watch Captain","Lore: Forbidden (The Inquisition)",400,"Skill",null,0,true,true,{"$f":"AND(COUNTIF(adv!A:A,B831))","v":false},false,{"$f":"COUNTIF(elite_adv!A:A,B831)","v":1}]
["Watch Captain","Lore: Forbidden (The Traitor Legions)",400,"Skill",null,0,true,true,{"$f":"AND(COUNTIF(adv!A:A,B832))","v":false},false,{"$f":"COUNTIF(elite_adv!A:A,B832)","v":1}]
["Watch Captain","Lore: Scholastic (Codex Astartes)",400,"Skill",null,0,true,true,{"$f":"AND(COUNTIF(adv!A:A,B833))","v":false},false,{"$f":"COUNTIF(elite_adv!A:A,B833)","v":1}]
["Watch Captain","Lore: Scholastic (Codex Astartes) +10",400,"Skill","Lore: Scholastic (Codex Astartes)",0,{"$f":"AND(COUNTIF(adv!A:A,E834))","v":false},true,{"$f":"AND(COUNTIF(adv!A:A,B834))","v":false},false,{"$f":"COUNTIF(elite_adv!A:A,B834)","v":1}]
["Watch Captain","Lore: Scholastic (Codex Astartes) +20",400,"Skill","Lore: Scholastic (Codex Astartes) +10",0,{"$f":"AND(COUNTIF(adv!A:A,E835))","v":false},true,{"$f":"AND(COUNTIF(adv!A:A,B835))","v":false},false,{"$f":"COUNTIF(elite_adv!A:A,B835)","v":1}]
["Watch Captain","Lore: Scholastic (Tactica Imperialis)",400,"Skill",null,0,true,true,{"$f":"AND(COUNTIF(adv!A:A,B836))","v":false},false,{"$f":"COUNTIF(elite_adv!A:A,B836)","v":1}]
["Watch Captain","Lore: Scholastic (Tactica Imperialis) +10",400,"Skill","Lore: Scholastic (Tactica Imperialis)",0,{"$f":"AND(COUNTIF(adv!A:A,E837))","v":false},true,{"$f":"AND(COUNTIF(adv!A:A,B837))","v":false},false,{"$f":"COUNTIF(elite_adv!A:A,B837)","v":1}]
["Watch Captain","Lore: Scholastic (Tactica Imperialis) +20",400,"Skill","Lore: Scholastic (Tactica Imperialis) +10",0,{"$f":"AND(COUNTIF(adv!A:A,E838))","v":false},true,{"$f":"AND(COUNTIF(adv!A:A,B838))","v":false},false,{"$f":"COUNTIF(elite_adv!A:A,B838)","v":1}]
["Watch Captain","Tactics (any)",400,"Skill",null,0,true,true,{"$f":"AND(COUNTIF(adv!A:A,B839))","v":false},false,{"$f":"COUNTIF(elite_adv!A:A,B839)","v":0}]
["Watch Captain","Tactics (any) +10",400,"Skill","Tactics (any)",0,true,true,{"$f":"AND(COUNTIF(adv!A:A,B840))","v":false},false,{"$f":"COUNTIF(elite_adv!A:A,B840)","v":0}]
["Watch Captain","Tactics (any) +20",400,"Skill","Tactics (any) +10",0,true,true,{"$f":"AND(COUNTIF(adv!A:A,B841))","v":false},false,{"$f":"COUNTIF(elite_adv!A:A,B841)","v":0}]
["Watch Captain","Air of Authority",1000,"Talent","Fel 30",0,{"$f":"AND(cha_fel>=30)","v":true},false,{"$f":"AND(COUNTIF(adv!A:A,B842))","v":false},false,{"$f":"COUNTIF(elite_adv!A:A,B842)","v":1}]
["Watch Captain","Combat Sense",500,"Talent",null,0,true,false,{"$f":"AND(COUNTIF(adv!A:A,B843))","v":false},false,{"$f":"COUNTIF(elite_adv!A:A,B843)","v":1}]
["Watch Captain","Commanding Presence",1500,"Talent",null,0,true,false,{"$f":"AND(COUNTIF(adv!A:A,B844))","v":false},false,{"$f":"COUNTIF(elite_adv!A:A,B844)","v":1}]
["Watch Captain","Master Orator",500,"Talent","Fel 30",0,{"$f":"AND(cha_fel>=30)","v":true},false,{"$f":"AND(COUNTIF(adv!A:A,B845))","v":false},false,{"$f":"COUNTIF(elite_adv!A:A,B845)","v":1}]
["Watch Captain","Sound Constitution [WC1]",1000,"Talent",null,0,true,false,{"$f":"AND(COUNTIF(adv!A:A,B846))","v":false},false,{"$f":"COUNTIF(elite_adv!A:A,B846)","v":0}]
["Watch Captain","Sound Constitution [WC2]",1000,"Talent",null,0,true,false,{"$f":"AND(COUNTIF(adv!A:A,B847))","v":false},false,{"$f":"COUNTIF(elite_adv!A:A,B847)","v":0}]
["Strength of Arms","Acrobatics",100,"Skill",null,0,true,false,{"$f":"AND(COUNTIF(adv!A:A,B848))","v":false},false,{"$f":"COUNTIF(elite_adv!A:A,B848)","v":1}]
["Strength of Arms","Acrobatics +10",100,"Skill","Acrobatics",0,true,false,{"$f":"AND(COUNTIF(adv!A:A,B849))","v":false},false,{"$f":"COUNTIF(elite_adv!A:A,B849)","v":1}]
["Strength of Arms","Acrobatics +20",100,"Skill","Acrobatics +10",0,true,false,{"$f":"AND(COUNTIF(adv!A:A,B850))","v":false},false,{"$f":"COUNTIF(elite_adv!A:A,B850)","v":1}]
["Strength of Arms","Investigation",100,"Skill",null,0,true,false,{"$f":"AND(COUNTIF(adv!A:A,B851))","v":false},false,{"$f":"COUNTIF(elite_adv!A:A,B851)","v":0}]
["Strength of Arms","Investigation +10",100,"Skill","Investigation",0,true,false,{"$f":"AND(COUNTIF(adv!A:A,B852))","v":false},false,{"$f":"COUNTIF(elite_adv!A:A,B852)","v":0}]
["Strength of Arms","Investigation +20",100,"Skill","Investigation +10",0,true,false,{"$f":"AND(COUNTIF(adv!A:A,B853))","v":false},false,{"$f":"COUNTIF(elite_adv!A:A,B853)","v":0}]
["Strength of Arms","Blademaster",300,"Talent","WS 30, Melee Weapon Training (any)",0,true,false,{"$f":"AND(COUNTIF(adv!A:A,B854))","v":false},false,{"$f":"COUNTIF(elite_adv!A:A,B854)","v":1}]
["Strength of Arms","Combat Master",300,"Talent","WS 30",0,true,false,{"$f":"AND(COUNTIF(adv!A:A,B855))","v":false},false,{"$f":"COUNTIF(elite_adv!A:A,B855)","v":1}]
["Strength of Arms","Flesh Render",400,"Talent","Adeptus Astartes",0,true,false,{"$f":"AND(COUNTIF(adv!A:A,B856))","v":false},false,{"$f":"COUNTIF(elite_adv!A:A,B856)","v":1}]
["Strength of Arms","Furious Assault",400,"Talent","WS 35",0,true,false,{"$f":"AND(COUNTIF(adv!A:A,B857))","v":false},false,{"$f":"COUNTIF(elite_adv!A:A,B857)","v":1}]
["Death from Afar","Awareness",200,"Skill",null,0,true,false,{"$f":"AND(COUNTIF(adv!A:A,B858))","v":false},false,{"$f":"COUNTIF(elite_adv!A:A,B858)","v":1}]
["Death from Afar","Awareness +10",200,"Skill","Awareness",0,true,false,{"$f":"AND(COUNTIF(adv!A:A,B859))","v":false},false,{"$f":"COUNTIF(elite_adv!A:A,B859)","v":1}]
["Death from Afar","Awareness +20",200,"Skill","Awareness +10",0,true,false,{"$f":"AND(COUNTIF(adv!A:A,B860))","v":false},false,{"$f":"COUNTIF(elite_adv!A:A,B860)","v":1}]
["Death from Afar","Concealment",300,"Skill",null,0,true,false,{"$f":"AND(COUNTIF(adv!A:A,B861))","v":false},false,{"$f":"COUNTIF(elite_adv!A:A,B861)","v":1}]
["Death from Afar","Concealment +10",300,"Skill","Concealment",0,true,false,{"$f":"AND(COUNTIF(adv!A:A,B862))","v":false},false,{"$f":"COUNTIF(elite_adv!A:A,B862)","v":1}]
["Death from Afar","Concealment +20",300,"Skill","Concealment +10",0,true,false,{"$f":"AND(COUNTIF(adv!A:A,B863))","v":false},false,{"$f":"COUNTIF(elite_adv!A:A,B863)","v":1}]
["Death from Afar","Bolter Drill",1000,"Talent","Adeptus Astartes, Weapon Training",0,true,false,{"$f":"AND(COUNTIF(adv!A:A,B864))","v":false},false,{"$f":"COUNTIF(elite_adv!A:A,B864)","v":1}]
["Death from Afar","Hatred (Eldar)",400,"Talent",null,0,true,false,{"$f":"AND(COUNTIF(adv!A:A,B865))","v":false},false,{"$f":"COUNTIF(elite_adv!A:A,B865)","v":1}]
["Death from Afar","Exotic Weapon Training (Any)",400,"Talent",null,0,true,true,{"$f":"AND(COUNTIF(adv!A:A,B866))","v":false},false,{"$f":"COUNTIF(elite_adv!A:A,B866)","v":0}]
["Death from Afar","Hip Shooting",400,"Talent","BS 40, Ag 40",0,true,false,{"$f":"AND(COUNTIF(adv!A:A,B867))","v":false},false,{"$f":"COUNTIF(elite_adv!A:A,B867)","v":1}]
["Knowledge is Power","Lore: Forbidden (any)",200,"Skill",null,0,true,true,{"$f":"AND(COUNTIF(adv!A:A,B868))","v":false},false,{"$f":"COUNTIF(elite_adv!A:A,B868)","v":0}]
["Knowledge is Power","Lore: Forbidden (any) +10",200,"Skill","Lore: Forbidden (any)",0,true,true,{"$f":"AND(COUNTIF(adv!A:A,B869))","v":false},false,{"$f":"COUNTIF(elite_adv!A:A,B869)","v":0}]
["Knowledge is Power","Lore: Forbidden (any) +20",200,"Skill","Lore: Forbidden (any) +10",0,true,true,{"$f":"AND(COUNTIF(adv!A:A,B870))","v":false},false,{"$f":"COUNTIF(elite_adv!A:A,B870)","v":0}]
["Knowledge is Power","Lore: Scholastic (any)",100,"Skill",null,0,true,true,{"$f":"AND(COUNTIF(adv!A:A,B871))","v":false},false,{"$f":"COUNTIF(elite_adv!A:A,B871)","v":0}]
["Knowledge is Power","Lore: Scholastic (any) +10",100,"Skill","Lore: Scholastic (any)",0,true,true,{"$f":"AND(COUNTIF(adv!A:A,B872))","v":false},false,{"$f":"COUNTIF(elite_adv!A:A,B872)","v":0}]
["Knowledge is Power","Lore: Scholastic (any) +20",100,"Skill","Lore: Scholastic (any) +10",0,true,true,{"$f":"AND(COUNTIF(adv!A:A,B873))","v":false},false,{"$f":"COUNTIF(elite_adv!A:A,B873)","v":0}]
["Knowledge is Power","Peer (Inquisition)",300,"Talent",null,0,true,false,{"$f":"AND(COUNTIF(adv!A:A,B874))","v":false},false,{"$f":"COUNTIF(elite_adv!A:A,B874)","v":1}]
["Knowledge is Power","Infused Knowledge",900,"Talent","Int 40",0,true,false,{"$f":"AND(COUNTIF(adv!A:A,B875))","v":false},false,{"$f":"COUNTIF(elite_adv!A:A,B875)","v":1}]
["Knowledge is Power","Foresight",500,"Talent","Int 30",0,true,false,{"$f":"AND(COUNTIF(adv!A:A,B876))","v":false},false,{"$f":"COUNTIF(elite_adv!A:A,B876)","v":1}]
["Knowledge is Power","Hatred (Dark Eldar)",400,"Talent",null,0,true,false,{"$f":"AND(COUNTIF(adv!A:A,B877))","v":false},false,{"$f":"COUNTIF(elite_adv!A:A,B877)","v":1}]
["Command Without Doubt","Command",100,"Skill",null,0,true,false,{"$f":"AND(COUNTIF(adv!A:A,B878))","v":false},false,{"$f":"COUNTIF(elite_adv!A:A,B878)","v":1}]
["Command Without Doubt","Command +10",100,"Skill","Command",0,true,false,{"$f":"AND(COUNTIF(adv!A:A,B879))","v":false},false,{"$f":"COUNTIF(elite_adv!A:A,B879)","v":1}]
["Command Without Doubt","Command +20",100,"Skill","Command +10",0,true,false,{"$f":"AND(COUNTIF(adv!A:A,B880))","v":false},false,{"$f":"COUNTIF(elite_adv!A:A,B880)","v":1}]
["Command Without Doubt","Charm",100,"Skill",null,0,true,false,{"$f":"AND(COUNTIF(adv!A:A,B881))","v":false},false,{"$f":"COUNTIF(elite_adv!A:A,B881)","v":1}]
["Command Without Doubt","Charm +10",100,"Skill","Charm",0,true,false,{"$f":"AND(COUNTIF(adv!A:A,B882))","v":false},false,{"$f":"COUNTIF(elite_adv!A:A,B882)","v":1}]
["Command Without Doubt","Charm +20",100,"Skill","Charm +10",0,true,false,{"$f":"AND(COUNTIF(adv!A:A,B883))","v":false},false,{"$f":"COUNTIF(elite_adv!A:A,B883)","v":1}]
["Command Without Doubt","Talented (Command)",400,"Talent",null,0,true,false,{"$f":"AND(COUNTIF(adv!A:A,B884))","v":false},false,{"$f":"COUNTIF(elite_adv!A:A,B884)","v":1}]
["Command Without Doubt","Unbowed and Unbroken",700,"Talent","Fel 40",0,true,false,{"$f":"AND(COUNTIF(adv!A:A,B885))","v":false},false,{"$f":"COUNTIF(elite_adv!A:A,B885)","v":1}]
["Command Without Doubt","Iron Discipline",500,"Talent","WP 30, Command",0,true,false,{"$f":"AND(COUNTIF(adv!A:A,B886))","v":false},false,{"$f":"COUNTIF(elite_adv!A:A,B886)","v":1}]
["Command Without Doubt","Into the Jaws of Hell",500,"Talent ","Iron Discipline",0,true,false,{"$f":"AND(COUNTIF(adv!A:A,B887))","v":false},false,{"$f":"COUNTIF(elite_adv!A:A,B887)","v":1}]
["Behold Our Wrath","Interrogation",100,"Skill",null,0,true,false,{"$f":"AND(COUNTIF(adv!A:A,B888))","v":false},false,{"$f":"COUNTIF(elite_adv!A:A,B888)","v":1}]
["Behold Our Wrath","Interrogation +10",100,"Skill","Interrogation",0,true,false,{"$f":"AND(COUNTIF(adv!A:A,B889))","v":false},false,{"$f":"COUNTIF(elite_adv!A:A,B889)","v":1}]
["Behold Our Wrath","Interrogation +20",100,"Skill","Interrogation +10",0,true,false,{"$f":"AND(COUNTIF(adv!A:A,B890))","v":false},false,{"$f":"COUNTIF(elite_adv!A:A,B890)","v":1}]
["Behold Our Wrath","Intimidation 100","Skill",null,null,0,true,false,{"$f":"AND(COUNTIF(adv!A:A,B891))","v":false},false,{"$f":"COUNTIF(elite_adv!A:A,B891)","v":0}]
["Behold Our Wrath","Intimidation +10",100,"Skill","Intimidation",0,true,false,{"$f":"AND(COUNTIF(adv!A:A,B892))","v":false},false,{"$f":"COUNTIF(elite_adv!A:A,B892)","v":0}]
["Behold Our Wrath","Intimidation +20",100,"Skill","Intimidation +10",0,true,false,{"$f":"AND(COUNTIF(adv!A:A,B893))","v":false},false,{"$f":"COUNTIF(elite_adv!A:A,B893)","v":0}]
["Behold Our Wrath","Iron Jaw",300,"Talent","T 40",0,true,false,{"$f":"AND(COUNTIF(adv!A:A,B894))","v":false},false,{"$f":"COUNTIF(elite_adv!A:A,B894)","v":1}]
["Behold Our Wrath","Duty Unto Death",700,"Talent","WP 45",0,true,false,{"$f":"AND(COUNTIF(adv!A:A,B895))","v":false},false,{"$f":"COUNTIF(elite_adv!A:A,B895)","v":1}]
["Behold Our Wrath","Crushing Blow",500,"Talent","S 40",0,true,false,{"$f":"AND(COUNTIF(adv!A:A,B896))","v":false},false,{"$f":"COUNTIF(elite_adv!A:A,B896)","v":1}]
["Behold Our Wrath","Double Team",100,"Talent",null,0,true,false,{"$f":"AND(COUNTIF(adv!A:A,B897))","v":false},false,{"$f":"COUNTIF(elite_adv!A:A,B897)","v":1}]
["Secret Lore","Lore: Forbidden (Warp)",200,"Skill",null,0,true,false,{"$f":"AND(COUNTIF(adv!A:A,B898))","v":false},false,{"$f":"COUNTIF(elite_adv!A:A,B898)","v":0}]
["Secret Lore","Lore: Forbidden (Warp) +10",200,"Skill","Lore: Forbidden (Warp)",0,true,false,{"$f":"AND(COUNTIF(adv!A:A,B899))","v":false},false,{"$f":"COUNTIF(elite_adv!A:A,B899)","v":0}]
["Secret Lore","Lore: Forbidden (Warp) +20",200,"Skill","Lore: Forbidden (Warp) +10",0,true,false,{"$f":"AND(COUNTIF(adv!A:A,B900))","v":false},false,{"$f":"COUNTIF(elite_adv!A:A,B900)","v":0}]
["Secret Lore","Awareness",100,"Skill",null,0,true,false,{"$f":"AND(COUNTIF(adv!A:A,B901))","v":false},false,{"$f":"COUNTIF(elite_adv!A:A,B901)","v":1}]
["Secret Lore","Awareness +10",100,"Skill","Awareness",0,true,false,{"$f":"AND(COUNTIF(adv!A:A,B902))","v":false},false,{"$f":"COUNTIF(elite_adv!A:A,B902)","v":1}]
["Secret Lore","Awareness +20",100,"Skill","Awareness +10",0,true,false,{"$f":"AND(COUNTIF(adv!A:A,B903))","v":false},false,{"$f":"COUNTIF(elite_adv!A:A,B903)","v":1}]
["Secret Lore","Talented (Lore: Forbidden (Warp))",300,"Talent",null,0,true,false,{"$f":"AND(COUNTIF(adv!A:A,B904))","v":false},false,{"$f":"COUNTIF(elite_adv!A:A,B904)","v":0}]
["Secret Lore","Hatred (Psykers)",300,"Talent",null,0,true,false,{"$f":"AND(COUNTIF(adv!A:A,B905))","v":false},false,{"$f":"COUNTIF(elite_adv!A:A,B905)","v":1}]
["Secret Lore","Scourge of Heretics",1000,"Talent",null,0,true,false,{"$f":"AND(COUNTIF(adv!A:A,B906))","v":false},false,{"$f":"COUNTIF(elite_adv!A:A,B906)","v":1}]
["Secret Lore","Strong Minded",1400,"Talent","WP 30, Resistance (Psychic Powers)",0,true,false,{"$f":"AND(COUNTIF(adv!A:A,B907))","v":false},false,{"$f":"COUNTIF(elite_adv!A:A,B907)","v":1}]
["No Respite for the Enemy","Dodge",100,"Skill",null,0,true,false,{"$f":"AND(COUNTIF(adv!A:A,B908))","v":false},false,{"$f":"COUNTIF(elite_adv!A:A,B908)","v":1}]
["No Respite for the Enemy","Dodge +10",200,"Skill","Dodge",0,true,false,{"$f":"AND(COUNTIF(adv!A:A,B909))","v":false},false,{"$f":"COUNTIF(elite_adv!A:A,B909)","v":1}]
["No Respite for the Enemy","Dodge +20",200,"Skill","Dodge +10",0,true,false,{"$f":"AND(COUNTIF(adv!A:A,B910))","v":false},false,{"$f":"COUNTIF(elite_adv!A:A,B910)","v":1}]
["No Respite for the Enemy","Tactics (any)","100 Skill",null,null,0,true,true,{"$f":"AND(COUNTIF(adv!A:A,B911))","v":false},false,{"$f":"COUNTIF(elite_adv!A:A,B911)","v":0}]
["No Respite for the Enemy","Tactics (any) +10",100,"Skill","Tactics (any)",0,true,true,{"$f":"AND(COUNTIF(adv!A:A,B912))","v":false},false,{"$f":"COUNTIF(elite_adv!A:A,B912)","v":0}]
["No Respite for the Enemy","Tactics (any) +20",100,"Skill","Tactics (any) +10",0,true,true,{"$f":"AND(COUNTIF(adv!A:A,B913))","v":false},false,{"$f":"COUNTIF(elite_adv!A:A,B913)","v":0}]
["No Respite for the Enemy","Gunslinger",600,"Talent","BS 40, Two Weapon Wielder (Ballistic)",0,true,false,{"$f":"AND(COUNTIF(adv!A:A,B914))","v":false},false,{"$f":"COUNTIF(elite_adv!A:A,B914)","v":1}]
["No Respite for the Enemy","Two Weapon Wielder (Ballistic)",400,"Talent","BS 35, Ag 35",0,true,false,{"$f":"AND(COUNTIF(adv!A:A,B915))","v":false},false,{"$f":"COUNTIF(elite_adv!A:A,B915)","v":0}]
["No Respite for the Enemy","Two Weapon Wielder (Melee)",400,"Talent","WS 35, Ag 35",0,true,false,{"$f":"AND(COUNTIF(adv!A:A,B916))","v":false},false,{"$f":"COUNTIF(elite_adv!A:A,B916)","v":0}]
["No Respite for the Enemy","Mighty Shot",400,"Talent","BS 40",0,true,false,{"$f":"AND(COUNTIF(adv!A:A,B917))","v":false},false,{"$f":"COUNTIF(elite_adv!A:A,B917)","v":1}]
["Honour Thy Wargear","Tactics (any)",100,"Skill",null,0,true,true,{"$f":"AND(COUNTIF(adv!A:A,B918))","v":false},false,{"$f":"COUNTIF(elite_adv!A:A,B918)","v":0}]
["Honour Thy Wargear","Tactics (any) +10",100,"Skill","Tactics (any)",0,true,true,{"$f":"AND(COUNTIF(adv!A:A,B919))","v":false},false,{"$f":"COUNTIF(elite_adv!A:A,B919)","v":0}]
["Honour Thy Wargear","Tactics (any) +20",100,"Skill","Tactics (any) +10",0,true,true,{"$f":"AND(COUNTIF(adv!A:A,B920))","v":false},false,{"$f":"COUNTIF(elite_adv!A:A,B920)","v":0}]
["Honour Thy Wargear","Concealment",100,"Skill",null,0,true,false,{"$f":"AND(COUNTIF(adv!A:A,B921))","v":false},false,{"$f":"COUNTIF(elite_adv!A:A,B921)","v":1}]
["Honour Thy Wargear","Concealment +10",100,"Skill","Concealment",0,true,false,{"$f":"AND(COUNTIF(adv!A:A,B922))","v":false},false,{"$f":"COUNTIF(elite_adv!A:A,B922)","v":1}]
["Honour Thy Wargear","Concealment +20",100,"Skill","Concealment +10",0,true,false,{"$f":"AND(COUNTIF(adv!A:A,B923))","v":false},false,{"$f":"COUNTIF(elite_adv!A:A,B923)","v":1}]
["Honour Thy Wargear","Exotic Weapon Training (Any)",400,"Talent",null,0,true,true,{"$f":"AND(COUNTIF(adv!A:A,B924))","v":false},false,{"$f":"COUNTIF(elite_adv!A:A,B924)","v":0}]
["Honour Thy Wargear","Exotic Weapon Training (Any)",400,"Talent",null,0,true,true,{"$f":"AND(COUNTIF(adv!A:A,B925))","v":false},false,{"$f":"COUNTIF(elite_adv!A:A,B925)","v":0}]
["Honour Thy Wargear","Rapid Reload",400,"Talent",null,0,true,false,{"$f":"AND(COUNTIF(adv!A:A,B926))","v":false},false,{"$f":"COUNTIF(elite_adv!A:A,B926)","v":1}]
["Honour Thy Wargear","Independent Targeting",700,"Talent","BS 40",0,true,false,{"$f":"AND(COUNTIF(adv!A:A,B927))","v":false},false,{"$f":"COUNTIF(elite_adv!A:A,B927)","v":1}]
["Daemon Bane","Lore: Forbidden (Daemon)",200,"Skill",null,0,true,false,{"$f":"AND(COUNTIF(adv!A:A,B928))","v":false},false,{"$f":"COUNTIF(elite_adv!A:A,B928)","v":0}]
["Daemon Bane","Lore: Forbidden (Daemon) +10",200,"Skill","Lore: Forbidden (Daemon)",0,true,false,{"$f":"AND(COUNTIF(adv!A:A,B929))","v":false},false,{"$f":"COUNTIF(elite_adv!A:A,B929)","v":0}]
["Daemon Bane","Lore: Forbidden (Daemon) +20",200,"Skill","Lore: Forbidden (Daemon) +10",0,true,false,{"$f":"AND(COUNTIF(adv!A:A,B930))","v":false},false,{"$f":"COUNTIF(elite_adv!A:A,B930)","v":0}]
["Daemon Bane","Ciphers (Inquisition)",200,"Skill",null,0,true,false,{"$f":"AND(COUNTIF(adv!A:A,B931))","v":false},false,{"$f":"COUNTIF(elite_adv!A:A,B931)","v":1}]
["Daemon Bane","Ciphers (Inquisition) +10",200,"Skill","Ciphers (Inquisition)",0,true,false,{"$f":"AND(COUNTIF(adv!A:A,B932))","v":false},false,{"$f":"COUNTIF(elite_adv!A:A,B932)","v":1}]
["Daemon Bane","Ciphers (Inquisition) +20",200,"Skill","Ciphers (Inquisition) +10",0,true,false,{"$f":"AND(COUNTIF(adv!A:A,B933))","v":false},false,{"$f":"COUNTIF(elite_adv!A:A,B933)","v":1}]
["Daemon Bane","Slayer of Daemons",900,"Talent",null,0,true,false,{"$f":"AND(COUNTIF(adv!A:A,B934))","v":false},false,{"$f":"COUNTIF(elite_adv!A:A,B934)","v":1}]
["Daemon Bane","Strong Minded",1000,"Talent","WP 30, Resistance (Psychic Powers)",0,true,false,{"$f":"AND(COUNTIF(adv!A:A,B935))","v":false},false,{"$f":"COUNTIF(elite_adv!A:A,B935)","v":1}]
["Daemon Bane","Hammer Blow",400,"Talent",null,0,true,false,{"$f":"AND(COUNTIF(adv!A:A,B936))","v":false},false,{"$f":"COUNTIF(elite_adv!A:A,B936)","v":1}]
["Daemon Bane","Abhor the Witch",700,"Talent","Adeptus Astartes",0,true,false,{"$f":"AND(COUNTIF(adv!A:A,B937))","v":false},false,{"$f":"COUNTIF(elite_adv!A:A,B937)","v":1}]
["Xenos Bane","Lore: Forbidden (Xenos)",100,"Skill",null,0,true,false,{"$f":"AND(COUNTIF(adv!A:A,B938))","v":false},false,{"$f":"COUNTIF(elite_adv!A:A,B938)","v":1}]
["Xenos Bane","Lore: Forbidden (Xenos) +10",100,"Skill","Lore: Forbidden (Xenos)",0,true,false,{"$f":"AND(COUNTIF(adv!A:A,B939))","v":false},false,{"$f":"COUNTIF(elite_adv!A:A,B939)","v":1}]
["Xenos Bane","Lore: Forbidden (Xenos) +20",100,"Skill","Lore: Forbidden (Xenos) +10",0,true,false,{"$f":"AND(COUNTIF(adv!A:A,B940))","v":false},false,{"$f":"COUNTIF(elite_adv!A:A,B940)","v":1}]
["Xenos Bane","Lore: Forbidden (any)",100,"Skill",null,0,true,true,{"$f":"AND(COUNTIF(adv!A:A,B941))","v":false},false,{"$f":"COUNTIF(elite_adv!A:A,B941)","v":0}]
["Xenos Bane","Lore: Forbidden (any) +10",100,"Skill","Lore: Forbidden (any)",0,true,true,{"$f":"AND(COUNTIF(adv!A:A,B942))","v":false},false,{"$f":"COUNTIF(elite_adv!A:A,B942)","v":0}]
["Xenos Bane","Lore: Forbidden (any) +20",100,"Skill","Lore: Forbidden (any) +10",0,true,true,{"$f":"AND(COUNTIF(adv!A:A,B943))","v":false},false,{"$f":"COUNTIF(elite_adv!A:A,B943)","v":0}]
["Xenos Bane","Hatred (Xenos: Choose one)",300,"Talent",null,0,true,false,{"$f":"AND(COUNTIF(adv!A:A,B944))","v":false},false,{"$f":"COUNTIF(elite_adv!A:A,B944)","v":0}]
["Xenos Bane","Hunter of Aliens",900,"Talent",null,0,true,false,{"$f":"AND(COUNTIF(adv!A:A,B945))","v":false},false,{"$f":"COUNTIF(elite_adv!A:A,B945)","v":1}]
["Xenos Bane","Peer (Inquisition)",400,"Talent",null,0,true,false,{"$f":"AND(COUNTIF(adv!A:A,B946))","v":false},false,{"$f":"COUNTIF(elite_adv!A:A,B946)","v":1}]
["Xenos Bane","Jaded",400,"Talent","WP 30",0,true,false,{"$f":"AND(COUNTIF(adv!A:A,B947))","v":false},false,{"$f":"COUNTIF(elite_adv!A:A,B947)","v":1}]
["Iron Hands","Forbidden Lore (Adeptus Mechanicus)",300,"Skill","Forbidden Lore (Adeptus Mechanicus)",0,true,false,{"$f":"AND(COUNTIF(adv!A:A,B948))","v":false},false,{"$f":"COUNTIF(elite_adv!A:A,B948)","v":0}]
["Iron Hands","Forbidden Lore (Adeptus Mechanicus) +10",400,"Skill","Forbidden Lore (Adeptus Mechanicus) +10",0,true,false,{"$f":"AND(COUNTIF(adv!A:A,B949))","v":false},false,{"$f":"COUNTIF(elite_adv!A:A,B949)","v":0}]
["Iron Hands","Forbidden Lore (Adeptus Mechanicus) +20",500,"Skill",null,0,true,false,{"$f":"AND(COUNTIF(adv!A:A,B950))","v":false},false,{"$f":"COUNTIF(elite_adv!A:A,B950)","v":0}]
["Iron Hands","Tech-Use",300,"Skill",null,0,true,false,{"$f":"AND(COUNTIF(adv!A:A,B951))","v":false},false,{"$f":"COUNTIF(elite_adv!A:A,B951)","v":1}]
["Iron Hands","Tech-Use +10",400,"Skill","Tech-Use",0,true,false,{"$f":"AND(COUNTIF(adv!A:A,B952))","v":false},false,{"$f":"COUNTIF(elite_adv!A:A,B952)","v":1}]
["Iron Hands","Tech-Use +20",500,"Skill","Tech-Use +10",0,true,false,{"$f":"AND(COUNTIF(adv!A:A,B953))","v":false},false,{"$f":"COUNTIF(elite_adv!A:A,B953)","v":1}]
["Iron Hands","Hatred (any)",200,"Talent",null,0,true,true,{"$f":"AND(COUNTIF(adv!A:A,B954))","v":false},false,{"$f":"COUNTIF(elite_adv!A:A,B954)","v":0}]
["Iron Hands","Peer (Adeptus Mechanicus)",500,"Talent","Fel 30 or Int 30",0,true,false,{"$f":"AND(COUNTIF(adv!A:A,B955))","v":false},false,{"$f":"COUNTIF(elite_adv!A:A,B955)","v":1}]
["Iron Hands","Good Reputation (Adeptus Mechanicus)",500,"Talent","Fel 50 or Int 50, Peer (Adeptus Mechanicus)",0,true,false,{"$f":"AND(COUNTIF(adv!A:A,B956))","v":false},false,{"$f":"COUNTIF(elite_adv!A:A,B956)","v":1}]
["Iron Hands","The Flesh is Weak 1",500,"Talent","Mechanicus Implants",0,true,false,{"$f":"AND(COUNTIF(adv!A:A,B957))","v":false},false,{"$f":"COUNTIF(elite_adv!A:A,B957)","v":1}]
["Iron Hands","The Flesh is Weak 2",500,"Talent","Mechanicus Implants, The Flesh is Weak 1",0,true,false,{"$f":"AND(COUNTIF(adv!A:A,B958))","v":false},false,{"$f":"COUNTIF(elite_adv!A:A,B958)","v":1}]
["Iron Hands","The Flesh is Weak 3",500,"Talent","Mechanicus Implants, The Flesh is Weak 2",0,true,false,{"$f":"AND(COUNTIF(adv!A:A,B959))","v":false},false,{"$f":"COUNTIF(elite_adv!A:A,B959)","v":1}]
["Raven Guard","Concealment",200,"Skill",null,0,true,false,{"$f":"AND(COUNTIF(adv!A:A,B960))","v":false},false,{"$f":"COUNTIF(elite_adv!A:A,B960)","v":1}]
["Raven Guard","Concealment +10",300,"Skill","Concealment",0,true,false,{"$f":"AND(COUNTIF(adv!A:A,B961))","v":false},false,{"$f":"COUNTIF(elite_adv!A:A,B961)","v":1}]
["Raven Guard","Concealment +20",300,"Skill","Concealment +10",0,true,false,{"$f":"AND(COUNTIF(adv!A:A,B962))","v":false},false,{"$f":"COUNTIF(elite_adv!A:A,B962)","v":1}]
["Raven Guard","Silent Move",200,"Skill",null,0,true,false,{"$f":"AND(COUNTIF(adv!A:A,B963))","v":false},false,{"$f":"COUNTIF(elite_adv!A:A,B963)","v":1}]
["Raven Guard","Silent Move +10",300,"Skill","Silent Move",0,true,false,{"$f":"AND(COUNTIF(adv!A:A,B964))","v":false},false,{"$f":"COUNTIF(elite_adv!A:A,B964)","v":1}]
["Raven Guard","Silent Move +20",300,"Skill","Silent Move +10",0,true,false,{"$f":"AND(COUNTIF(adv!A:A,B965))","v":false},false,{"$f":"COUNTIF(elite_adv!A:A,B965)","v":1}]
["Raven Guard","Tactics (Recon and Stealth)",200,"Skill",null,0,true,false,{"$f":"AND(COUNTIF(adv!A:A,B966))","v":false},false,{"$f":"COUNTIF(elite_adv!A:A,B966)","v":1}]
["Raven Guard","Tactics (Recon and Stealth) +10",300,"Skill","Tactics (Recon and Stealth)",0,true,false,{"$f":"AND(COUNTIF(adv!A:A,B967))","v":false},false,{"$f":"COUNTIF(elite_adv!A:A,B967)","v":1}]
["Raven Guard","Tactics (Recon and Stealth) +20",300,"Skill","Tactics (Recon and Stealth) +10",0,true,false,{"$f":"AND(COUNTIF(adv!A:A,B968))","v":false},false,{"$f":"COUNTIF(elite_adv!A:A,B968)","v":1}]
["Raven Guard","Guerilla Training",400,"Talent",null,0,true,false,{"$f":"AND(COUNTIF(adv!A:A,B969))","v":false},false,{"$f":"COUNTIF(elite_adv!A:A,B969)","v":1}]
["Raven Guard","Hatred (The Traitor Legions)",200,"Talent",null,0,true,false,{"$f":"AND(COUNTIF(adv!A:A,B970))","v":false},false,{"$f":"COUNTIF(elite_adv!A:A,B970)","v":1}]
["Raven Guard","Hard Target",500,"Talent","Ag 40",0,true,false,{"$f":"AND(COUNTIF(adv!A:A,B971))","v":false},false,{"$f":"COUNTIF(elite_adv!A:A,B971)","v":1}]
["Raven Guard","Sure Strike",500,"Talent","WS 30",0,true,false,{"$f":"AND(COUNTIF(adv!A:A,B972))","v":false},false,{"$f":"COUNTIF(elite_adv!A:A,B972)","v":1}]
["Salamanders","Lore: Common (Tech)",200,"Skill",null,0,true,false,{"$f":"AND(COUNTIF(adv!A:A,B973))","v":false},false,{"$f":"COUNTIF(elite_adv!A:A,B973)","v":1}]
["Salamanders","Lore: Common (Tech) +10",200,"Skill","Lore: Common (Tech)",0,true,false,{"$f":"AND(COUNTIF(adv!A:A,B974))","v":false},false,{"$f":"COUNTIF(elite_adv!A:A,B974)","v":1}]
["Salamanders","Lore: Common (Tech) +20",200,"Skill","Lore: Common (Tech) +10",0,true,false,{"$f":"AND(COUNTIF(adv!A:A,B975))","v":false},false,{"$f":"COUNTIF(elite_adv!A:A,B975)","v":1}]
["Salamanders","Tech-Use",600,"Skill",null,0,true,false,{"$f":"AND(COUNTIF(adv!A:A,B976))","v":false},false,{"$f":"COUNTIF(elite_adv!A:A,B976)","v":1}]
["Salamanders","Tech-Use +10",800,"Skill","Tech-Use",0,true,false,{"$f":"AND(COUNTIF(adv!A:A,B977))","v":false},false,{"$f":"COUNTIF(elite_adv!A:A,B977)","v":1}]
["Salamanders","Tech-Use +20",800,"Skill","Tech-Use +10",0,true,false,{"$f":"AND(COUNTIF(adv!A:A,B978))","v":false},false,{"$f":"COUNTIF(elite_adv!A:A,B978)","v":1}]
["Salamanders","Cleanse and Purify",400,"Talent",null,0,true,false,{"$f":"AND(COUNTIF(adv!A:A,B979))","v":false},false,{"$f":"COUNTIF(elite_adv!A:A,B979)","v":1}]
["Salamanders","Duty Unto Death",800,"Talent","WP 45",0,true,false,{"$f":"AND(COUNTIF(adv!A:A,B980))","v":false},false,{"$f":"COUNTIF(elite_adv!A:A,B980)","v":1}]
["Salamanders","Good Reputation (any)",800,"Talent","Fel 50, Peer (same group)",0,true,true,{"$f":"AND(COUNTIF(adv!A:A,B981))","v":false},false,{"$f":"COUNTIF(elite_adv!A:A,B981)","v":0}]
["Salamanders","Hammer Blow",500,"Talent",null,0,true,false,{"$f":"AND(COUNTIF(adv!A:A,B982))","v":false},false,{"$f":"COUNTIF(elite_adv!A:A,B982)","v":1}]
["Salamanders","Hatred (Dark Eldar)",500,"Talent",null,0,true,false,{"$f":"AND(COUNTIF(adv!A:A,B983))","v":false},false,{"$f":"COUNTIF(elite_adv!A:A,B983)","v":1}]
["Salamanders","Artificer (Sal1)",800,"Talent","Trade (Armourer) +10",0,true,false,{"$f":"AND(COUNTIF(adv!A:A,B984))","v":false},false,{"$f":"COUNTIF(elite_adv!A:A,B984)","v":0}]
["Salamanders","Artificer (Sal2)",800,"Talent","Trade (Armourer) +10",0,true,false,{"$f":"AND(COUNTIF(adv!A:A,B985))","v":false},false,{"$f":"COUNTIF(elite_adv!A:A,B985)","v":0}]
["Salamanders","Artificer (Sal3)",800,"Talent","Trade (Armourer) +10",0,true,false,{"$f":"AND(COUNTIF(adv!A:A,B986))","v":false},false,{"$f":"COUNTIF(elite_adv!A:A,B986)","v":0}]
["Salamanders","Peer (any)",500,"Talent","Fel 30",0,true,true,{"$f":"AND(COUNTIF(adv!A:A,B987))","v":false},false,{"$f":"COUNTIF(elite_adv!A:A,B987)","v":0}]
["Salamanders","Signature Wargear",500,"Talent",null,0,true,false,{"$f":"AND(COUNTIF(adv!A:A,B988))","v":false},false,{"$f":"COUNTIF(elite_adv!A:A,B988)","v":1}]
["Salamanders","Talented (Intimidate)",500,"Talent",null,0,true,false,{"$f":"AND(COUNTIF(adv!A:A,B989))","v":false},false,{"$f":"COUNTIF(elite_adv!A:A,B989)","v":1}]
["Salamanders","Talented (Trade (Armourer))",500,"Talent",null,0,true,false,{"$f":"AND(COUNTIF(adv!A:A,B990))","v":false},false,{"$f":"COUNTIF(elite_adv!A:A,B990)","v":1}]
["White Scars","Navigation (Surface)",300,"Skill",null,0,true,false,{"$f":"AND(COUNTIF(adv!A:A,B991))","v":false},false,{"$f":"COUNTIF(elite_adv!A:A,B991)","v":1}]
["White Scars","Navigation (Surface) +10",500,"Skill","Navigation (Surface)",0,true,false,{"$f":"AND(COUNTIF(adv!A:A,B992))","v":false},false,{"$f":"COUNTIF(elite_adv!A:A,B992)","v":1}]
["White Scars","Navigation (Surface) +20",500,"Skill","Navigation (Surface) +10",0,true,false,{"$f":"AND(COUNTIF(adv!A:A,B993))","v":false},false,{"$f":"COUNTIF(elite_adv!A:A,B993)","v":1}]
["White Scars","Survival",200,"Skill",null,0,true,false,{"$f":"AND(COUNTIF(adv!A:A,B994))","v":false},false,{"$f":"COUNTIF(elite_adv!A:A,B994)","v":1}]
["White Scars","Survival +10",300,"Skill","Survival",0,true,false,{"$f":"AND(COUNTIF(adv!A:A,B995))","v":false},false,{"$f":"COUNTIF(elite_adv!A:A,B995)","v":1}]
["White Scars","Survival +20",400,"Skill","Survival +10",0,true,false,{"$f":"AND(COUNTIF(adv!A:A,B996))","v":false},false,{"$f":"COUNTIF(elite_adv!A:A,B996)","v":1}]
["White Scars","Tactics (Assault Doctrine)",300,"Skill",null,0,true,false,{"$f":"AND(COUNTIF(adv!A:A,B997))","v":false},false,{"$f":"COUNTIF(elite_adv!A:A,B997)","v":1}]
["White Scars","Tactics (Assault Doctrine) +10",400,"Skill","Tactics (Assault Doctrine)",0,true,false,{"$f":"AND(COUNTIF(adv!A:A,B998))","v":false},false,{"$f":"COUNTIF(elite_adv!A:A,B998)","v":1}]
["White Scars","Tactics (Assault Doctrine) +20",400,"Skill","Tactics (Assault Doctrine) +10",0,true,false,{"$f":"AND(COUNTIF(adv!A:A,B999))","v":false},false,{"$f":"COUNTIF(elite_adv!A:A,B999)","v":1}]
["White Scars","Berserk Charge",600,"Talent",null,0,true,false,{"$f":"AND(COUNTIF(adv!A:A,B1000))","v":false},false,{"$f":"COUNTIF(elite_adv!A:A,B1000)","v":1}]
["White Scars","Born in the Saddle",1000,"Talent",null,0,true,false,{"$f":"AND(COUNTIF(adv!A:A,B1001))","v":false},false,{"$f":"COUNTIF(elite_adv!A:A,B1001)","v":1}]
["White Scars","Foresight",500,"Talent","Trade (Armourer) +10",0,true,false,{"$f":"AND(COUNTIF(adv!A:A,B1002))","v":false},false,{"$f":"COUNTIF(elite_adv!A:A,B1002)","v":1}]
["White Scars","Hatred (Dark Eldar)",500,"Talent","Fel 30",0,true,false,{"$f":"AND(COUNTIF(adv!A:A,B1003))","v":false},false,{"$f":"COUNTIF(elite_adv!A:A,B1003)","v":1}]
["White Scars","Hip Shooting",500,"Talent",null,0,true,false,{"$f":"AND(COUNTIF(adv!A:A,B1004))","v":false},false,{"$f":"COUNTIF(elite_adv!A:A,B1004)","v":1}]
["White Scars","Sprint",600,"Talent",null,0,true,false,{"$f":"AND(COUNTIF(adv!A:A,B1005))","v":false},false,{"$f":"COUNTIF(elite_adv!A:A,B1005)","v":1}]
["White Scars","Talented (Drive (Ground Vehicles))",500,"Talent",null,0,true,false,{"$f":"AND(COUNTIF(adv!A:A,B1006))","v":false},false,{"$f":"COUNTIF(elite_adv!A:A,B1006)","v":1}]
["White Scars","Wisdom of the Ancients",1500,"Talent",null,0,true,false,{"$f":"AND(COUNTIF(adv!A:A,B1007))","v":false},false,{"$f":"COUNTIF(elite_adv!A:A,B1007)","v":1}]

{"sheet":"groups_lst","index":12,"n_rows":599,"n_cols":8,"rows_kept":599,"hidden":true}
["Group","Skill","Cost","Type","Prerequisites","PreReq","Chosen","Print"]
["Ciphers (any)","Ciphers (Chapter Runes)",0,"Skill",null,true,{"$f":"AND(COUNTIF(adv!A:A,B2))","v":false},"Chapter Runes"]
["Ciphers (any) +10","Ciphers (Chapter Runes) +10",0,"Skill","Ciphers (Chapter Runes)",{"$f":"AND(COUNTIF(adv!A:A,E3))","v":false},{"$f":"AND(COUNTIF(adv!A:A,B3))","v":false},"Chapter Runes"]
["Ciphers (any) +20","Ciphers (Chapter Runes) +20",0,"Skill","Ciphers (Chapter Runes) +10",{"$f":"AND(COUNTIF(adv!A:A,E4))","v":false},{"$f":"AND(COUNTIF(adv!A:A,B4))","v":false},"Chapter Runes"]
["Ciphers (any)","Ciphers (Deathwatch)",0,"Skill",null,true,{"$f":"AND(COUNTIF(adv!A:A,B5))","v":false},"Deathwatch"]
["Ciphers (any) +10","Ciphers (Deathwatch) +10",0,"Skill","Ciphers (Deathwatch)",{"$f":"AND(COUNTIF(adv!A:A,E6))","v":false},{"$f":"AND(COUNTIF(adv!A:A,B6))","v":false},"Deathwatch"]
["Ciphers (any) +20","Ciphers (Deathwatch) +20",0,"Skill","Ciphers (Deathwatch) +10",{"$f":"AND(COUNTIF(adv!A:A,E7))","v":false},{"$f":"AND(COUNTIF(adv!A:A,B7))","v":false},"Deathwatch"]
["Ciphers (any)","Ciphers (Imperial Codes)",0,"Skill",null,true,{"$f":"AND(COUNTIF(adv!A:A,B8))","v":false},"Imperial Codes"]
["Ciphers (any) +10","Ciphers (Imperial Codes) +10",0,"Skill","Ciphers (Imperial Codes)",{"$f":"AND(COUNTIF(adv!A:A,E9))","v":false},{"$f":"AND(COUNTIF(adv!A:A,B9))","v":false},"Imperial Codes"]
["Ciphers (any) +20","Ciphers (Imperial Codes) +20",0,"Skill","Ciphers (Imperial Codes) +10",{"$f":"AND(COUNTIF(adv!A:A,E10))","v":false},{"$f":"AND(COUNTIF(adv!A:A,B10))","v":false},"Imperial Codes"]
["Ciphers (any)","Ciphers (Inquisition)",0,"Skill",null,true,{"$f":"AND(COUNTIF(adv!A:A,B11))","v":false},"Inquisition"]
["Ciphers (any) +10","Ciphers (Inquisition) +10",0,"Skill","Ciphers (Inquisition)",{"$f":"AND(COUNTIF(adv!A:A,E12))","v":false},{"$f":"AND(COUNTIF(adv!A:A,B12))","v":false},"Inquisition"]
["Ciphers (any) +20","Ciphers (Inquisition) +20",0,"Skill","Ciphers (Inquisition) +10",{"$f":"AND(COUNTIF(adv!A:A,E13))","v":false},{"$f":"AND(COUNTIF(adv!A:A,B13))","v":false},"Inquisition"]
["Ciphers (any)","Ciphers (Mercenary Cant)",0,"Skill",null,true,{"$f":"AND(COUNTIF(adv!A:A,B14))","v":false},"Mercenary Cant"]
["Ciphers (any) +10","Ciphers (Mercenary Cant) +10",0,"Skill","Ciphers (Mercenary Cant)",{"$f":"AND(COUNTIF(adv!A:A,E15))","v":false},{"$f":"AND(COUNTIF(adv!A:A,B15))","v":false},"Mercenary Cant"]
["Ciphers (any) +20","Ciphers (Mercenary Cant) +20",0,"Skill","Ciphers (Mercenary Cant) +10",{"$f":"AND(COUNTIF(adv!A:A,E16))","v":false},{"$f":"AND(COUNTIF(adv!A:A,B16))","v":false},"Mercenary Cant"]
["Ciphers (any)","Ciphers (Underworld)",0,"Skill",null,true,{"$f":"AND(COUNTIF(adv!A:A,B17))","v":false},"Underworld"]
["Ciphers (any) +10","Ciphers (Underworld) +10",0,"Skill","Ciphers (Underworld)",{"$f":"AND(COUNTIF(adv!A:A,E18))","v":false},{"$f":"AND(COUNTIF(adv!A:A,B18))","v":false},"Underworld"]
["Ciphers (any) +20","Ciphers (Underworld) +20",0,"Skill","Ciphers (Underworld) +10",{"$f":"AND(COUNTIF(adv!A:A,E19))","v":false},{"$f":"AND(COUNTIF(adv!A:A,B19))","v":false},"Underworld"]
["Ciphers (any)","Ciphers (Xenos Markings)",0,"Skill",null,true,{"$f":"AND(COUNTIF(adv!A:A,B20))","v":false},"Xenos Markings"]
["Ciphers (any) +10","Ciphers (Xenos Markings) +10",0,"Skill","Ciphers (Xenos Markings)",{"$f":"AND(COUNTIF(adv!A:A,E21))","v":false},{"$f":"AND(COUNTIF(adv!A:A,B21))","v":false},"Xenos Markings"]
["Ciphers (any) +20","Ciphers (Xenos Markings) +20",0,"Skill","Ciphers (Xenos Markings) +10",{"$f":"AND(COUNTIF(adv!A:A,E22))","v":false},{"$f":"AND(COUNTIF(adv!A:A,B22))","v":false},"Xenos Markings"]
["Drive (any)","Drive (Ground Vehicles)",0,"Skill",null,true,{"$f":"AND(COUNTIF(adv!A:A,B23))","v":false},"Ground Vehicles"]
["Drive (any) +10","Drive (Ground Vehicles) +10",0,"Skill","Drive (Ground Vehicles)",{"$f":"AND(COUNTIF(adv!A:A,E24))","v":false},{"$f":"AND(COUNTIF(adv!A:A,B24))","v":false},"Ground Vehicles"]
["Drive (any) +20","Drive (Ground Vehicles) +20",0,"Skill","Drive (Ground Vehicles) +10",{"$f":"AND(COUNTIF(adv!A:A,E25))","v":false},{"$f":"AND(COUNTIF(adv!A:A,B25))","v":false},"Ground Vehicles"]
["Drive (any)","Drive (Skimmer/Hover)",0,"Skill",null,true,{"$f":"AND(COUNTIF(adv!A:A,B26))","v":false},"Skimmer/Hover"]
["Drive (any) +10","Drive (Skimmer/Hover) +10",0,"Skill","Drive (Skimmer/Hover)",{"$f":"AND(COUNTIF(adv!A:A,E27))","v":false},{"$f":"AND(COUNTIF(adv!A:A,B27))","v":false},"Skimmer/Hover"]
["Drive (any) +20","Drive (Skimmer/Hover) +20",0,"Skill","Drive (Skimmer/Hover) +10",{"$f":"AND(COUNTIF(adv!A:A,E28))","v":false},{"$f":"AND(COUNTIF(adv!A:A,B28))","v":false},"Skimmer/Hover"]
["Drive (any)","Drive (Walker)",0,"Skill",null,true,{"$f":"AND(COUNTIF(adv!A:A,B29))","v":false},"Walker"]
["Drive (any) +10","Drive (Walker) +10",0,"Skill","Drive (Walker)",{"$f":"AND(COUNTIF(adv!A:A,E30))","v":false},{"$f":"AND(COUNTIF(adv!A:A,B30))","v":false},"Walker"]
["Drive (any) +20","Drive (Walker) +20",0,"Skill","Drive (Walker) +10",{"$f":"AND(COUNTIF(adv!A:A,E31))","v":false},{"$f":"AND(COUNTIF(adv!A:A,B31))","v":false},"Walker"]
["Lore: Common (any)","Lore: Common (Adeptus Arbites)",0,"Skill",null,true,{"$f":"AND(COUNTIF(adv!A:A,B32))","v":false},"Adeptus Arbites"]
["Lore: Common (any) +10","Lore: Common (Adeptus Arbites) +10",0,"Skill","Lore: Common (Adeptus Arbites)",{"$f":"AND(COUNTIF(adv!A:A,E33))","v":false},{"$f":"AND(COUNTIF(adv!A:A,B33))","v":false},"Adeptus Arbites"]
["Lore: Common (any) +20","Lore: Common (Adeptus Arbites) +20",0,"Skill","Lore: Common (Adeptus Arbites) +10",{"$f":"AND(COUNTIF(adv!A:A,E34))","v":false},{"$f":"AND(COUNTIF(adv!A:A,B34))","v":false},"Adeptus Arbites"]
["Lore: Common (any)","Lore: Common (Adeptus Astartes)",0,"Skill",null,true,{"$f":"AND(COUNTIF(adv!A:A,B35))","v":false},"Adeptus Astartes"]
["Lore: Common (any) +10","Lore: Common (Adeptus Astartes) +10",0,"Skill","Lore: Common (Adeptus Astartes)",{"$f":"AND(COUNTIF(adv!A:A,E36))","v":false},{"$f":"AND(COUNTIF(adv!A:A,B36))","v":false},"Adeptus Astartes"]
["Lore: Common (any) +20","Lore: Common (Adeptus Astartes) +20",0,"Skill","Lore: Common (Adeptus Astartes) +10",{"$f":"AND(COUNTIF(adv!A:A,E37))","v":false},{"$f":"AND(COUNTIF(adv!A:A,B37))","v":false},"Adeptus Astartes"]
["Lore: Common (any)","Lore: Common (Adeptus Mechanicus)",0,"Skill",null,true,{"$f":"AND(COUNTIF(adv!A:A,B38))","v":false},"Adeptus Mechanicus"]
["Lore: Common (any) +10","Lore: Common (Adeptus Mechanicus) +10",0,"Skill","Lore: Common (Adeptus Mechanicus)",{"$f":"AND(COUNTIF(adv!A:A,E39))","v":false},{"$f":"AND(COUNTIF(adv!A:A,B39))","v":false},"Adeptus Mechanicus"]
["Lore: Common (any) +20","Lore: Common (Adeptus Mechanicus) +20",0,"Skill","Lore: Common (Adeptus Mechanicus) +10",{"$f":"AND(COUNTIF(adv!A:A,E40))","v":false},{"$f":"AND(COUNTIF(adv!A:A,B40))","v":false},"Adeptus Mechanicus"]
["Lore: Common (any)","Lore: Common (Administratum)",0,"Skill",null,true,{"$f":"AND(COUNTIF(adv!A:A,B41))","v":false},"Administratum"]
["Lore: Common (any) +10","Lore: Common (Administratum) +10",0,"Skill","Lore: Common (Administratum)",{"$f":"AND(COUNTIF(adv!A:A,E42))","v":false},{"$f":"AND(COUNTIF(adv!A:A,B42))","v":false},"Administratum"]
["Lore: Common (any) +20","Lore: Common (Administratum) +20",0,"Skill","Lore: Common (Administratum) +10",{"$f":"AND(COUNTIF(adv!A:A,E43))","v":false},{"$f":"AND(COUNTIF(adv!A:A,B43))","v":false},"Administratum"]
["Lore: Common (any)","Lore: Common (Deathwatch)",0,"Skill",null,true,{"$f":"AND(COUNTIF(adv!A:A,B44))","v":false},"Deathwatch"]
["Lore: Common (any) +10","Lore: Common (Deathwatch) +10",0,"Skill","Lore: Common (Deathwatch)",{"$f":"AND(COUNTIF(adv!A:A,E45))","v":false},{"$f":"AND(COUNTIF(adv!A:A,B45))","v":false},"Deathwatch"]
["Lore: Common (any) +20","Lore: Common (Deathwatch) +20",0,"Skill","Lore: Common (Deathwatch) +10",{"$f":"AND(COUNTIF(adv!A:A,E46))","v":false},{"$f":"AND(COUNTIF(adv!A:A,B46))","v":false},"Deathwatch"]
["Lore: Common (any)","Lore: Common (Ecclesiarchy)",0,"Skill",null,true,{"$f":"AND(COUNTIF(adv!A:A,B47))","v":false},"Ecclesiarchy"]
["Lore: Common (any) +10","Lore: Common (Ecclesiarchy) +10",0,"Skill","Lore: Common (Ecclesiarchy)",{"$f":"AND(COUNTIF(adv!A:A,E48))","v":false},{"$f":"AND(COUNTIF(adv!A:A,B48))","v":false},"Ecclesiarchy"]
["Lore: Common (any) +20","Lore: Common (Ecclesiarchy) +20",0,"Skill","Lore: Common (Ecclesiarchy) +10",{"$f":"AND(COUNTIF(adv!A:A,E49))","v":false},{"$f":"AND(COUNTIF(adv!A:A,B49))","v":false},"Ecclesiarchy"]
["Lore: Common (any)","Lore: Common (Imperial Creed)",0,"Skill",null,true,{"$f":"AND(COUNTIF(adv!A:A,B50))","v":false},"Imperial Creed"]
["Lore: Common (any) +10","Lore: Common (Imperial Creed) +10",0,"Skill","Lore: Common (Imperial Creed)",{"$f":"AND(COUNTIF(adv!A:A,E51))","v":false},{"$f":"AND(COUNTIF(adv!A:A,B51))","v":false},"Imperial Creed"]
["Lore: Common (any) +20","Lore: Common (Imperial Creed) +20",0,"Skill","Lore: Common (Imperial Creed) +10",{"$f":"AND(COUNTIF(adv!A:A,E52))","v":false},{"$f":"AND(COUNTIF(adv!A:A,B52))","v":false},"Imperial Creed"]
["Lore: Common (any)","Lore: Common (Imperial Guard)",0,"Skill",null,true,{"$f":"AND(COUNTIF(adv!A:A,B53))","v":false},"Imperial Guard"]
["Lore: Common (any) +10","Lore: Common (Imperial Guard) +10",0,"Skill","Lore: Common (Imperial Guard)",{"$f":"AND(COUNTIF(adv!A:A,E54))","v":false},{"$f":"AND(COUNTIF(adv!A:A,B54))","v":false},"Imperial Guard"]
["Lore: Common (any) +20","Lore: Common (Imperial Guard) +20",0,"Skill","Lore: Common (Imperial Guard) +10",{"$f":"AND(COUNTIF(adv!A:A,E55))","v":false},{"$f":"AND(COUNTIF(adv!A:A,B55))","v":false},"Imperial Guard"]
["Lore: Common (any)","Lore: Common (Imperial Navy)",0,"Skill",null,true,{"$f":"AND(COUNTIF(adv!A:A,B56))","v":false},"Imperial Navy"]
["Lore: Common (any) +10","Lore: Common (Imperial Navy) +10",0,"Skill","Lore: Common (Imperial Navy)",{"$f":"AND(COUNTIF(adv!A:A,E57))","v":false},{"$f":"AND(COUNTIF(adv!A:A,B57))","v":false},"Imperial Navy"]
["Lore: Common (any) +20","Lore: Common (Imperial Navy) +20",0,"Skill","Lore: Common (Imperial Navy) +10",{"$f":"AND(COUNTIF(adv!A:A,E58))","v":false},{"$f":"AND(COUNTIF(adv!A:A,B58))","v":false},"Imperial Navy"]
["Lore: Common (any)","Lore: Common (Imperium)",0,"Skill",null,true,{"$f":"AND(COUNTIF(adv!A:A,B59))","v":false},"Imperium"]
["Lore: Common (any) +10","Lore: Common (Imperium) +10",0,"Skill","Lore: Common (Imperium)",{"$f":"AND(COUNTIF(adv!A:A,E60))","v":false},{"$f":"AND(COUNTIF(adv!A:A,B60))","v":false},"Imperium"]
["Lore: Common (any) +20","Lore: Common (Imperium) +20",0,"Skill","Lore: Common (Imperium) +10",{"$f":"AND(COUNTIF(adv!A:A,E61))","v":false},{"$f":"AND(COUNTIF(adv!A:A,B61))","v":false},"Imperium"]
["Lore: Common (any)","Lore: Common (Jericho Reach)",0,"Skill",null,true,{"$f":"AND(COUNTIF(adv!A:A,B62))","v":false},"Jericho Reach"]
["Lore: Common (any) +10","Lore: Common (Jericho Reach) +10",0,"Skill","Lore: Common (Jericho Reach)",{"$f":"AND(COUNTIF(adv!A:A,E63))","v":false},{"$f":"AND(COUNTIF(adv!A:A,B63))","v":false},"Jericho Reach"]
["Lore: Common (any) +20","Lore: Common (Jericho Reach) +20",0,"Skill","Lore: Common (Jericho Reach) +10",{"$f":"AND(COUNTIF(adv!A:A,E64))","v":false},{"$f":"AND(COUNTIF(adv!A:A,B64))","v":false},"Jericho Reach"]
["Lore: Common (any)","Lore: Common (Tech)",0,"Skill",null,true,{"$f":"AND(COUNTIF(adv!A:A,B65))","v":false},"Tech"]
["Lore: Common (any) +10","Lore: Common (Tech) +10",0,"Skill","Lore: Common (Tech)",{"$f":"AND(COUNTIF(adv!A:A,E66))","v":false},{"$f":"AND(COUNTIF(adv!A:A,B66))","v":false},"Tech"]
["Lore: Common (any) +20","Lore: Common (Tech) +20",0,"Skill","Lore: Common (Tech) +10",{"$f":"AND(COUNTIF(adv!A:A,E67))","v":false},{"$f":"AND(COUNTIF(adv!A:A,B67))","v":false},"Tech"]
["Lore: Common (any)","Lore: Common (War)",0,"Skill",null,true,{"$f":"AND(COUNTIF(adv!A:A,B68))","v":false},"War"]
["Lore: Common (any) +10","Lore: Common (War) +10",0,"Skill","Lore: Common (War)",{"$f":"AND(COUNTIF(adv!A:A,E69))","v":false},{"$f":"AND(COUNTIF(adv!A:A,B69))","v":false},"War"]
["Lore: Common (any) +20","Lore: Common (War) +20",0,"Skill","Lore: Common (War) +10",{"$f":"AND(COUNTIF(adv!A:A,E70))","v":false},{"$f":"AND(COUNTIF(adv!A:A,B70))","v":false},"War"]
["Lore: Forbidden (any)","Lore: Forbidden (Adeptus Astartes)",0,"Skill",null,true,{"$f":"AND(COUNTIF(adv!A:A,B71))","v":false},"Adeptus Astartes"]
["Lore: Forbidden (any) +10","Lore: Forbidden (Adeptus Astartes) +10",0,"Skill","Lore: Forbidden (Adeptus Astartes)",{"$f":"AND(COUNTIF(adv!A:A,E72))","v":false},{"$f":"AND(COUNTIF(adv!A:A,B72))","v":false},"Adeptus Astartes"]
["Lore: Forbidden (any) +20","Lore: Forbidden (Adeptus Astartes) +20",0,"Skill","Lore: Forbidden (Adeptus Astartes) +10",{"$f":"AND(COUNTIF(adv!A:A,E73))","v":false},{"$f":"AND(COUNTIF(adv!A:A,B73))","v":false},"Adeptus Astartes"]
["Lore: Forbidden (any)","Lore: Forbidden (Adeptus Mechanicus)",0,"Skill",null,true,{"$f":"AND(COUNTIF(adv!A:A,B74))","v":false},"Adeptus Mechanicus"]
["Lore: Forbidden (any) +10","Lore: Forbidden (Adeptus Mechanicus) +10",0,"Skill","Lore: Forbidden (Adeptus Mechanicus)",{"$f":"AND(COUNTIF(adv!A:A,E75))","v":false},{"$f":"AND(COUNTIF(adv!A:A,B75))","v":false},"Adeptus Mechanicus"]
["Lore: Forbidden (any) +20","Lore: Forbidden (Adeptus Mechanicus) +20",0,"Skill","Lore: Forbidden (Adeptus Mechanicus) +10",{"$f":"AND(COUNTIF(adv!A:A,E76))","v":false},{"$f":"AND(COUNTIF(adv!A:A,B76))","v":false},"Adeptus Mechanicus"]
["Lore: Forbidden (any)","Lore: Forbidden (Archeotech)",0,"Skill",null,true,{"$f":"AND(COUNTIF(adv!A:A,B77))","v":false},"Archeotech"]
["Lore: Forbidden (any) +10","Lore: Forbidden (Archeotech) +10",0,"Skill","Lore: Forbidden (Archeotech)",{"$f":"AND(COUNTIF(adv!A:A,E78))","v":false},{"$f":"AND(COUNTIF(adv!A:A,B78))","v":false},"Archeotech"]
["Lore: Forbidden (any) +20","Lore: Forbidden (Archeotech) +20",0,"Skill","Lore: Forbidden (Archeotech) +10",{"$f":"AND(COUNTIF(adv!A:A,E79))","v":false},{"$f":"AND(COUNTIF(adv!A:A,B79))","v":false},"Archeotech"]
["Lore: Forbidden (any)","Lore: Forbidden (Daemonology)",0,"Skill",null,true,{"$f":"AND(COUNTIF(adv!A:A,B80))","v":false},"Daemonology"]
["Lore: Forbidden (any) +10","Lore: Forbidden (Daemonology) +10",0,"Skill","Lore: Forbidden (Daemonology)",{"$f":"AND(COUNTIF(adv!A:A,E81))","v":false},{"$f":"AND(COUNTIF(adv!A:A,B81))","v":false},"Daemonology"]
["Lore: Forbidden (any) +20","Lore: Forbidden (Daemonology) +20",0,"Skill","Lore: Forbidden (Daemonology) +10",{"$f":"AND(COUNTIF(adv!A:A,E82))","v":false},{"$f":"AND(COUNTIF(adv!A:A,B82))","v":false},"Daemonology"]
["Lore: Forbidden (any)","Lore: Forbidden (Heresy)",0,"Skill",null,true,{"$f":"AND(COUNTIF(adv!A:A,B83))","v":false},"Heresy"]
["Lore: Forbidden (any) +10","Lore: Forbidden (Heresy) +10",0,"Skill","Lore: Forbidden (Heresy)",{"$f":"AND(COUNTIF(adv!A:A,E84))","v":false},{"$f":"AND(COUNTIF(adv!A:A,B84))","v":false},"Heresy"]
["Lore: Forbidden (any) +20","Lore: Forbidden (Heresy) +20",0,"Skill","Lore: Forbidden (Heresy) +10",{"$f":"AND(COUNTIF(adv!A:A,E85))","v":false},{"$f":"AND(COUNTIF(adv!A:A,B85))","v":false},"Heresy"]
["Lore: Forbidden (any)","Lore: Forbidden (Mutants)",0,"Skill",null,true,{"$f":"AND(COUNTIF(adv!A:A,B86))","v":false},"Mutants"]
["Lore: Forbidden (any) +10","Lore: Forbidden (Mutants) +10",0,"Skill","Lore: Forbidden (Mutants)",{"$f":"AND(COUNTIF(adv!A:A,E87))","v":false},{"$f":"AND(COUNTIF(adv!A:A,B87))","v":false},"Mutants"]
["Lore: Forbidden (any) +20","Lore: Forbidden (Mutants) +20",0,"Skill","Lore: Forbidden (Mutants) +10",{"$f":"AND(COUNTIF(adv!A:A,E88))","v":false},{"$f":"AND(COUNTIF(adv!A:A,B88))","v":false},"Mutants"]
["Lore: Forbidden (any)","Lore: Forbidden (Psykers)",0,"Skill",null,true,{"$f":"AND(COUNTIF(adv!A:A,B89))","v":false},"Psykers"]
["Lore: Forbidden (any) +10","Lore: Forbidden (Psykers) +10",0,"Skill","Lore: Forbidden (Psykers)",{"$f":"AND(COUNTIF(adv!A:A,E90))","v":false},{"$f":"AND(COUNTIF(adv!A:A,B90))","v":false},"Psykers"]
["Lore: Forbidden (any) +20","Lore: Forbidden (Psykers) +20",0,"Skill","Lore: Forbidden (Psykers) +10",{"$f":"AND(COUNTIF(adv!A:A,E91))","v":false},{"$f":"AND(COUNTIF(adv!A:A,B91))","v":false},"Psykers"]
["Lore: Forbidden (any)","Lore: Forbidden (The Black Library)",0,"Skill",null,true,{"$f":"AND(COUNTIF(adv!A:A,B92))","v":false},"The Black Library"]
["Lore: Forbidden (any) +10","Lore: Forbidden (The Black Library) +10",0,"Skill","Lore: Forbidden (The Black Library)",{"$f":"AND(COUNTIF(adv!A:A,E93))","v":false},{"$f":"AND(COUNTIF(adv!A:A,B93))","v":false},"The Black Library"]
["Lore: Forbidden (any) +20","Lore: Forbidden (The Black Library) +20",0,"Skill","Lore: Forbidden (The Black Library) +10",{"$f":"AND(COUNTIF(adv!A:A,E94))","v":false},{"$f":"AND(COUNTIF(adv!A:A,B94))","v":false},"The Black Library"]
["Lore: Forbidden (any)","Lore: Forbidden (The Inquisition)",0,"Skill",null,true,{"$f":"AND(COUNTIF(adv!A:A,B95))","v":false},"The Inquisition"]
["Lore: Forbidden (any) +10","Lore: Forbidden (The Inquisition) +10",0,"Skill","Lore: Forbidden (The Inquisition)",{"$f":"AND(COUNTIF(adv!A:A,E96))","v":false},{"$f":"AND(COUNTIF(adv!A:A,B96))","v":false},"The Inquisition"]
["Lore: Forbidden (any) +20","Lore: Forbidden (The Inquisition) +20",0,"Skill","Lore: Forbidden (The Inquisition) +10",{"$f":"AND(COUNTIF(adv!A:A,E97))","v":false},{"$f":"AND(COUNTIF(adv!A:A,B97))","v":false},"The Inquisition"]
["Lore: Forbidden (any)","Lore: Forbidden (The Traitor Legions)",0,"Skill",null,true,{"$f":"AND(COUNTIF(adv!A:A,B98))","v":false},"The Traitor Legions"]
["Lore: Forbidden (any) +10","Lore: Forbidden (The Traitor Legions) +10",0,"Skill","Lore: Forbidden (The Traitor Legions)",{"$f":"AND(COUNTIF(adv!A:A,E99))","v":false},{"$f":"AND(COUNTIF(adv!A:A,B99))","v":false},"The Traitor Legions"]
["Lore: Forbidden (any) +20","Lore: Forbidden (The Traitor Legions) +20",0,"Skill","Lore: Forbidden (The Traitor Legions) +10",{"$f":"AND(COUNTIF(adv!A:A,E100))","v":false},{"$f":"AND(COUNTIF(adv!A:A,B100))","v":false},"The Traitor Legions"]
["Lore: Forbidden (any)","Lore: Forbidden (The Warp)",0,"Skill",null,true,{"$f":"AND(COUNTIF(adv!A:A,B101))","v":false},"The Warp"]
["Lore: Forbidden (any) +10","Lore: Forbidden (The Warp) +10",0,"Skill","Lore: Forbidden (The Warp)",{"$f":"AND(COUNTIF(adv!A:A,E102))","v":false},{"$f":"AND(COUNTIF(adv!A:A,B102))","v":false},"The Warp"]
["Lore: Forbidden (any) +20","Lore: Forbidden (The Warp) +20",0,"Skill","Lore: Forbidden (The Warp) +10",{"$f":"AND(COUNTIF(adv!A:A,E103))","v":false},{"$f":"AND(COUNTIF(adv!A:A,B103))","v":false},"The Warp"]
["Lore: Forbidden (any)","Lore: Forbidden (Xenos)",0,"Skill",null,true,{"$f":"AND(COUNTIF(adv!A:A,B104))","v":false},"Xenos"]
["Lore: Forbidden (any) +10","Lore: Forbidden (Xenos) +10",0,"Skill","Lore: Forbidden (Xenos)",{"$f":"AND(COUNTIF(adv!A:A,E105))","v":false},{"$f":"AND(COUNTIF(adv!A:A,B105))","v":false},"Xenos"]
["Lore: Forbidden (any) +20","Lore: Forbidden (Xenos) +20",0,"Skill","Lore: Forbidden (Xenos) +10",{"$f":"AND(COUNTIF(adv!A:A,E106))","v":false},{"$f":"AND(COUNTIF(adv!A:A,B106))","v":false},"Xenos"]
["Lore: Scholastic (any)","Lore: Scholastic (Archaic)",0,"Skill",null,true,{"$f":"AND(COUNTIF(adv!A:A,B107))","v":false},"Archaic"]
["Lore: Scholastic (any) +10","Lore: Scholastic (Archaic) +10",0,"Skill","Lore: Scholastic (Archaic)",{"$f":"AND(COUNTIF(adv!A:A,E108))","v":false},{"$f":"AND(COUNTIF(adv!A:A,B108))","v":false},"Archaic"]
["Lore: Scholastic (any) +20","Lore: Scholastic (Archaic) +20",0,"Skill","Lore: Scholastic (Archaic) +10",{"$f":"AND(COUNTIF(adv!A:A,E109))","v":false},{"$f":"AND(COUNTIF(adv!A:A,B109))","v":false},"Archaic"]
["Lore: Scholastic (any)","Lore: Scholastic (Astromancy)",0,"Skill",null,true,{"$f":"AND(COUNTIF(adv!A:A,B110))","v":false},"Astromancy"]
["Lore: Scholastic (any) +10","Lore: Scholastic (Astromancy) +10",0,"Skill","Lore: Scholastic (Astromancy)",{"$f":"AND(COUNTIF(adv!A:A,E111))","v":false},{"$f":"AND(COUNTIF(adv!A:A,B111))","v":false},"Astromancy"]
["Lore: Scholastic (any) +20","Lore: Scholastic (Astromancy) +20",0,"Skill","Lore: Scholastic (Astromancy) +10",{"$f":"AND(COUNTIF(adv!A:A,E112))","v":false},{"$f":"AND(COUNTIF(adv!A:A,B112))","v":false},"Astromancy"]
["Lore: Scholastic (any)","Lore: Scholastic (Beasts)",0,"Skill",null,true,{"$f":"AND(COUNTIF(adv!A:A,B113))","v":false},"Beasts"]
["Lore: Scholastic (any) +10","Lore: Scholastic (Beasts) +10",0,"Skill","Lore: Scholastic (Beasts)",{"$f":"AND(COUNTIF(adv!A:A,E114))","v":false},{"$f":"AND(COUNTIF(adv!A:A,B114))","v":false},"Beasts"]
["Lore: Scholastic (any) +20","Lore: Scholastic (Beasts) +20",0,"Skill","Lore: Scholastic (Beasts) +10",{"$f":"AND(COUNTIF(adv!A:A,E115))","v":false},{"$f":"AND(COUNTIF(adv!A:A,B115))","v":false},"Beasts"]
["Lore: Scholastic (any)","Lore: Scholastic (Bureaucracy)",0,"Skill",null,true,{"$f":"AND(COUNTIF(adv!A:A,B116))","v":false},"Bureaucracy"]
["Lore: Scholastic (any) +10","Lore: Scholastic (Bureaucracy) +10",0,"Skill","Lore: Scholastic (Bureaucracy)",{"$f":"AND(COUNTIF(adv!A:A,E117))","v":false},{"$f":"AND(COUNTIF(adv!A:A,B117))","v":false},"Bureaucracy"]
["Lore: Scholastic (any) +20","Lore: Scholastic (Bureaucracy) +20",0,"Skill","Lore: Scholastic (Bureaucracy) +10",{"$f":"AND(COUNTIF(adv!A:A,E118))","v":false},{"$f":"AND(COUNTIF(adv!A:A,B118))","v":false},"Bureaucracy"]
["Lore: Scholastic (any)","Lore: Scholastic (Chymistry)",0,"Skill",null,true,{"$f":"AND(COUNTIF(adv!A:A,B119))","v":false},"Chymistry"]
["Lore: Scholastic (any) +10","Lore: Scholastic (Chymistry) +10",0,"Skill","Lore: Scholastic (Chymistry)",{"$f":"AND(COUNTIF(adv!A:A,E120))","v":false},{"$f":"AND(COUNTIF(adv!A:A,B120))","v":false},"Chymistry"]
["Lore: Scholastic (any) +20","Lore: Scholastic (Chymistry) +20",0,"Skill","Lore: Scholastic (Chymistry) +10",{"$f":"AND(COUNTIF(adv!A:A,E121))","v":false},{"$f":"AND(COUNTIF(adv!A:A,B121))","v":false},"Chymistry"]
["Lore: Scholastic (any)","Lore: Scholastic (Codex Astartes)",0,"Skill",null,true,{"$f":"AND(COUNTIF(adv!A:A,B122))","v":false},"Codex Astartes"]
["Lore: Scholastic (any) +10","Lore: Scholastic (Codex Astartes) +10",0,"Skill","Lore: Scholastic (Codex Astartes)",{"$f":"AND(COUNTIF(adv!A:A,E123))","v":false},{"$f":"AND(COUNTIF(adv!A:A,B123))","v":false},"Codex Astartes"]
["Lore: Scholastic (any) +20","Lore: Scholastic (Codex Astartes) +20",0,"Skill","Lore: Scholastic (Codex Astartes) +10",{"$f":"AND(COUNTIF(adv!A:A,E124))","v":false},{"$f":"AND(COUNTIF(adv!A:A,B124))","v":false},"Codex Astartes"]
["Lore: Scholastic (any)","Lore: Scholastic (Cryptology)",0,"Skill",null,true,{"$f":"AND(COUNTIF(adv!A:A,B125))","v":false},"Cryptology"]
["Lore: Scholastic (any) +10","Lore: Scholastic (Cryptology) +10",0,"Skill","Lore: Scholastic (Cryptology)",{"$f":"AND(COUNTIF(adv!A:A,E126))","v":false},{"$f":"AND(COUNTIF(adv!A:A,B126))","v":false},"Cryptology"]
["Lore: Scholastic (any) +20","Lore: Scholastic (Cryptology) +20",0,"Skill","Lore: Scholastic (Cryptology) +10",{"$f":"AND(COUNTIF(adv!A:A,E127))","v":false},{"$f":"AND(COUNTIF(adv!A:A,B127))","v":false},"Cryptology"]
["Lore: Scholastic (any)","Lore: Scholastic (Heraldry)",0,"Skill",null,true,{"$f":"AND(COUNTIF(adv!A:A,B128))","v":false},"Heraldry"]
["Lore: Scholastic (any) +10","Lore: Scholastic (Heraldry) +10",0,"Skill","Lore: Scholastic (Heraldry)",{"$f":"AND(COUNTIF(adv!A:A,E129))","v":false},{"$f":"AND(COUNTIF(adv!A:A,B129))","v":false},"Heraldry"]
["Lore: Scholastic (any) +20","Lore: Scholastic (Heraldry) +20",0,"Skill","Lore: Scholastic (Heraldry) +10",{"$f":"AND(COUNTIF(adv!A:A,E130))","v":false},{"$f":"AND(COUNTIF(adv!A:A,B130))","v":false},"Heraldry"]
["Lore: Scholastic (any)","Lore: Scholastic (Imperial Creed)",0,"Skill",null,true,{"$f":"AND(COUNTIF(adv!A:A,B131))","v":false},"Imperial Creed"]
["Lore: Scholastic (any) +10","Lore: Scholastic (Imperial Creed) +10",0,"Skill","Lore: Scholastic (Imperial Creed)",{"$f":"AND(COUNTIF(adv!A:A,E132))","v":false},{"$f":"AND(COUNTIF(adv!A:A,B132))","v":false},"Imperial Creed"]
["Lore: Scholastic (any) +20","Lore: Scholastic (Imperial Creed) +20",0,"Skill","Lore: Scholastic (Imperial Creed) +10",{"$f":"AND(COUNTIF(adv!A:A,E133))","v":false},{"$f":"AND(COUNTIF(adv!A:A,B133))","v":false},"Imperial Creed"]
["Lore: Scholastic (any)","Lore: Scholastic (Judgement)",0,"Skill",null,true,{"$f":"AND(COUNTIF(adv!A:A,B134))","v":false},"Judgement"]
["Lore: Scholastic (any) +10","Lore: Scholastic (Judgement) +10",0,"Skill","Lore: Scholastic (Judgement)",{"$f":"AND(COUNTIF(adv!A:A,E135))","v":false},{"$f":"AND(COUNTIF(adv!A:A,B135))","v":false},"Judgement"]
["Lore: Scholastic (any) +20","Lore: Scholastic (Judgement) +20",0,"Skill","Lore: Scholastic (Judgement) +10",{"$f":"AND(COUNTIF(adv!A:A,E136))","v":false},{"$f":"AND(COUNTIF(adv!A:A,B136))","v":false},"Judgement"]
["Lore: Scholastic (any)","Lore: Scholastic (Legend)",0,"Skill",null,true,{"$f":"AND(COUNTIF(adv!A:A,B137))","v":false},"Legend"]
["Lore: Scholastic (any) +10","Lore: Scholastic (Legend) +10",0,"Skill","Lore: Scholastic (Legend)",{"$f":"AND(COUNTIF(adv!A:A,E138))","v":false},{"$f":"AND(COUNTIF(adv!A:A,B138))","v":false},"Legend"]
["Lore: Scholastic (any) +20","Lore: Scholastic (Legend) +20",0,"Skill","Lore: Scholastic (Legend) +10",{"$f":"AND(COUNTIF(adv!A:A,E139))","v":false},{"$f":"AND(COUNTIF(adv!A:A,B139))","v":false},"Legend"]
["Lore: Scholastic (any)","Lore: Scholastic (Numerology)",0,"Skill",null,true,{"$f":"AND(COUNTIF(adv!A:A,B140))","v":false},"Numerology"]
["Lore: Scholastic (any) +10","Lore: Scholastic (Numerology) +10",0,"Skill","Lore: Scholastic (Numerology)",{"$f":"AND(COUNTIF(adv!A:A,E141))","v":false},{"$f":"AND(COUNTIF(adv!A:A,B141))","v":false},"Numerology"]
["Lore: Scholastic (any) +20","Lore: Scholastic (Numerology) +20",0,"Skill","Lore: Scholastic (Numerology) +10",{"$f":"AND(COUNTIF(adv!A:A,E142))","v":false},{"$f":"AND(COUNTIF(adv!A:A,B142))","v":false},"Numerology"]
["Lore: Scholastic (any)","Lore: Scholastic (Occult)",0,"Skill",null,true,{"$f":"AND(COUNTIF(adv!A:A,B143))","v":false},"Occult"]
["Lore: Scholastic (any) +10","Lore: Scholastic (Occult) +10",0,"Skill","Lore: Scholastic (Occult)",{"$f":"AND(COUNTIF(adv!A:A,E144))","v":false},{"$f":"AND(COUNTIF(adv!A:A,B144))","v":false},"Occult"]
["Lore: Scholastic (any) +20","Lore: Scholastic (Occult) +20",0,"Skill","Lore: Scholastic (Occult) +10",{"$f":"AND(COUNTIF(adv!A:A,E145))","v":false},{"$f":"AND(COUNTIF(adv!A:A,B145))","v":false},"Occult"]
["Lore: Scholastic (any)","Lore: Scholastic (Philosophy)",0,"Skill",null,true,{"$f":"AND(COUNTIF(adv!A:A,B146))","v":false},"Philosophy"]
["Lore: Scholastic (any) +10","Lore: Scholastic (Philosophy) +10",0,"Skill","Lore: Scholastic (Philosophy)",{"$f":"AND(COUNTIF(adv!A:A,E147))","v":false},{"$f":"AND(COUNTIF(adv!A:A,B147))","v":false},"Philosophy"]
["Lore: Scholastic (any) +20","Lore: Scholastic (Philosophy) +20",0,"Skill","Lore: Scholastic (Philosophy) +10",{"$f":"AND(COUNTIF(adv!A:A,E148))","v":false},{"$f":"AND(COUNTIF(adv!A:A,B148))","v":false},"Philosophy"]
["Lore: Scholastic (any)","Lore: Scholastic (Tactica Imperialis)",0,"Skill",null,true,{"$f":"AND(COUNTIF(adv!A:A,B149))","v":false},"Tactica Imperialis"]
["Lore: Scholastic (any) +10","Lore: Scholastic (Tactica Imperialis) +10",0,"Skill","Lore: Scholastic (Tactica Imperialis)",{"$f":"AND(COUNTIF(adv!A:A,E150))","v":false},{"$f":"AND(COUNTIF(adv!A:A,B150))","v":false},"Tactica Imperialis"]
["Lore: Scholastic (any) +20","Lore: Scholastic (Tactica Imperialis) +20",0,"Skill","Lore: Scholastic (Tactica Imperialis) +10",{"$f":"AND(COUNTIF(adv!A:A,E151))","v":false},{"$f":"AND(COUNTIF(adv!A:A,B151))","v":false},"Tactica Imperialis"]
["Navigation (any)","Navigation (Stellar)",0,"Skill",null,true,{"$f":"AND(COUNTIF(adv!A:A,B152))","v":false},"Stellar"]
["Navigation (any) +10","Navigation (Stellar) +10",0,"Skill","Navigation (Stellar)",{"$f":"AND(COUNTIF(adv!A:A,E153))","v":false},{"$f":"AND(COUNTIF(adv!A:A,B153))","v":false},"Stellar"]
["Navigation (any) +20","Navigation (Stellar) +20",0,"Skill","Navigation (Stellar) +10",{"$f":"AND(COUNTIF(adv!A:A,E154))","v":false},{"$f":"AND(COUNTIF(adv!A:A,B154))","v":false},"Stellar"]
["Navigation (any)","Navigation (Surface)",0,"Skill",null,true,{"$f":"AND(COUNTIF(adv!A:A,B155))","v":false},"Surface"]
["Navigation (any) +10","Navigation (Surface) +10",0,"Skill","Navigation (Surface)",{"$f":"AND(COUNTIF(adv!A:A,E156))","v":false},{"$f":"AND(COUNTIF(adv!A:A,B156))","v":false},"Surface"]
["Navigation (any) +20","Navigation (Surface) +20",0,"Skill","Navigation (Surface) +10",{"$f":"AND(COUNTIF(adv!A:A,E157))","v":false},{"$f":"AND(COUNTIF(adv!A:A,B157))","v":false},"Surface"]
["Performer (any)","Performer (Dancer)",0,"Skill",null,true,{"$f":"AND(COUNTIF(adv!A:A,B158))","v":false},"Dancer"]
["Performer (any) +10","Performer (Dancer) +10",0,"Skill","Performer (Dancer)",{"$f":"AND(COUNTIF(adv!A:A,E159))","v":false},{"$f":"AND(COUNTIF(adv!A:A,B159))","v":false},"Dancer"]
["Performer (any) +20","Performer (Dancer) +20",0,"Skill","Performer (Dancer) +10",{"$f":"AND(COUNTIF(adv!A:A,E160))","v":false},{"$f":"AND(COUNTIF(adv!A:A,B160))","v":false},"Dancer"]
["Performer (any)","Performer (Musician)",0,"Skill",null,true,{"$f":"AND(COUNTIF(adv!A:A,B161))","v":false},"Musician"]
["Performer (any) +10","Performer (Musician) +10",0,"Skill","Performer (Musician)",{"$f":"AND(COUNTIF(adv!A:A,E162))","v":false},{"$f":"AND(COUNTIF(adv!A:A,B162))","v":false},"Musician"]
["Performer (any) +20","Performer (Musician) +20",0,"Skill","Performer (Musician) +10",{"$f":"AND(COUNTIF(adv!A:A,E163))","v":false},{"$f":"AND(COUNTIF(adv!A:A,B163))","v":false},"Musician"]
["Performer (any)","Performer (Singer)",0,"Skill",null,true,{"$f":"AND(COUNTIF(adv!A:A,B164))","v":false},"Singer"]
["Performer (any) +10","Performer (Singer) +10",0,"Skill","Performer (Singer)",{"$f":"AND(COUNTIF(adv!A:A,E165))","v":false},{"$f":"AND(COUNTIF(adv!A:A,B165))","v":false},"Singer"]
["Performer (any) +20","Performer (Singer) +20",0,"Skill","Performer (Singer) +10",{"$f":"AND(COUNTIF(adv!A:A,E166))","v":false},{"$f":"AND(COUNTIF(adv!A:A,B166))","v":false},"Singer"]
["Performer (any)","Performer (Storyteller)",0,"Skill",null,true,{"$f":"AND(COUNTIF(adv!A:A,B167))","v":false},"Storyteller"]
["Performer (any) +10","Performer (Storyteller) +10",0,"Skill","Performer (Storyteller)",{"$f":"AND(COUNTIF(adv!A:A,E168))","v":false},{"$f":"AND(COUNTIF(adv!A:A,B168))","v":false},"Storyteller"]
["Performer (any) +20","Performer (Storyteller) +20",0,"Skill","Performer (Storyteller) +10",{"$f":"AND(COUNTIF(adv!A:A,E169))","v":false},{"$f":"AND(COUNTIF(adv!A:A,B169))","v":false},"Storyteller"]
["Pilot (any)","Pilot (Flyers)",0,"Skill",null,true,{"$f":"AND(COUNTIF(adv!A:A,B170))","v":false},"Flyers"]
["Pilot (any) +10","Pilot (Flyers) +10",0,"Skill","Pilot (Flyers)",{"$f":"AND(COUNTIF(adv!A:A,E171))","v":false},{"$f":"AND(COUNTIF(adv!A:A,B171))","v":false},"Flyers"]
["Pilot (any) +20","Pilot (Flyers) +20",0,"Skill","Pilot (Flyers) +10",{"$f":"AND(COUNTIF(adv!A:A,E172))","v":false},{"$f":"AND(COUNTIF(adv!A:A,B172))","v":false},"Flyers"]
["Pilot (any)","Pilot (Personal)",0,"Skill",null,true,{"$f":"AND(COUNTIF(adv!A:A,B173))","v":false},"Personal"]
["Pilot (any) +10","Pilot (Personal) +10",0,"Skill","Pilot (Personal)",{"$f":"AND(COUNTIF(adv!A:A,E174))","v":false},{"$f":"AND(COUNTIF(adv!A:A,B174))","v":false},"Personal"]
["Pilot (any) +20","Pilot (Personal) +20",0,"Skill","Pilot (Personal) +10",{"$f":"AND(COUNTIF(adv!A:A,E175))","v":false},{"$f":"AND(COUNTIF(adv!A:A,B175))","v":false},"Personal"]
["Pilot (any)","Pilot (Spacecraft)",0,"Skill",null,true,{"$f":"AND(COUNTIF(adv!A:A,B176))","v":false},"Spacecraft"]
["Pilot (any) +10","Pilot (Spacecraft) +10",0,"Skill","Pilot (Spacecraft)",{"$f":"AND(COUNTIF(adv!A:A,E177))","v":false},{"$f":"AND(COUNTIF(adv!A:A,B177))","v":false},"Spacecraft"]
["Pilot (any) +20","Pilot (Spacecraft) +20",0,"Skill","Pilot (Spacecraft) +10",{"$f":"AND(COUNTIF(adv!A:A,E178))","v":false},{"$f":"AND(COUNTIF(adv!A:A,B178))","v":false},"Spacecraft"]
["Speak Language (any)","Speak Language (Eldar)",0,"Skill",null,true,{"$f":"AND(COUNTIF(adv!A:A,B179))","v":false},"Eldar"]
["Speak Language (any) +10","Speak Language (Eldar) +10",0,"Skill","Speak Language (Eldar)",{"$f":"AND(COUNTIF(adv!A:A,E180))","v":false},{"$f":"AND(COUNTIF(adv!A:A,B180))","v":false},"Eldar"]
["Speak Language (any) +20","Speak Language (Eldar) +20",0,"Skill","Speak Language (Eldar) +10",{"$f":"AND(COUNTIF(adv!A:A,E181))","v":false},{"$f":"AND(COUNTIF(adv!A:A,B181))","v":false},"Eldar"]
["Speak Language (any)","Speak Language (High Gothic)",0,"Skill",null,true,{"$f":"AND(COUNTIF(adv!A:A,B182))","v":false},"High Gothic"]
["Speak Language (any) +10","Speak Language (High Gothic) +10",0,"Skill","Speak Language (High Gothic)",{"$f":"AND(COUNTIF(adv!A:A,E183))","v":false},{"$f":"AND(COUNTIF(adv!A:A,B183))","v":false},"High Gothic"]
["Speak Language (any) +20","Speak Language (High Gothic) +20",0,"Skill","Speak Language (High Gothic) +10",{"$f":"AND(COUNTIF(adv!A:A,E184))","v":false},{"$f":"AND(COUNTIF(adv!A:A,B184))","v":false},"High Gothic"]
["Speak Language (any)","Speak Language (Kroot)",0,"Skill",null,true,{"$f":"AND(COUNTIF(adv!A:A,B185))","v":false},"Kroot"]
["Speak Language (any) +10","Speak Language (Kroot) +10",0,"Skill","Speak Language (Kroot)",{"$f":"AND(COUNTIF(adv!A:A,E186))","v":false},{"$f":"AND(COUNTIF(adv!A:A,B186))","v":false},"Kroot"]
["Speak Language (any) +20","Speak Language (Kroot) +20",0,"Skill","Speak Language (Kroot) +10",{"$f":"AND(COUNTIF(adv!A:A,E187))","v":false},{"$f":"AND(COUNTIF(adv!A:A,B187))","v":false},"Kroot"]
["Speak Language (any)","Speak Language (Low Gothic)",0,"Skill",null,true,{"$f":"AND(COUNTIF(adv!A:A,B188))","v":false},"Low Gothic"]
["Speak Language (any) +10","Speak Language (Low Gothic) +10",0,"Skill","Speak Language (Low Gothic)",{"$f":"AND(COUNTIF(adv!A:A,E189))","v":false},{"$f":"AND(COUNTIF(adv!A:A,B189))","v":false},"Low Gothic"]
["Speak Language (any) +20","Speak Language (Low Gothic) +20",0,"Skill","Speak Language (Low Gothic) +10",{"$f":"AND(COUNTIF(adv!A:A,E190))","v":false},{"$f":"AND(COUNTIF(adv!A:A,B190))","v":false},"Low Gothic"]
["Speak Language (any)","Speak Language (Ork)",0,"Skill",null,true,{"$f":"AND(COUNTIF(adv!A:A,B191))","v":false},"Ork"]
["Speak Language (any) +10","Speak Language (Ork) +10",0,"Skill","Speak Language (Ork)",{"$f":"AND(COUNTIF(adv!A:A,E192))","v":false},{"$f":"AND(COUNTIF(adv!A:A,B192))","v":false},"Ork"]
["Speak Language (any) +20","Speak Language (Ork) +20",0,"Skill","Speak Language (Ork) +10",{"$f":"AND(COUNTIF(adv!A:A,E193))","v":false},{"$f":"AND(COUNTIF(adv!A:A,B193))","v":false},"Ork"]
["Speak Language (any)","Speak Language (Tau)",0,"Skill",null,true,{"$f":"AND(COUNTIF(adv!A:A,B194))","v":false},"Tau"]
["Speak Language (any) +10","Speak Language (Tau) +10",0,"Skill","Speak Language (Tau)",{"$f":"AND(COUNTIF(adv!A:A,E195))","v":false},{"$f":"AND(COUNTIF(adv!A:A,B195))","v":false},"Tau"]
["Speak Language (any) +20","Speak Language (Tau) +20",0,"Skill","Speak Language (Tau) +10",{"$f":"AND(COUNTIF(adv!A:A,E196))","v":false},{"$f":"AND(COUNTIF(adv!A:A,B196))","v":false},"Tau"]
["Speak Language (any)","Speak Language (Techna-Lingua)",0,"Skill",null,true,{"$f":"AND(COUNTIF(adv!A:A,B197))","v":false},"Techna-Lingua"]
["Speak Language (any) +10","Speak Language (Techna-Lingua) +10",0,"Skill","Speak Language (Techna-Lingua)",{"$f":"AND(COUNTIF(adv!A:A,E198))","v":false},{"$f":"AND(COUNTIF(adv!A:A,B198))","v":false},"Techna-Lingua"]
["Speak Language (any) +20","Speak Language (Techna-Lingua) +20",0,"Skill","Speak Language (Techna-Lingua) +10",{"$f":"AND(COUNTIF(adv!A:A,E199))","v":false},{"$f":"AND(COUNTIF(adv!A:A,B199))","v":false},"Techna-Lingua"]
["Tactics (any)","Tactics (Air Combat)",0,"Skill",null,true,{"$f":"AND(COUNTIF(adv!A:A,B200))","v":false},"Air Combat"]
["Tactics (any) +10","Tactics (Air Combat) +10",0,"Skill","Tactics (Air Combat)",{"$f":"AND(COUNTIF(adv!A:A,E201))","v":false},{"$f":"AND(COUNTIF(adv!A:A,B201))","v":false},"Air Combat"]
["Tactics (any) +20","Tactics (Air Combat) +20",0,"Skill","Tactics (Air Combat) +10",{"$f":"AND(COUNTIF(adv!A:A,E202))","v":false},{"$f":"AND(COUNTIF(adv!A:A,B202))","v":false},"Air Combat"]
["Tactics (any)","Tactics (Armoured Tactics)",0,"Skill",null,true,{"$f":"AND(COUNTIF(adv!A:A,B203))","v":false},"Armoured Tactics"]
["Tactics (any) +10","Tactics (Armoured Tactics) +10",0,"Skill","Tactics (Armoured Tactics)",{"$f":"AND(COUNTIF(adv!A:A,E204))","v":false},{"$f":"AND(COUNTIF(adv!A:A,B204))","v":false},"Armoured Tactics"]
["Tactics (any) +20","Tactics (Armoured Tactics) +20",0,"Skill","Tactics (Armoured Tactics) +10",{"$f":"AND(COUNTIF(adv!A:A,E205))","v":false},{"$f":"AND(COUNTIF(adv!A:A,B205))","v":false},"Armoured Tactics"]
["Tactics (any)","Tactics (Assault Doctrine)",0,"Skill",null,true,{"$f":"AND(COUNTIF(adv!A:A,B206))","v":false},"Assault Doctrine"]
["Tactics (any) +10","Tactics (Assault Doctrine) +10",0,"Skill","Tactics (Assault Doctrine)",{"$f":"AND(COUNTIF(adv!A:A,E207))","v":false},{"$f":"AND(COUNTIF(adv!A:A,B207))","v":false},"Assault Doctrine"]
["Tactics (any) +20","Tactics (Assault Doctrine) +20",0,"Skill","Tactics (Assault Doctrine) +10",{"$f":"AND(COUNTIF(adv!A:A,E208))","v":false},{"$f":"AND(COUNTIF(adv!A:A,B208))","v":false},"Assault Doctrine"]
["Tactics (any)","Tactics (Defensive Doctrine)",0,"Skill",null,true,{"$f":"AND(COUNTIF(adv!A:A,B209))","v":false},"Defensive Doctrine"]
["Tactics (any) +10","Tactics (Defensive Doctrine) +10",0,"Skill","Tactics (Defensive Doctrine)",{"$f":"AND(COUNTIF(adv!A:A,E210))","v":false},{"$f":"AND(COUNTIF(adv!A:A,B210))","v":false},"Defensive Doctrine"]
["Tactics (any) +20","Tactics (Defensive Doctrine) +20",0,"Skill","Tactics (Defensive Doctrine) +10",{"$f":"AND(COUNTIF(adv!A:A,E211))","v":false},{"$f":"AND(COUNTIF(adv!A:A,B211))","v":false},"Defensive Doctrine"]
["Tactics (any)","Tactics (Orbital Drop Procedures)",0,"Skill",null,true,{"$f":"AND(COUNTIF(adv!A:A,B212))","v":false},"Orbital Drop Procedures"]
["Tactics (any) +10","Tactics (Orbital Drop Procedures) +10",0,"Skill","Tactics (Orbital Drop Procedures)",{"$f":"AND(COUNTIF(adv!A:A,E213))","v":false},{"$f":"AND(COUNTIF(adv!A:A,B213))","v":false},"Orbital Drop Procedures"]
["Tactics (any) +20","Tactics (Orbital Drop Procedures) +20",0,"Skill","Tactics (Orbital Drop Procedures) +10",{"$f":"AND(COUNTIF(adv!A:A,E214))","v":false},{"$f":"AND(COUNTIF(adv!A:A,B214))","v":false},"Orbital Drop Procedures"]
["Tactics (any)","Tactics (Recon and Stealth)",0,"Skill",null,true,{"$f":"AND(COUNTIF(adv!A:A,B215))","v":false},"Recon and Stealth"]
["Tactics (any) +10","Tactics (Recon and Stealth) +10",0,"Skill","Tactics (Recon and Stealth)",{"$f":"AND(COUNTIF(adv!A:A,E216))","v":false},{"$f":"AND(COUNTIF(adv!A:A,B216))","v":false},"Recon and Stealth"]
["Tactics (any) +20","Tactics (Recon and Stealth) +20",0,"Skill","Tactics (Recon and Stealth) +10",{"$f":"AND(COUNTIF(adv!A:A,E217))","v":false},{"$f":"AND(COUNTIF(adv!A:A,B217))","v":false},"Recon and Stealth"]
["Tactics (any)","Tactics (Void Combat)",0,"Skill",null,true,{"$f":"AND(COUNTIF(adv!A:A,B218))","v":false},"Void Combat"]
["Tactics (any) +10","Tactics (Void Combat) +10",0,"Skill","Tactics (Void Combat)",{"$f":"AND(COUNTIF(adv!A:A,E219))","v":false},{"$f":"AND(COUNTIF(adv!A:A,B219))","v":false},"Void Combat"]
["Tactics (any) +20","Tactics (Void Combat) +20",0,"Skill","Tactics (Void Combat) +10",{"$f":"AND(COUNTIF(adv!A:A,E220))","v":false},{"$f":"AND(COUNTIF(adv!A:A,B220))","v":false},"Void Combat"]
["Trade (any)","Trade (Archeologist)",0,"Skill",null,true,{"$f":"AND(COUNTIF(adv!A:A,B221))","v":false},"Archeologist"]
["Trade (any) +10","Trade (Archeologist) +10",0,"Skill","Trade (Archeologist)",{"$f":"AND(COUNTIF(adv!A:A,E222))","v":false},{"$f":"AND(COUNTIF(adv!A:A,B222))","v":false},"Archeologist"]
["Trade (any) +20","Trade (Archeologist) +20",0,"Skill","Trade (Archeologist) +10",{"$f":"AND(COUNTIF(adv!A:A,E223))","v":false},{"$f":"AND(COUNTIF(adv!A:A,B223))","v":false},"Archeologist"]
["Trade (any)","Trade (Armourer)",0,"Skill",null,true,{"$f":"AND(COUNTIF(adv!A:A,B224))","v":false},"Armourer"]
["Trade (any) +10","Trade (Armourer) +10",0,"Skill","Trade (Armourer)",{"$f":"AND(COUNTIF(adv!A:A,E225))","v":false},{"$f":"AND(COUNTIF(adv!A:A,B225))","v":false},"Armourer"]
["Trade (any) +20","Trade (Armourer) +20",0,"Skill","Trade (Armourer) +10",{"$f":"AND(COUNTIF(adv!A:A,E226))","v":false},{"$f":"AND(COUNTIF(adv!A:A,B226))","v":false},"Armourer"]
["Trade (any)","Trade (Artisan)",0,"Skill",null,true,{"$f":"AND(COUNTIF(adv!A:A,B227))","v":false},"Artisan"]
["Trade (any) +10","Trade (Artisan) +10",0,"Skill","Trade (Artisan)",{"$f":"AND(COUNTIF(adv!A:A,E228))","v":false},{"$f":"AND(COUNTIF(adv!A:A,B228))","v":false},"Artisan"]
["Trade (any) +20","Trade (Artisan) +20",0,"Skill","Trade (Artisan) +10",{"$f":"AND(COUNTIF(adv!A:A,E229))","v":false},{"$f":"AND(COUNTIF(adv!A:A,B229))","v":false},"Artisan"]
["Trade (any)","Trade (Astrographer)",0,"Skill",null,true,{"$f":"AND(COUNTIF(adv!A:A,B230))","v":false},"Astrographer"]
["Trade (any) +10","Trade (Astrographer) +10",0,"Skill","Trade (Astrographer)",{"$f":"AND(COUNTIF(adv!A:A,E231))","v":false},{"$f":"AND(COUNTIF(adv!A:A,B231))","v":false},"Astrographer"]
["Trade (any) +20","Trade (Astrographer) +20",0,"Skill","Trade (Astrographer) +10",{"$f":"AND(COUNTIF(adv!A:A,E232))","v":false},{"$f":"AND(COUNTIF(adv!A:A,B232))","v":false},"Astrographer"]
["Trade (any)","Trade (Chymist)",0,"Skill",null,true,{"$f":"AND(COUNTIF(adv!A:A,B233))","v":false},"Chymist"]
["Trade (any) +10","Trade (Chymist) +10",0,"Skill","Trade (Chymist)",{"$f":"AND(COUNTIF(adv!A:A,E234))","v":false},{"$f":"AND(COUNTIF(adv!A:A,B234))","v":false},"Chymist"]
["Trade (any) +20","Trade (Chymist) +20",0,"Skill","Trade (Chymist) +10",{"$f":"AND(COUNTIF(adv!A:A,E235))","v":false},{"$f":"AND(COUNTIF(adv!A:A,B235))","v":false},"Chymist"]
["Trade (any)","Trade (Cryptographer)",0,"Skill",null,true,{"$f":"AND(COUNTIF(adv!A:A,B236))","v":false},"Cryptographer"]
["Trade (any) +10","Trade (Cryptographer) +10",0,"Skill","Trade (Cryptographer)",{"$f":"AND(COUNTIF(adv!A:A,E237))","v":false},{"$f":"AND(COUNTIF(adv!A:A,B237))","v":false},"Cryptographer"]
["Trade (any) +20","Trade (Cryptographer) +20",0,"Skill","Trade (Cryptographer) +10",{"$f":"AND(COUNTIF(adv!A:A,E238))","v":false},{"$f":"AND(COUNTIF(adv!A:A,B238))","v":false},"Cryptographer"]
["Trade (any)","Trade (Explorator)",0,"Skill",null,true,{"$f":"AND(COUNTIF(adv!A:A,B239))","v":false},"Explorator"]
["Trade (any) +10","Trade (Explorator) +10",0,"Skill","Trade (Explorator)",{"$f":"AND(COUNTIF(adv!A:A,E240))","v":false},{"$f":"AND(COUNTIF(adv!A:A,B240))","v":false},"Explorator"]
["Trade (any) +20","Trade (Explorator) +20",0,"Skill","Trade (Explorator) +10",{"$f":"AND(COUNTIF(adv!A:A,E241))","v":false},{"$f":"AND(COUNTIF(adv!A:A,B241))","v":false},"Explorator"]
["Trade (any)","Trade (Linguist)",0,"Skill",null,true,{"$f":"AND(COUNTIF(adv!A:A,B242))","v":false},"Linguist"]
["Trade (any) +10","Trade (Linguist) +10",0,"Skill","Trade (Linguist)",{"$f":"AND(COUNTIF(adv!A:A,E243))","v":false},{"$f":"AND(COUNTIF(adv!A:A,B243))","v":false},"Linguist"]
["Trade (any) +20","Trade (Linguist) +20",0,"Skill","Trade (Linguist) +10",{"$f":"AND(COUNTIF(adv!A:A,E244))","v":false},{"$f":"AND(COUNTIF(adv!A:A,B244))","v":false},"Linguist"]
["Trade (any)","Trade (Remembrancer)",0,"Skill",null,true,{"$f":"AND(COUNTIF(adv!A:A,B245))","v":false},"Remembrancer"]
["Trade (any) +10","Trade (Remembrancer) +10",0,"Skill","Trade (Remembrancer)",{"$f":"AND(COUNTIF(adv!A:A,E246))","v":false},{"$f":"AND(COUNTIF(adv!A:A,B246))","v":false},"Remembrancer"]
["Trade (any) +20","Trade (Remembrancer) +20",0,"Skill","Trade (Remembrancer) +10",{"$f":"AND(COUNTIF(adv!A:A,E247))","v":false},{"$f":"AND(COUNTIF(adv!A:A,B247))","v":false},"Remembrancer"]
["Trade (any)","Trade (Shipwright)",0,"Skill",null,true,{"$f":"AND(COUNTIF(adv!A:A,B248))","v":false},"Shipwright"]
["Trade (any) +10","Trade (Shipwright) +10",0,"Skill","Trade (Shipwright)",{"$f":"AND(COUNTIF(adv!A:A,E249))","v":false},{"$f":"AND(COUNTIF(adv!A:A,B249))","v":false},"Shipwright"]
["Trade (any) +20","Trade (Shipwright) +20",0,"Skill","Trade (Shipwright) +10",{"$f":"AND(COUNTIF(adv!A:A,E250))","v":false},{"$f":"AND(COUNTIF(adv!A:A,B250))","v":false},"Shipwright"]
["Trade (any)","Trade (Soothsayer)",0,"Skill",null,true,{"$f":"AND(COUNTIF(adv!A:A,B251))","v":false},"Soothsayer"]
["Trade (any) +10","Trade (Soothsayer) +10",0,"Skill","Trade (Soothsayer)",{"$f":"AND(COUNTIF(adv!A:A,E252))","v":false},{"$f":"AND(COUNTIF(adv!A:A,B252))","v":false},"Soothsayer"]
["Trade (any) +20","Trade (Soothsayer) +20",0,"Skill","Trade (Soothsayer) +10",{"$f":"AND(COUNTIF(adv!A:A,E253))","v":false},{"$f":"AND(COUNTIF(adv!A:A,B253))","v":false},"Soothsayer"]
["Trade (any)","Trade (Technomat)",0,"Skill",null,true,{"$f":"AND(COUNTIF(adv!A:A,B254))","v":false},"Technomat"]
["Trade (any) +10","Trade (Technomat) +10",0,"Skill","Trade (Technomat)",{"$f":"AND(COUNTIF(adv!A:A,E255))","v":false},{"$f":"AND(COUNTIF(adv!A:A,B255))","v":false},"Technomat"]
["Trade (any) +20","Trade (Technomat) +20",0,"Skill","Trade (Technomat) +10",{"$f":"AND(COUNTIF(adv!A:A,E256))","v":false},{"$f":"AND(COUNTIF(adv!A:A,B256))","v":false},"Technomat"]
["Basic Weapon Training (any)","Basic Weapon Training (Bolt)",0,"Talent",null,true,{"$f":"AND(COUNTIF(adv!A:A,B257))","v":false},"NA"]
["Basic Weapon Training (any)","Basic Weapon Training (Las)",0,"Talent",null,true,{"$f":"AND(COUNTIF(adv!A:A,B258))","v":false},"NA"]
["Basic Weapon Training (any)","Basic Weapon Training (Launcher)",0,"Talent",null,true,{"$f":"AND(COUNTIF(adv!A:A,B259))","v":false},"NA"]
["Basic Weapon Training (any)","Basic Weapon Training (Melta)",0,"Talent",null,true,{"$f":"AND(COUNTIF(adv!A:A,B260))","v":false},"NA"]
["Basic Weapon Training (any)","Basic Weapon Training (Plasma)",0,"Talent",null,true,{"$f":"AND(COUNTIF(adv!A:A,B261))","v":false},"NA"]
["Basic Weapon Training (any)","Basic Weapon Training (Primitive)",0,"Talent",null,true,{"$f":"AND(COUNTIF(adv!A:A,B262))","v":false},"NA"]
["Basic Weapon Training (any)","Basic Weapon Training (SP)",0,"Talent",null,true,{"$f":"AND(COUNTIF(adv!A:A,B263))","v":false},"NA"]
["Basic Weapon Training (any)","Basic Weapon Training (Universal)",0,"Talent",null,true,{"$f":"AND(COUNTIF(adv!A:A,B264))","v":false},"NA"]
["Enemy (any)","Enemy (Adeptus Arbites)",0,"Talent",null,true,{"$f":"AND(COUNTIF(adv!A:A,B265))","v":false},"NA"]
["Enemy (any)","Enemy (Adeptus Astra Telepathica)",0,"Talent",null,true,{"$f":"AND(COUNTIF(adv!A:A,B266))","v":false},"NA"]
["Enemy (any)","Enemy (Adeptus Astartes)",0,"Talent",null,true,{"$f":"AND(COUNTIF(adv!A:A,B267))","v":false},"NA"]
["Enemy (any)","Enemy (Adeptus Mechanicus)",0,"Talent",null,true,{"$f":"AND(COUNTIF(adv!A:A,B268))","v":false},"NA"]
["Enemy (any)","Enemy (Adepta Sororitas)",0,"Talent",null,true,{"$f":"AND(COUNTIF(adv!A:A,B269))","v":false},"NA"]
["Enemy (any)","Enemy (Adeptus Titanicus)",0,"Talent",null,true,{"$f":"AND(COUNTIF(adv!A:A,B270))","v":false},"NA"]
["Enemy (any)","Enemy (Administratum)",0,"Talent",null,true,{"$f":"AND(COUNTIF(adv!A:A,B271))","v":false},"NA"]
["Enemy (any)","Enemy (Astropaths)",0,"Talent",null,true,{"$f":"AND(COUNTIF(adv!A:A,B272))","v":false},"NA"]
["Enemy (any)","Enemy (Chartist Captains)",0,"Talent",null,true,{"$f":"AND(COUNTIF(adv!A:A,B273))","v":false},"NA"]
["Enemy (any)","Enemy (Ecclesiarchy)",0,"Talent",null,true,{"$f":"AND(COUNTIF(adv!A:A,B274))","v":false},"NA"]
["Enemy (any)","Enemy (Imperial Guard)",0,"Talent",null,true,{"$f":"AND(COUNTIF(adv!A:A,B275))","v":false},"NA"]
["Enemy (any)","Enemy (Imperial Navy)",0,"Talent",null,true,{"$f":"AND(COUNTIF(adv!A:A,B276))","v":false},"NA"]
["Enemy (any)","Enemy (Inquisition)",0,"Talent",null,true,{"$f":"AND(COUNTIF(adv!A:A,B277))","v":false},"NA"]
["Enemy (any)","Enemy (Navigators)",0,"Talent",null,true,{"$f":"AND(COUNTIF(adv!A:A,B278))","v":false},"NA"]
["Enemy (any)","Enemy (Officio Assassinorum)",0,"Talent",null,true,{"$f":"AND(COUNTIF(adv!A:A,B279))","v":false},"NA"]
["Enemy (any)","Enemy (PDF)",0,"Talent",null,true,{"$f":"AND(COUNTIF(adv!A:A,B280))","v":false},"NA"]
["Enemy (any)","Enemy (Planetary Governors)",0,"Talent",null,true,{"$f":"AND(COUNTIF(adv!A:A,B281))","v":false},"NA"]
["Enemy (any)","Enemy (Rogue Trader)",0,"Talent",null,true,{"$f":"AND(COUNTIF(adv!A:A,B282))","v":false},"NA"]
["Enemy (any)","Enemy (Schola Progenium)",0,"Talent",null,true,{"$f":"AND(COUNTIF(adv!A:A,B283))","v":false},"NA"]
["Enemy (any)","Enemy (Scholastica Psykana)",0,"Talent",null,true,{"$f":"AND(COUNTIF(adv!A:A,B284))","v":false},"NA"]
["Exotic Weapon Training (any)","Exotic Weapon Training (Astartes Conversion Beamer)",0,"Talent",null,true,{"$f":"AND(COUNTIF(adv!A:A,B285))","v":false},"NA"]
["Exotic Weapon Training (any)","Exotic Weapon Training (Astartes Digital Flamer)",0,"Talent",null,true,{"$f":"AND(COUNTIF(adv!A:A,B286))","v":false},"NA"]
["Exotic Weapon Training (any)","Exotic Weapon Training (Astartes Digital Laser)",0,"Talent",null,true,{"$f":"AND(COUNTIF(adv!A:A,B287))","v":false},"NA"]
["Exotic Weapon Training (any)","Exotic Weapon Training (Astartes Digital Melta)",0,"Talent",null,true,{"$f":"AND(COUNTIF(adv!A:A,B288))","v":false},"NA"]
["Exotic Weapon Training (any)","Exotic Weapon Training (Astartes Sniper Rifle)",0,"Talent",null,true,{"$f":"AND(COUNTIF(adv!A:A,B289))","v":false},"NA"]
["Flame Weapon Training (any)","Flame Weapon Training (Astartes Flamer)",0,"Talent",null,true,{"$f":"AND(COUNTIF(adv!A:A,B290))","v":false},"NA"]
["Flame Weapon Training (any)","Flame Weapon Training (Astartes Hand Flamer)",0,"Talent",null,true,{"$f":"AND(COUNTIF(adv!A:A,B291))","v":false},"NA"]
["Flame Weapon Training (any)","Flame Weapon Training (Astartes Heavy Flamer)",0,"Talent",null,true,{"$f":"AND(COUNTIF(adv!A:A,B292))","v":false},"NA"]
["Good Reputation (any)","Good Reputation (Adeptus Arbites)",0,"Talent","Fel 50, Peer",{"$f":"AND(cha_fel>=50,COUNTIF(adv!A:A,\"Peer (Adeptus Arbites)\"))","v":false},{"$f":"AND(COUNTIF(adv!A:A,B293))","v":false},"NA"]
["Good Reputation (any)","Good Reputation (Adeptus Astra Telepathica)",0,"Talent","Fel 50, Peer",{"$f":"AND(cha_fel>=50,COUNTIF(adv!A:A,\"Peer (Adeptus Astra Telepathica)\"))","v":false},{"$f":"AND(COUNTIF(adv!A:A,B294))","v":false},"NA"]
["Good Reputation (any)","Good Reputation (Adeptus Astartes)",0,"Talent","Fel 50, Peer",{"$f":"AND(cha_fel>=50,COUNTIF(adv!A:A,\"Peer (Adeptus Astartes)\"))","v":false},{"$f":"AND(COUNTIF(adv!A:A,B295))","v":false},"NA"]
["Good Reputation (any)","Good Reputation (Adeptus Mechanicus)",0,"Talent","Fel 50, Peer",{"$f":"AND(cha_fel>=50,COUNTIF(adv!A:A,\"Peer (Adeptus Mechanicus)\"))","v":false},{"$f":"AND(COUNTIF(adv!A:A,B296))","v":false},"NA"]
["Good Reputation (any)","Good Reputation (Adepta Sororitas)",0,"Talent","Fel 50, Peer",{"$f":"AND(cha_fel>=50,COUNTIF(adv!A:A,\"Peer (Adepta Sororitas)\"))","v":false},{"$f":"AND(COUNTIF(adv!A:A,B297))","v":false},"NA"]
["Good Reputation (any)","Good Reputation (Adeptus Titanicus)",0,"Talent","Fel 50, Peer",{"$f":"AND(cha_fel>=50,COUNTIF(adv!A:A,\"Peer (Adeptus Titanicus)\"))","v":false},{"$f":"AND(COUNTIF(adv!A:A,B298))","v":false},"NA"]
["Good Reputation (any)","Good Reputation (Administratum)",0,"Talent","Fel 50, Peer",{"$f":"AND(cha_fel>=50,COUNTIF(adv!A:A,\"Peer (Administratum)\"))","v":false},{"$f":"AND(COUNTIF(adv!A:A,B299))","v":false},"NA"]
["Good Reputation (any)","Good Reputation (Astropaths)",0,"Talent","Fel 50, Peer",{"$f":"AND(cha_fel>=50,COUNTIF(adv!A:A,\"Peer (Astropaths)\"))","v":false},{"$f":"AND(COUNTIF(adv!A:A,B300))","v":false},"NA"]
["Good Reputation (any)","Good Reputation (Chartist Captains)",0,"Talent","Fel 50, Peer",{"$f":"AND(cha_fel>=50,COUNTIF(adv!A:A,\"Peer (Chartist Captains)\"))","v":false},{"$f":"AND(COUNTIF(adv!A:A,B301))","v":false},"NA"]
["Good Reputation (any)","Good Reputation (Ecclesiarchy)",0,"Talent","Fel 50, Peer",{"$f":"AND(cha_fel>=50,COUNTIF(adv!A:A,\"Peer (Ecclesiarchy)\"))","v":false},{"$f":"AND(COUNTIF(adv!A:A,B302))","v":false},"NA"]
["Good Reputation (any)","Good Reputation (Imperial Guard)",0,"Talent","Fel 50, Peer",{"$f":"AND(cha_fel>=50,COUNTIF(adv!A:A,\"Peer (Imperial Guard)\"))","v":false},{"$f":"AND(COUNTIF(adv!A:A,B303))","v":false},"NA"]
["Good Reputation (any)","Good Reputation (Imperial Navy)",0,"Talent","Fel 50, Peer",{"$f":"AND(cha_fel>=50,COUNTIF(adv!A:A,\"Peer (Imperial Navy)\"))","v":false},{"$f":"AND(COUNTIF(adv!A:A,B304))","v":false},"NA"]
["Good Reputation (any)","Good Reputation (Inquisition)",0,"Talent","Fel 50, Peer",{"$f":"AND(cha_fel>=50,COUNTIF(adv!A:A,\"Peer (Inquisition)\"))","v":false},{"$f":"AND(COUNTIF(adv!A:A,B305))","v":false},"NA"]
["Good Reputation (any)","Good Reputation (Navigators)",0,"Talent","Fel 50, Peer",{"$f":"AND(cha_fel>=50,COUNTIF(adv!A:A,\"Peer (Navigators)\"))","v":false},{"$f":"AND(COUNTIF(adv!A:A,B306))","v":false},"NA"]
["Good Reputation (any)","Good Reputation (Officio Assassinorum)",0,"Talent","Fel 50, Peer",{"$f":"AND(cha_fel>=50,COUNTIF(adv!A:A,\"Peer (Officio Assassinorum)\"))","v":false},{"$f":"AND(COUNTIF(adv!A:A,B307))","v":false},"NA"]
["Good Reputation (any)","Good Reputation (PDF)",0,"Talent","Fel 50, Peer",{"$f":"AND(cha_fel>=50,COUNTIF(adv!A:A,\"Peer (PDF)\"))","v":false},{"$f":"AND(COUNTIF(adv!A:A,B308))","v":false},"NA"]
["Good Reputation (any)","Good Reputation (Planetary Governors)",0,"Talent","Fel 50, Peer",{"$f":"AND(cha_fel>=50,COUNTIF(adv!A:A,\"Peer (Planetary Governors)\"))","v":false},{"$f":"AND(COUNTIF(adv!A:A,B309))","v":false},"NA"]
["Good Reputation (any)","Good Reputation (Rogue Trader)",0,"Talent","Fel 50, Peer",{"$f":"AND(cha_fel>=50,COUNTIF(adv!A:A,\"Peer (Rogue Trader)\"))","v":false},{"$f":"AND(COUNTIF(adv!A:A,B310))","v":false},"NA"]
["Good Reputation (any)","Good Reputation (Schola Progenium)",0,"Talent","Fel 50, Peer",{"$f":"AND(cha_fel>=50,COUNTIF(adv!A:A,\"Peer (Schola Progenium)\"))","v":false},{"$f":"AND(COUNTIF(adv!A:A,B311))","v":false},"NA"]
["Good Reputation (any)","Good Reputation (Scholastica Psykana)",0,"Talent","Fel 50, Peer",{"$f":"AND(cha_fel>=50,COUNTIF(adv!A:A,\"Peer (Scholastica Psykana)\"))","v":false},{"$f":"AND(COUNTIF(adv!A:A,B312))","v":false},"NA"]
["Hatred (any)","Hatred (Chaos Space Marines)",0,"Talent",null,true,{"$f":"AND(COUNTIF(adv!A:A,B313))","v":false},"NA"]
["Hatred (any)","Hatred (Daemons)",0,"Talent",null,true,{"$f":"AND(COUNTIF(adv!A:A,B314))","v":false},"NA"]
["Hatred (any)","Hatred (Dark Eldar)",0,"Talent",null,true,{"$f":"AND(COUNTIF(adv!A:A,B315))","v":false},"NA"]
["Hatred (any)","Hatred (Heretics)",0,"Talent",null,true,{"$f":"AND(COUNTIF(adv!A:A,B316))","v":false},"NA"]
["Hatred (any)","Hatred (Mutants)",0,"Talent",null,true,{"$f":"AND(COUNTIF(adv!A:A,B317))","v":false},"NA"]
["Hatred (any)","Hatred (Psykers)",0,"Talent",null,true,{"$f":"AND(COUNTIF(adv!A:A,B318))","v":false},"NA"]
["Hatred (any)","Hatred (Tyranids)",0,"Talent",null,true,{"$f":"AND(COUNTIF(adv!A:A,B319))","v":false},"NA"]
["Hatred (any)","Hatred (Orks)",0,"Talent",null,true,{"$f":"AND(COUNTIF(adv!A:A,B320))","v":false},"NA"]
["Hatred (any)","Hatred (Tau)",0,"Talent",null,true,{"$f":"AND(COUNTIF(adv!A:A,B321))","v":false},"NA"]
["Hatred (any)","Hatred (Eldar)",0,"Talent",null,true,{"$f":"AND(COUNTIF(adv!A:A,B322))","v":false},"NA"]
["Hatred (any)","Hatred (The Traitor Legions)",0,"Talent",null,true,{"$f":"AND(COUNTIF(adv!A:A,B323))","v":false},"NA"]
["Hatred (any)","Hatred (Word Bearers Traitor Legionnaires)",0,"Talent",null,true,{"$f":"AND(COUNTIF(adv!A:A,B324))","v":false},"NA"]
["Heavy Weapon Training (any)","Heavy Weapon Training (Bolt)",0,"Talent",null,true,{"$f":"AND(COUNTIF(adv!A:A,B325))","v":false},"NA"]
["Heavy Weapon Training (any)","Heavy Weapon Training (Las)",0,"Talent",null,true,{"$f":"AND(COUNTIF(adv!A:A,B326))","v":false},"NA"]
["Heavy Weapon Training (any)","Heavy Weapon Training (Launcher)",0,"Talent",null,true,{"$f":"AND(COUNTIF(adv!A:A,B327))","v":false},"NA"]
["Heavy Weapon Training (any)","Heavy Weapon Training (Melta)",0,"Talent",null,true,{"$f":"AND(COUNTIF(adv!A:A,B328))","v":false},"NA"]
["Heavy Weapon Training (any)","Heavy Weapon Training (Plasma)",0,"Talent",null,true,{"$f":"AND(COUNTIF(adv!A:A,B329))","v":false},"NA"]
["Heavy Weapon Training (any)","Heavy Weapon Training (Primitive)",0,"Talent",null,true,{"$f":"AND(COUNTIF(adv!A:A,B330))","v":false},"NA"]
["Heavy Weapon Training (any)","Heavy Weapon Training (SP)",0,"Talent",null,true,{"$f":"AND(COUNTIF(adv!A:A,B331))","v":false},"NA"]
["Heightened Senses (any)","Heightened Senses (Sight)",0,"Talent",null,true,{"$f":"AND(COUNTIF(adv!A:A,B332))","v":false},"NA"]
["Heightened Senses (any)","Heightened Senses (Sound)",0,"Talent",null,true,{"$f":"AND(COUNTIF(adv!A:A,B333))","v":false},"NA"]
["Heightened Senses (any)","Heightened Senses (Smell)",0,"Talent",null,true,{"$f":"AND(COUNTIF(adv!A:A,B334))","v":false},"NA"]
["Heightened Senses (any)","Heightened Senses (Taste)",0,"Talent",null,true,{"$f":"AND(COUNTIF(adv!A:A,B335))","v":false},"NA"]
["Heightened Senses (any)","Heightened Senses (Touch)",0,"Talent",null,true,{"$f":"AND(COUNTIF(adv!A:A,B336))","v":false},"NA"]
["Mechadendrite Use (any)","Mechadendrite Use (Servo-arm)",0,"Talent","Techmarine or Mechanicus Implants",{"$f":"AND(specialty=\"Deathwatch Techmarine\")","v":false},{"$f":"AND(COUNTIF(adv!A:A,B337))","v":false},"NA"]
["Mechadendrite Use (any)","Mechadendrite Use (Weapon)",0,"Talent","Techmarine or Mechanicus Implants",{"$f":"AND(specialty=\"Deathwatch Techmarine\")","v":false},{"$f":"AND(COUNTIF(adv!A:A,B338))","v":false},"NA"]
["Mechadendrite Use (any)","Mechadendrite Use (Utility)",0,"Talent","Techmarine or Mechanicus Implants",{"$f":"AND(specialty=\"Deathwatch Techmarine\")","v":false},{"$f":"AND(COUNTIF(adv!A:A,B339))","v":false},"NA"]
["Melee Weapon Training (any)","Melee Weapon Training (Chain)",0,"Talent",null,true,{"$f":"AND(COUNTIF(adv!A:A,B340))","v":false},"NA"]
["Melee Weapon Training (any)","Melee Weapon Training (Shock)",0,"Talent",null,true,{"$f":"AND(COUNTIF(adv!A:A,B341))","v":false},"NA"]
["Melee Weapon Training (any)","Melee Weapon Training (Power)",0,"Talent",null,true,{"$f":"AND(COUNTIF(adv!A:A,B342))","v":false},"NA"]
["Melee Weapon Training (any)","Melee Weapon Training (Primitive)",0,"Talent",null,true,{"$f":"AND(COUNTIF(adv!A:A,B343))","v":false},"NA"]
["Melee Weapon Training (any)","Melee Weapon Training (Universal)",0,"Talent",null,true,{"$f":"AND(COUNTIF(adv!A:A,B344))","v":false},"NA"]
["Peer (any)","Peer (Adeptus Arbites)",0,"Talent","Fel 30",{"$f":"AND(cha_fel>=30)","v":true},{"$f":"AND(COUNTIF(adv!A:A,B345))","v":false},"NA"]
["Peer (any)","Peer (Adeptus Astra Telepathica)",0,"Talent","Fel 30",true,{"$f":"AND(COUNTIF(adv!A:A,B346))","v":false},"NA"]
["Peer (any)","Peer (Adeptus Astartes)",0,"Talent","Fel 30",true,{"$f":"AND(COUNTIF(adv!A:A,B347))","v":false},"NA"]
["Peer (any)","Peer (Adeptus Mechanicus)",0,"Talent","Fel 30",true,{"$f":"AND(COUNTIF(adv!A:A,B348))","v":false},"NA"]
["Peer (any)","Peer (Adepta Sororitas)",0,"Talent","Fel 30",true,{"$f":"AND(COUNTIF(adv!A:A,B349))","v":false},"NA"]
["Peer (any)","Peer (Adeptus Titanicus)",0,"Talent","Fel 30",true,{"$f":"AND(COUNTIF(adv!A:A,B350))","v":false},"NA"]
["Peer (any)","Peer (Administratum)",0,"Talent","Fel 30",true,{"$f":"AND(COUNTIF(adv!A:A,B351))","v":false},"NA"]
["Peer (any)","Peer (Astropaths)",0,"Talent","Fel 30",true,{"$f":"AND(COUNTIF(adv!A:A,B352))","v":false},"NA"]
["Peer (any)","Peer (Chartist Captains)",0,"Talent","Fel 30",true,{"$f":"AND(COUNTIF(adv!A:A,B353))","v":false},"NA"]
["Peer (any)","Peer (Ecclesiarchy)",0,"Talent","Fel 30",true,{"$f":"AND(COUNTIF(adv!A:A,B354))","v":false},"NA"]
["Peer (any)","Peer (Imperial Guard)",0,"Talent","Fel 30",true,{"$f":"AND(COUNTIF(adv!A:A,B355))","v":false},"NA"]
["Peer (any)","Peer (Imperial Navy)",0,"Talent","Fel 30",true,{"$f":"AND(COUNTIF(adv!A:A,B356))","v":false},"NA"]
["Peer (any)","Peer (Inquisition)",0,"Talent","Fel 30",true,{"$f":"AND(COUNTIF(adv!A:A,B357))","v":false},"NA"]
["Peer (any)","Peer (Navigators)",0,"Talent","Fel 30",true,{"$f":"AND(COUNTIF(adv!A:A,B358))","v":false},"NA"]
["Peer (any)","Peer (Officio Assassinorum)",0,"Talent","Fel 30",true,{"$f":"AND(COUNTIF(adv!A:A,B359))","v":false},"NA"]
["Peer (any)","Peer (PDF)",0,"Talent","Fel 30",true,{"$f":"AND(COUNTIF(adv!A:A,B360))","v":false},"NA"]
["Peer (any)","Peer (Planetary Governors)",0,"Talent","Fel 30",true,{"$f":"AND(COUNTIF(adv!A:A,B361))","v":false},"NA"]
["Peer (any)","Peer (Rogue Trader)",0,"Talent","Fel 30",true,{"$f":"AND(COUNTIF(adv!A:A,B362))","v":false},"NA"]
["Peer (any)","Peer (Schola Progenium)",0,"Talent","Fel 30",true,{"$f":"AND(COUNTIF(adv!A:A,B363))","v":false},"NA"]
["Peer (any)","Peer (Scholastica Psykana)",0,"Talent","Fel 30",true,{"$f":"AND(COUNTIF(adv!A:A,B364))","v":false},"NA"]
["Peer (any)","Peer (Ultramarines)",0,"Talent","Fel 30",true,{"$f":"AND(COUNTIF(adv!A:A,B365))","v":false},"NA"]
["Pistol Weapon Training (any)","Pistol Weapon Training (Bolt)",0,"Talent",null,true,{"$f":"AND(COUNTIF(adv!A:A,B366))","v":false},"NA"]
["Pistol Weapon Training (any)","Pistol Weapon Training (Las)",0,"Talent",null,true,{"$f":"AND(COUNTIF(adv!A:A,B367))","v":false},"NA"]
["Pistol Weapon Training (any)","Pistol Weapon Training (Launcher)",0,"Talent",null,true,{"$f":"AND(COUNTIF(adv!A:A,B368))","v":false},"NA"]
["Pistol Weapon Training (any)","Pistol Weapon Training (Melta)",0,"Talent",null,true,{"$f":"AND(COUNTIF(adv!A:A,B369))","v":false},"NA"]
["Pistol Weapon Training (any)","Pistol Weapon Training (Plasma)",0,"Talent",null,true,{"$f":"AND(COUNTIF(adv!A:A,B370))","v":false},"NA"]
["Pistol Weapon Training (any)","Pistol Weapon Training (Primitive)",0,"Talent",null,true,{"$f":"AND(COUNTIF(adv!A:A,B371))","v":false},"NA"]
["Pistol Weapon Training (any)","Pistol Weapon Training (SP)",0,"Talent",null,true,{"$f":"AND(COUNTIF(adv!A:A,B372))","v":false},"NA"]
["Pistol Weapon Training (any)","Pistol Weapon Training (Universal)",0,"Talent",null,true,{"$f":"AND(COUNTIF(adv!A:A,B373))","v":false},"NA"]
["Psychic Power (any)","Psychic Technique (Alien Minds)",1500,"Talent","Epistolary",{"$f":"AND(advspec_epi)","v":false},{"$f":"AND(COUNTIF(adv!A:A,B374))","v":false},"NA"]
["Psychic Power (any)","Psychic Technique (Ancestors’ Rage)",500,"Talent","Storm Wardens",{"$f":"AND(chapter=\"Storm Wardens\")","v":false},{"$f":"AND(COUNTIF(adv!A:A,B375))","v":false},"NA"]
["Psychic Power (any)","Psychic Technique (Astrotelepathy)",500,"Talent","One or more Telepathic powers",{"$f":"AND(COUNTIF(adv!F:F,\"Psychic Power (any)\"))","v":false},{"$f":"AND(COUNTIF(adv!A:A,B376))","v":false},"NA"]
["Psychic Power (any)","Psychic Technique (Augury)",500,"Talent",null,true,{"$f":"AND(COUNTIF(adv!A:A,B377))","v":false},"NA"]
["Psychic Power (any)","Psychic Technique (Avenger)",500,"Talent",null,true,{"$f":"AND(COUNTIF(adv!A:A,B378))","v":false},"NA"]
["Psychic Power (any)","Psychic Technique (Blood Boil)",1500,"Talent","Blood Angels, Rank 3, WP 40+",{"$f":"AND(chapter=\"Blood Angels\",rank>=3,cha_wp>=40)","v":false},{"$f":"AND(COUNTIF(adv!A:A,B379))","v":false},"NA"]
["Psychic Power (any)","Psychic Technique (Blood Lance)",1000,"Talent","Blood Angels",{"$f":"AND(chapter=\"Blood Angels\")","v":false},{"$f":"AND(COUNTIF(adv!A:A,B380))","v":false},"NA"]
["Psychic Power (any)","Psychic Technique (Bond of Brotherhood)",1500,"Talent","Epistolary",{"$f":"AND(advspec_epi)","v":false},{"$f":"AND(COUNTIF(adv!A:A,B381))","v":false},"NA"]
["Psychic Power (any)","Psychic Technique (Call to Arms)",1500,"Talent","Storm Wardens, WP 50+",{"$f":"AND(chapter=\"Storm Wardens\",cha_wp>=50)","v":false},{"$f":"AND(COUNTIF(adv!A:A,B382))","v":false},"NA"]
["Psychic Power (any)","Psychic Technique (Compel)",1000,"Talent","WP 40+",{"$f":"AND(cha_wp>=40)","v":false},{"$f":"AND(COUNTIF(adv!A:A,B383))","v":false},"NA"]
["Psychic Power (any)","Psychic Technique (Crown of Lightning)",1000,"Talent","Storm Wardens",{"$f":"AND(chapter=\"Storm Wardens\")","v":false},{"$f":"AND(COUNTIF(adv!A:A,B384))","v":false},"NA"]
["Psychic Power (any)","Psychic Technique (Divination)",750,"Talent","WP 40+",{"$f":"AND(cha_wp>=40)","v":false},{"$f":"AND(COUNTIF(adv!A:A,B385))","v":false},"NA"]
["Psychic Power (any)","Psychic Technique (Dominate)",1000,"Talent","Compel, WP 50+",{"$f":"AND(COUNTIF(adv!A:A,\"Compel\"),cha_wp>=50)","v":false},{"$f":"AND(COUNTIF(adv!A:A,B386))","v":false},"NA"]
["Psychic Power (any)","Psychic Technique (Fear the Darkness)",1000,"Talent","Blood Angels, WP 40+",{"$f":"AND(chapter=\"Blood Angels\",cha_wp>=40)","v":false},{"$f":"AND(COUNTIF(adv!A:A,B387))","v":false},"NA"]
["Psychic Power (any)","Psychic Technique (Force Barrier)",1500,"Talent","Dark Angels, WP 40+",{"$f":"AND(chapter=\"Dark Angels\",cha_wp>=40)","v":false},{"$f":"AND(COUNTIF(adv!A:A,B388))","v":false},"NA"]
["Psychic Power (any)","Psychic Technique (Force Dome)",1500,"Talent","WP 40+",{"$f":"AND(cha_wp>=40)","v":false},{"$f":"AND(COUNTIF(adv!A:A,B389))","v":false},"NA"]
["Psychic Power (any)","Psychic Technique (Fury of the Ancients)",1000,"Talent","Ultramarines, WP 40+",{"$f":"AND(chapter=\"Ultramarines\",cha_wp>=40)","v":false},{"$f":"AND(COUNTIF(adv!A:A,B390))","v":false},"NA"]
["Psychic Power (any)","Psychic Technique (Fury of the Wolf Spirits)",2000,"Talent","Space Wolves, Rank 5, WP 40+",{"$f":"AND(chapter=\"Space Wolves\",rank>=5,cha_wp>=40)","v":false},{"$f":"AND(COUNTIF(adv!A:A,B391))","v":false},"NA"]
["Psychic Power (any)","Psychic Technique (Glory of the Emperor)",2000,"Talent","Ultramarines, Rank 5, WP 50+",{"$f":"AND(chapter=\"Ultramarines\",rank>=5,cha_wp>=50)","v":false},{"$f":"AND(COUNTIF(adv!A:A,B392))","v":false},"NA"]
["Psychic Power (any)","Psychic Technique (Hammer of the Emperor)",2000,"Talent","Storm Wardens, Rank 5, WP 60+",{"$f":"AND(chapter=\"Storm Wardens\",rank>=5,cha_wp>=60)","v":false},{"$f":"AND(COUNTIF(adv!A:A,B393))","v":false},"NA"]
["Psychic Power (any)","Psychic Technique (Hellfire)",1000,"Talent","Dark Angels, Rank 3, WP 40+",{"$f":"AND(chapter=\"Dark Angels\",rank>=3,cha_wp>=40)","v":false},{"$f":"AND(COUNTIF(adv!A:A,B394))","v":false},"NA"]
["Psychic Power (any)","Psychic Technique (Inspire)",500,"Talent",null,true,{"$f":"AND(COUNTIF(adv!A:A,B395))","v":false},"NA"]
["Psychic Power (any)","Psychic Technique (Inspiring Word)",1000,"Talent","Ultramarines",{"$f":"AND(chapter=\"Ultramarines\")","v":false},{"$f":"AND(COUNTIF(adv!A:A,B396))","v":false},"NA"]
["Psychic Power (any)","Psychic Technique (Into the Crucible)",1500,"Talent","Imperial Fists, Rank 3, WP 40+",{"$f":"AND(chapter=\"Imperial Fists\",rank>=3,cha_wp>=40)","v":false},{"$f":"AND(COUNTIF(adv!A:A,B397))","v":false},"NA"]
["Psychic Power (any)","Psychic Technique (Iron Arm)",500,"Talent",null,true,{"$f":"AND(COUNTIF(adv!A:A,B398))","v":false},"NA"]
["Psychic Power (any)","Psychic Technique (Lifting the Veil)",1000,"Talent","Psychometry, WP 40+",{"$f":"AND(COUNTIF(adv!A:A,\"Psychometry\"),cha_wp>=40)","v":false},{"$f":"AND(COUNTIF(adv!A:A,B399))","v":false},"NA"]
["Psychic Power (any)","Psychic Technique (Living Lightning)",1000,"Talent","Space Wolves, WP 40+",{"$f":"AND(chapter=\"Space Wolves\",cha_wp>=40)","v":false},{"$f":"AND(COUNTIF(adv!A:A,B400))","v":false},"NA"]
["Psychic Power (any)","Psychic Technique (Long-range Telepathy)",750,"Talent","WP 40+",{"$f":"AND(cha_wp>=40)","v":false},{"$f":"AND(COUNTIF(adv!A:A,B401))","v":false},"NA"]
["Psychic Power (any)","Psychic Technique (Machine Curse)",1000,"Talent","WP 45+",{"$f":"AND(cha_wp>=45)","v":false},{"$f":"AND(COUNTIF(adv!A:A,B402))","v":false},"NA"]
["Psychic Power (any)","Psychic Technique (Mark of Scorn)",500,"Talent","Storm Wardens",{"$f":"AND(chapter=\"Storm Wardens\")","v":false},{"$f":"AND(COUNTIF(adv!A:A,B403))","v":false},"NA"]
["Psychic Power (any)","Psychic Technique (Mask of Shadows)",1000,"Talent","Dark Angels, WP 50+",{"$f":"AND(chapter=\"Dark Angels\",cha_wp>=50)","v":false},{"$f":"AND(COUNTIF(adv!A:A,B404))","v":false},"NA"]
["Psychic Power (any)","Psychic Technique (Might of Heroes)",500,"Talent","Blood Angels",{"$f":"AND(chapter=\"Blood Angels\")","v":false},{"$f":"AND(COUNTIF(adv!A:A,B405))","v":false},"NA"]
["Psychic Power (any)","Psychic Technique (Might of the Ancients)",1000,"Talent",null,true,{"$f":"AND(COUNTIF(adv!A:A,B406))","v":false},"NA"]
["Psychic Power (any)","Psychic Technique (Mind Probe)",750,"Talent","Mind Scan",{"$f":"AND(COUNTIF(adv!A:A,\"Mind Scan\"))","v":false},{"$f":"AND(COUNTIF(adv!A:A,B407))","v":false},"NA"]
["Psychic Power (any)","Psychic Technique (Mind Scan)",500,"Talent","Long-range Telepathy",{"$f":"AND(COUNTIF(adv!A:A,\"Long-range Telepathy\"))","v":false},{"$f":"AND(COUNTIF(adv!A:A,B408))","v":false},"NA"]
["Psychic Power (any)","Psychic Technique (Mind Worm)",1500,"Talent","Dark Angels, Rank 5, WP 50+",{"$f":"AND(chapter=\"Dark Angels\",rank>=5,cha_wp>=50)","v":false},{"$f":"AND(COUNTIF(adv!A:A,B409))","v":false},"NA"]
["Psychic Power (any)","Psychic Technique (Noble Praetorian)",500,"Talent","Imperial Fists",{"$f":"AND(chapter=\"Imperial Fists\")","v":false},{"$f":"AND(COUNTIF(adv!A:A,B410))","v":false},"NA"]
["Psychic Power (any)","Psychic Technique (Paragon)",500,"Talent","Ultramarines",{"$f":"AND(chapter=\"Ultramarines\")","v":false},{"$f":"AND(COUNTIF(adv!A:A,B411))","v":false},"NA"]
["Psychic Power (any)","Psychic Technique (Possibility Shield)",1000,"Talent","WP 40+",{"$f":"AND(cha_wp>=40)","v":false},{"$f":"AND(COUNTIF(adv!A:A,B412))","v":false},"NA"]
["Psychic Power (any)","Psychic Technique (Psychometry)",500,"Talent","Augury",{"$f":"AND(COUNTIF(adv!A:A,\"Augury\")>0)","v":false},{"$f":"AND(COUNTIF(adv!A:A,B413))","v":false},"NA"]
["Psychic Power (any)","Psychic Technique (Reading)",500,"Talent",null,true,{"$f":"AND(COUNTIF(adv!A:A,B414))","v":false},"NA"]
["Psychic Power (any)","Psychic Technique (Shackle Soul)",1000,"Talent","Blood Angels, WP 50+",{"$f":"AND(chapter=\"Blood Angels\",cha_wp>=50)","v":false},{"$f":"AND(COUNTIF(adv!A:A,B415))","v":false},"NA"]
["Psychic Power (any)","Psychic Technique (Short-range Telepathy)",500,"Talent",null,true,{"$f":"AND(COUNTIF(adv!A:A,B416))","v":false},"NA"]
["Psychic Power (any)","Psychic Technique (Smite)",500,"Talent",null,true,{"$f":"AND(COUNTIF(adv!A:A,B417))","v":false},"NA"]
["Psychic Power (any)","Psychic Technique (Stonebane)",1000,"Talent","Imperial Fists",{"$f":"AND(chapter=\"Imperial Fists\")","v":false},{"$f":"AND(COUNTIF(adv!A:A,B418))","v":false},"NA"]
["Psychic Power (any)","Psychic Technique (Storm Caller)",500,"Talent","Space Wolves",{"$f":"AND(chapter=\"Space Wolves\")","v":false},{"$f":"AND(COUNTIF(adv!A:A,B419))","v":false},"NA"]
["Psychic Power (any)","Psychic Technique (Tempest’s Wrath)",1000,"Talent","Space Wolves, WP 50+",{"$f":"AND(chapter=\"Space Wolves\",cha_wp>=50)","v":false},{"$f":"AND(COUNTIF(adv!A:A,B420))","v":false},"NA"]
["Psychic Power (any)","Psychic Technique (The Gate of Infinity)",2000,"Talent","Rank 5, WP 50+",{"$f":"AND(rank>=5,cha_wp>=50)","v":false},{"$f":"AND(COUNTIF(adv!A:A,B421))","v":false},"NA"]
["Psychic Power (any)","Psychic Technique (The Golden Son)",2000,"Talent","Imperial Fists, Rank 5, WP 50+",{"$f":"AND(chapter=\"Imperial Fists\",rank>=5,cha_wp>=50)","v":false},{"$f":"AND(COUNTIF(adv!A:A,B422))","v":false},"NA"]
["Psychic Power (any)","Psychic Technique (Thunderclap)",500,"Talent","Space Wolves",{"$f":"AND(chapter=\"Space Wolves\")","v":false},{"$f":"AND(COUNTIF(adv!A:A,B423))","v":false},"NA"]
["Psychic Power (any)","Psychic Technique (Thunders Shell)",1500,"Talent","Storm Wardens, Rank 3, WP 40+",{"$f":"AND(chapter=\"Storm Wardens\",rank>=3,cha_wp>=40)","v":false},{"$f":"AND(COUNTIF(adv!A:A,B424))","v":false},"NA"]
["Psychic Power (any)","Psychic Technique (True Strike)",500,"Talent","Dark Angels",{"$f":"AND(chapter=\"Dark Angels\")","v":false},{"$f":"AND(COUNTIF(adv!A:A,B425))","v":false},"NA"]
["Psychic Power (any)","Psychic Technique (Ultimate Sacrifice)",1500,"Talent","Imperial Fists, Rank 3, WP 40+",{"$f":"AND(chapter=\"Imperial Fists\",rank>=3,cha_wp>=40)","v":false},{"$f":"AND(COUNTIF(adv!A:A,B426))","v":false},"NA"]
["Psychic Power (any)","Psychic Technique (Veil of Time)",1500,"Talent","Rank 3, WP 40+",{"$f":"AND(rank>=3,cha_wp>=40)","v":false},{"$f":"AND(COUNTIF(adv!A:A,B427))","v":false},"NA"]
["Psychic Power (any)","Psychic Technique (Vortex of Doom)",2000,"Talent","Rank 5, WP 50+",{"$f":"AND(rank>=5,cha_wp>=50)","v":false},{"$f":"AND(COUNTIF(adv!A:A,B428))","v":false},"NA"]
["Psychic Power (any)","Psychic Technique (War Cry)",750,"Talent","Ultramarines, WP 40+",{"$f":"AND(chapter=\"Ultramarines\",cha_wp>=40)","v":false},{"$f":"AND(COUNTIF(adv!A:A,B429))","v":false},"NA"]
["Psychic Power (any)","Psychic Technique (Wave of Penance)",1500,"Talent","Imperial Fists, Rank 3, WP 40+",{"$f":"AND(chapter=\"Imperial Fists\",rank>=3,cha_wp>=40)","v":false},{"$f":"AND(COUNTIF(adv!A:A,B430))","v":false},"NA"]
["Psychic Power (any)","Psychic Technique (Weaken Resolve)",500,"Talent","Dark Angels",{"$f":"AND(chapter=\"Dark Angels\")","v":false},{"$f":"AND(COUNTIF(adv!A:A,B431))","v":false},"NA"]
["Psychic Power (any)","Psychic Technique (Wings of Sanguinius)",2000,"Talent","Blood Angels, Rank 5, WP 50+",{"$f":"AND(chapter=\"Blood Angels\",rank>=5,cha_wp>=50)","v":false},{"$f":"AND(COUNTIF(adv!A:A,B432))","v":false},"NA"]
["Psychic Power (any)","Psychic Technique (Word of the Emperor)",1500,"Talent","Ultramarines, Rank 3, WP 50+",{"$f":"AND(chapter=\"Ultrmarines\",rank>=3,cha_wp>=50)","v":false},{"$f":"AND(COUNTIF(adv!A:A,B433))","v":false},"NA"]
["Psychic Power (any)","Psychic Technique (Deus Ex Ferrum)",1000,"Talent","Iron Hands, WP 40+",{"$f":"AND(chapter=\"Iron Hands\",cha_wp>=40)","v":false},{"$f":"AND(COUNTIF(adv!A:A,B434))","v":false},"NA"]
["Psychic Power (any)","Psychic Technique (Betrayal of the Flesh)",500,"Talent","Iron Hands",{"$f":"AND(chapter=\"Iron Hands\")","v":false},{"$f":"AND(COUNTIF(adv!A:A,B435))","v":false},"NA"]
["Psychic Power (any)","Psychic Technique (Punish the Weak)",1000,"Talent","Iron Hands, WP 50+",{"$f":"AND(chapter=\"Iron Hands\",cha_wp>=50)","v":false},{"$f":"AND(COUNTIF(adv!A:A,B436))","v":false},"NA"]
["Psychic Power (any)","Psychic Technique (Corax's Ingenuity)",1000,"Talent","Raven Guard, WP 40+",{"$f":"AND(chapter=\"Raven Guard\",cha_wp>=40)","v":false},{"$f":"AND(COUNTIF(adv!A:A,B437))","v":false},"NA"]
["Psychic Power (any)","Psychic Technique (Curse of the Raven)",500,"Talent","Raven Guard",{"$f":"AND(chapter=\"Raven Guard\")","v":false},{"$f":"AND(COUNTIF(adv!A:A,B438))","v":false},"NA"]
["Psychic Power (any)","Psychic Technique (The Unkindness of Deliverance)",1000,"Talent","Raven Guard, WP 50+",{"$f":"AND(chapter=\"Raven Guard\",cha_wp>=50)","v":false},{"$f":"AND(COUNTIF(adv!A:A,B439))","v":false},"NA"]
["Psychic Power (any)","Psychic Technique (Fury of the Salamander)",1000,"Talent","Salamanders, WP 40+",{"$f":"AND(chapter=\"Salamanders\",cha_wp>=50)","v":false},{"$f":"AND(COUNTIF(adv!A:A,B440))","v":false},"NA"]
["Psychic Power (any)","Psychic Technique (Heat of the Furnace)",500,"Talent","Salamanders",{"$f":"AND(chapter=\"Salamanders\")","v":false},{"$f":"AND(COUNTIF(adv!A:A,B441))","v":false},"NA"]
["Psychic Power (any)","Psychic Technique (Nocturne's Fire)",2500,"Talent","Salamanders, Rank 5, WP 50+",{"$f":"AND(chapter=\"Salamanders\",rank>=5,cha_wp>=50)","v":false},{"$f":"AND(COUNTIF(adv!A:A,B442))","v":false},"NA"]
["Psychic Power (any)","Psychic Technique (Vulkan's Anvil)",1500,"Talent","Salamanders, Rank 3, WP 45+",{"$f":"AND(chapter=\"Salamanders\",rank>=3,cha_wp>=45)","v":false},{"$f":"AND(COUNTIF(adv!A:A,B443))","v":false},"NA"]
["Psychic Power (any)","Psychic Technique (Heart of the Khan)",1500,"Talent","White Scars, Rank 3, WP 50+",{"$f":"AND(chapter=\"White Scars\",rank=3,cha_wp>=50)","v":false},{"$f":"AND(COUNTIF(adv!A:A,B444))","v":false},"NA"]
["Psychic Power (any)","Psychic Technique (Spirits of the Steppes)",2000,"Talent","White Scars, Rank 3, WP 50+",{"$f":"AND(chapter=\"White Scars\",rank=3,cha_wp>=50)","v":false},{"$f":"AND(COUNTIF(adv!A:A,B445))","v":false},"NA"]
["Psychic Power (any)","Psychic Technique (Stormlance)",1000,"Talent","White Scars, WP 40+",{"$f":"AND(chapter=\"White Scars\",cha_wp>=40)","v":false},{"$f":"AND(COUNTIF(adv!A:A,B446))","v":false},"NA"]
["Psychic Power (any)","Psychic Technique (The Howling Wind)",500,"Talent","White Scars",{"$f":"AND(chapter=\"White Scars\")","v":false},{"$f":"AND(COUNTIF(adv!A:A,B447))","v":false},"NA"]
["Resistance (any)","Resistance (Psychic Powers)",0,"Talent",null,true,{"$f":"AND(COUNTIF(adv!A:A,B448))","v":false},"NA"]
["Rival (any)","Rival (Adeptus Arbites)",0,"Talent",null,true,{"$f":"AND(COUNTIF(adv!A:A,B449))","v":false},"NA"]
["Rival (any)","Rival (Adeptus Astra Telepathica)",0,"Talent",null,true,{"$f":"AND(COUNTIF(adv!A:A,B450))","v":false},"NA"]
["Rival (any)","Rival (Adeptus Astartes)",0,"Talent",null,true,{"$f":"AND(COUNTIF(adv!A:A,B451))","v":false},"NA"]
["Rival (any)","Rival (Adeptus Mechanicus)",0,"Talent",null,true,{"$f":"AND(COUNTIF(adv!A:A,B452))","v":false},"NA"]
["Rival (any)","Rival (Adepta Sororitas)",0,"Talent",null,true,{"$f":"AND(COUNTIF(adv!A:A,B453))","v":false},"NA"]
["Rival (any)","Rival (Adeptus Titanicus)",0,"Talent",null,true,{"$f":"AND(COUNTIF(adv!A:A,B454))","v":false},"NA"]
["Rival (any)","Rival (Administratum)",0,"Talent",null,true,{"$f":"AND(COUNTIF(adv!A:A,B455))","v":false},"NA"]
["Rival (any)","Rival (Astropaths)",0,"Talent",null,true,{"$f":"AND(COUNTIF(adv!A:A,B456))","v":false},"NA"]
["Rival (any)","Rival (Chartist Captains)",0,"Talent",null,true,{"$f":"AND(COUNTIF(adv!A:A,B457))","v":false},"NA"]
["Rival (any)","Rival (Ecclesiarchy)",0,"Talent",null,true,{"$f":"AND(COUNTIF(adv!A:A,B458))","v":false},"NA"]
["Rival (any)","Rival (Imperial Guard)",0,"Talent",null,true,{"$f":"AND(COUNTIF(adv!A:A,B459))","v":false},"NA"]
["Rival (any)","Rival (Imperial Navy)",0,"Talent",null,true,{"$f":"AND(COUNTIF(adv!A:A,B460))","v":false},"NA"]
["Rival (any)","Rival (Inquisition)",0,"Talent",null,true,{"$f":"AND(COUNTIF(adv!A:A,B461))","v":false},"NA"]
["Rival (any)","Rival (Navigators)",0,"Talent",null,true,{"$f":"AND(COUNTIF(adv!A:A,B462))","v":false},"NA"]
["Rival (any)","Rival (Officio Assassinorum)",0,"Talent",null,true,{"$f":"AND(COUNTIF(adv!A:A,B463))","v":false},"NA"]
["Rival (any)","Rival (PDF)",0,"Talent",null,true,{"$f":"AND(COUNTIF(adv!A:A,B464))","v":false},"NA"]
["Rival (any)","Rival (Planetary Governors)",0,"Talent",null,true,{"$f":"AND(COUNTIF(adv!A:A,B465))","v":false},"NA"]
["Rival (any)","Rival (Rogue Trader)",0,"Talent",null,true,{"$f":"AND(COUNTIF(adv!A:A,B466))","v":false},"NA"]
["Rival (any)","Rival (Schola Progenium)",0,"Talent",null,true,{"$f":"AND(COUNTIF(adv!A:A,B467))","v":false},"NA"]
["Rival (any)","Rival (Scholastica Psykana)",0,"Talent",null,true,{"$f":"AND(COUNTIF(adv!A:A,B468))","v":false},"NA"]
["Signature Wargear: Hero (any)","Signature Wargear: Hero (Weapon)",0,"Talent",null,true,{"$f":"AND(COUNTIF(adv!A:A,B469))","v":false},"NA"]
["Signature Wargear: Hero (any)","Signature Wargear: Hero (Armour)",0,"Talent",null,true,{"$f":"AND(COUNTIF(adv!A:A,B470))","v":false},"NA"]
["Signature Wargear: Hero (any)","Signature Wargear: Hero (Artificer Armour)",0,"Talent",null,true,{"$f":"AND(COUNTIF(adv!A:A,B471))","v":false},"NA"]
["Signature Wargear: Hero (any)","Signature Wargear: Hero (Relic)",0,"Talent",null,true,{"$f":"AND(COUNTIF(adv!A:A,B472))","v":false},"NA"]
["Signature Wargear: Hero (any)","Signature Wargear: Hero (Wargear)",0,"Talent",null,true,{"$f":"AND(COUNTIF(adv!A:A,B473))","v":false},"NA"]
["Talented (any)","Talented (Acrobatics)",0,"Talent",null,true,{"$f":"AND(COUNTIF(adv!A:A,B474))","v":false},"NA"]
["Talented (any)","Talented (Awareness)",0,"Talent",null,true,{"$f":"AND(COUNTIF(adv!A:A,B475))","v":false},"NA"]
["Talented (any)","Talented (Barter)",0,"Talent",null,true,{"$f":"AND(COUNTIF(adv!A:A,B476))","v":false},"NA"]
["Talented (any)","Talented (Blather)",0,"Talent",null,true,{"$f":"AND(COUNTIF(adv!A:A,B477))","v":false},"NA"]
["Talented (any)","Talented (Carouse)",0,"Talent",null,true,{"$f":"AND(COUNTIF(adv!A:A,B478))","v":false},"NA"]
["Talented (any)","Talented (Charm)",0,"Talent",null,true,{"$f":"AND(COUNTIF(adv!A:A,B479))","v":false},"NA"]
["Talented (any)","Talented (Chem-Use)",0,"Talent",null,true,{"$f":"AND(COUNTIF(adv!A:A,B480))","v":false},"NA"]
["Talented (any)","Talented (Ciphers (Xenos Markings))",0,"Talent",null,true,{"$f":"AND(COUNTIF(adv!A:A,B481))","v":false},"NA"]
["Talented (any)","Talented (Ciphers (Deathwatch))",0,"Talent",null,true,{"$f":"AND(COUNTIF(adv!A:A,B482))","v":false},"NA"]
["Talented (any)","Talented (Ciphers (Chapter Runes))",0,"Talent",null,true,{"$f":"AND(COUNTIF(adv!A:A,B483))","v":false},"NA"]
["Talented (any)","Talented (Ciphers (Imperial Codes))",0,"Talent",null,true,{"$f":"AND(COUNTIF(adv!A:A,B484))","v":false},"NA"]
["Talented (any)","Talented (Ciphers (Inquisition))",0,"Talent",null,true,{"$f":"AND(COUNTIF(adv!A:A,B485))","v":false},"NA"]
["Talented (any)","Talented (Ciphers (Mercenary Cant))",0,"Talent",null,true,{"$f":"AND(COUNTIF(adv!A:A,B486))","v":false},"NA"]
["Talented (any)","Talented (Ciphers (Underworld))",0,"Talent",null,true,{"$f":"AND(COUNTIF(adv!A:A,B487))","v":false},"NA"]
["Talented (any)","Talented (Climb)",0,"Talent",null,true,{"$f":"AND(COUNTIF(adv!A:A,B488))","v":false},"NA"]
["Talented (any)","Talented (Command)",0,"Talent",null,true,{"$f":"AND(COUNTIF(adv!A:A,B489))","v":false},"NA"]
["Talented (any)","Talented (Concealment)",0,"Talent",null,true,{"$f":"AND(COUNTIF(adv!A:A,B490))","v":false},"NA"]
["Talented (any)","Talented (Contortionist)",0,"Talent",null,true,{"$f":"AND(COUNTIF(adv!A:A,B491))","v":false},"NA"]
["Talented (any)","Talented (Decieve)",0,"Talent",null,true,{"$f":"AND(COUNTIF(adv!A:A,B492))","v":false},"NA"]
["Talented (any)","Talented (Demonlition)",0,"Talent",null,true,{"$f":"AND(COUNTIF(adv!A:A,B493))","v":false},"NA"]
["Talented (any)","Talented (Disguise)",0,"Talent",null,true,{"$f":"AND(COUNTIF(adv!A:A,B494))","v":false},"NA"]
["Talented (any)","Talented (Dodge)",0,"Talent",null,true,{"$f":"AND(COUNTIF(adv!A:A,B495))","v":false},"NA"]
["Talented (any)","Talented (Drive (Ground Vehicles))",0,"Talent",null,true,{"$f":"AND(COUNTIF(adv!A:A,B496))","v":false},"NA"]
["Talented (any)","Talented (Drive (Skimmer/Hover))",0,"Talent",null,true,{"$f":"AND(COUNTIF(adv!A:A,B497))","v":false},"NA"]
["Talented (any)","Talented (Drive (Walker))",0,"Talent",null,true,{"$f":"AND(COUNTIF(adv!A:A,B498))","v":false},"NA"]
["Talented (any)","Talented (Evaluate)",0,"Talent",null,true,{"$f":"AND(COUNTIF(adv!A:A,B499))","v":false},"NA"]
["Talented (any)","Talented (Gamble)",0,"Talent",null,true,{"$f":"AND(COUNTIF(adv!A:A,B500))","v":false},"NA"]
["Talented (any)","Talented (Inquiry)",0,"Talent",null,true,{"$f":"AND(COUNTIF(adv!A:A,B501))","v":false},"NA"]
["Talented (any)","Talented (Interrogation)",0,"Talent",null,true,{"$f":"AND(COUNTIF(adv!A:A,B502))","v":false},"NA"]
["Talented (any)","Talented (Intimidate)",0,"Talent",null,true,{"$f":"AND(COUNTIF(adv!A:A,B503))","v":false},"NA"]
["Talented (any)","Talented (Invocation)",0,"Talent",null,true,{"$f":"AND(COUNTIF(adv!A:A,B504))","v":false},"NA"]
["Talented (any)","Talented (Lip Reading)",0,"Talent",null,true,{"$f":"AND(COUNTIF(adv!A:A,B505))","v":false},"NA"]
["Talented (any)","Talented (Literacy)",0,"Talent",null,true,{"$f":"AND(COUNTIF(adv!A:A,B506))","v":false},"NA"]
["Talented (any)","Talented (Logic)",0,"Talent",null,true,{"$f":"AND(COUNTIF(adv!A:A,B507))","v":false},"NA"]
["Talented (any)","Talented (Lore: Common (Adeptus Arbites))",0,"Talent",null,true,{"$f":"AND(COUNTIF(adv!A:A,B508))","v":false},"NA"]
["Talented (any)","Talented (Lore: Common (Adeptus Astartes))",0,"Talent",null,true,{"$f":"AND(COUNTIF(adv!A:A,B509))","v":false},"NA"]
["Talented (any)","Talented (Lore: Common (Adeptus Mechanicus))",0,"Talent",null,true,{"$f":"AND(COUNTIF(adv!A:A,B510))","v":false},"NA"]
["Talented (any)","Talented (Lore: Common (Administratum))",0,"Talent",null,true,{"$f":"AND(COUNTIF(adv!A:A,B511))","v":false},"NA"]
["Talented (any)","Talented (Lore: Common (Deathwatch))",0,"Talent",null,true,{"$f":"AND(COUNTIF(adv!A:A,B512))","v":false},"NA"]
["Talented (any)","Talented (Lore: Common (Ecclesiarchy))",0,"Talent",null,true,{"$f":"AND(COUNTIF(adv!A:A,B513))","v":false},"NA"]
["Talented (any)","Talented (Lore: Common (Imperial Creed))",0,"Talent",null,true,{"$f":"AND(COUNTIF(adv!A:A,B514))","v":false},"NA"]
["Talented (any)","Talented (Lore: Common (Imperial Guard))",0,"Talent",null,true,{"$f":"AND(COUNTIF(adv!A:A,B515))","v":false},"NA"]
["Talented (any)","Talented (Lore: Common (Imperial Navy))",0,"Talent",null,true,{"$f":"AND(COUNTIF(adv!A:A,B516))","v":false},"NA"]
["Talented (any)","Talented (Lore: Common (Imperium))",0,"Talent",null,true,{"$f":"AND(COUNTIF(adv!A:A,B517))","v":false},"NA"]
["Talented (any)","Talented (Lore: Common (Jericho Reach))",0,"Talent",null,true,{"$f":"AND(COUNTIF(adv!A:A,B518))","v":false},"NA"]
["Talented (any)","Talented (Lore: Common (Tech))",0,"Talent",null,true,{"$f":"AND(COUNTIF(adv!A:A,B519))","v":false},"NA"]
["Talented (any)","Talented (Lore: Common (War))",0,"Talent",null,true,{"$f":"AND(COUNTIF(adv!A:A,B520))","v":false},"NA"]
["Talented (any)","Talented (Lore: Forbidden (Adeptus Astartes))",0,"Talent",null,true,{"$f":"AND(COUNTIF(adv!A:A,B521))","v":false},"NA"]
["Talented (any)","Talented (Lore: Forbidden (Adeptus Mechanicus))",0,"Talent",null,true,{"$f":"AND(COUNTIF(adv!A:A,B522))","v":false},"NA"]
["Talented (any)","Talented (Lore: Forbidden (Archeotech))",0,"Talent",null,true,{"$f":"AND(COUNTIF(adv!A:A,B523))","v":false},"NA"]
["Talented (any)","Talented (Lore: Forbidden (The Black Library))",0,"Talent",null,true,{"$f":"AND(COUNTIF(adv!A:A,B524))","v":false},"NA"]
["Talented (any)","Talented (Lore: Forbidden (Daemonology))",0,"Talent",null,true,{"$f":"AND(COUNTIF(adv!A:A,B525))","v":false},"NA"]
["Talented (any)","Talented (Lore: Forbidden (Heresy))",0,"Talent",null,true,{"$f":"AND(COUNTIF(adv!A:A,B526))","v":false},"NA"]
["Talented (any)","Talented (Lore: Forbidden (The Inquisition))",0,"Talent",null,true,{"$f":"AND(COUNTIF(adv!A:A,B527))","v":false},"NA"]
["Talented (any)","Talented (Lore: Forbidden (Mutants))",0,"Talent",null,true,{"$f":"AND(COUNTIF(adv!A:A,B528))","v":false},"NA"]
["Talented (any)","Talented (Lore: Forbidden (Psykers))",0,"Talent",null,true,{"$f":"AND(COUNTIF(adv!A:A,B529))","v":false},"NA"]
["Talented (any)","Talented (Lore: Forbidden (The Traitor Legions))",0,"Talent",null,true,{"$f":"AND(COUNTIF(adv!A:A,B530))","v":false},"NA"]
["Talented (any)","Talented (Lore: Forbidden (The Warp))",0,"Talent",null,true,{"$f":"AND(COUNTIF(adv!A:A,B531))","v":false},"NA"]
["Talented (any)","Talented (Lore: Forbidden (Xenos))",0,"Talent",null,true,{"$f":"AND(COUNTIF(adv!A:A,B532))","v":false},"NA"]
["Talented (any)","Talented (Lore: Scolastic (Archaic))",0,"Talent",null,true,{"$f":"AND(COUNTIF(adv!A:A,B533))","v":false},"NA"]
["Talented (any)","Talented (Lore: Scolastic (Astromancy))",0,"Talent",null,true,{"$f":"AND(COUNTIF(adv!A:A,B534))","v":false},"NA"]
["Talented (any)","Talented (Lore: Scolastic (Beasts))",0,"Talent",null,true,{"$f":"AND(COUNTIF(adv!A:A,B535))","v":false},"NA"]
["Talented (any)","Talented (Lore: Scolastic (Bureaucracy))",0,"Talent",null,true,{"$f":"AND(COUNTIF(adv!A:A,B536))","v":false},"NA"]
["Talented (any)","Talented (Lore: Scolastic (Chymistry))",0,"Talent",null,true,{"$f":"AND(COUNTIF(adv!A:A,B537))","v":false},"NA"]
["Talented (any)","Talented (Lore: Scolastic (Codex Astartes))",0,"Talent",null,true,{"$f":"AND(COUNTIF(adv!A:A,B538))","v":false},"NA"]
["Talented (any)","Talented (Lore: Scolastic (Cryptology))",0,"Talent",null,true,{"$f":"AND(COUNTIF(adv!A:A,B539))","v":false},"NA"]
["Talented (any)","Talented (Lore: Scolastic (Heraldry))",0,"Talent",null,true,{"$f":"AND(COUNTIF(adv!A:A,B540))","v":false},"NA"]
["Talented (any)","Talented (Lore: Scolastic (Imperial Creed))",0,"Talent",null,true,{"$f":"AND(COUNTIF(adv!A:A,B541))","v":false},"NA"]
["Talented (any)","Talented (Lore: Scolastic (Judgement))",0,"Talent",null,true,{"$f":"AND(COUNTIF(adv!A:A,B542))","v":false},"NA"]
["Talented (any)","Talented (Lore: Scolastic (Legend))",0,"Talent",null,true,{"$f":"AND(COUNTIF(adv!A:A,B543))","v":false},"NA"]
["Talented (any)","Talented (Lore: Scolastic (Numerology))",0,"Talent",null,true,{"$f":"AND(COUNTIF(adv!A:A,B544))","v":false},"NA"]
["Talented (any)","Talented (Lore: Scolastic (Occult))",0,"Talent",null,true,{"$f":"AND(COUNTIF(adv!A:A,B545))","v":false},"NA"]
["Talented (any)","Talented (Lore: Scolastic (Philosophy))",0,"Talent",null,true,{"$f":"AND(COUNTIF(adv!A:A,B546))","v":false},"NA"]
["Talented (any)","Talented (Lore: Scolastic (Tactica Imperialis))",0,"Talent",null,true,{"$f":"AND(COUNTIF(adv!A:A,B547))","v":false},"NA"]
["Talented (any)","Talented (Medicae)",0,"Talent",null,true,{"$f":"AND(COUNTIF(adv!A:A,B548))","v":false},"NA"]
["Talented (any)","Talented (Navigation (Surface))",0,"Talent",null,true,{"$f":"AND(COUNTIF(adv!A:A,B549))","v":false},"NA"]
["Talented (any)","Talented (Navigation (Stellar))",0,"Talent",null,true,{"$f":"AND(COUNTIF(adv!A:A,B550))","v":false},"NA"]
["Talented (any)","Talented (Performer (Dancer))",0,"Talent",null,true,{"$f":"AND(COUNTIF(adv!A:A,B551))","v":false},"NA"]
["Talented (any)","Talented (Performer (Musician))",0,"Talent",null,true,{"$f":"AND(COUNTIF(adv!A:A,B552))","v":false},"NA"]
["Talented (any)","Talented (Performer (Singer))",0,"Talent",null,true,{"$f":"AND(COUNTIF(adv!A:A,B553))","v":false},"NA"]
["Talented (any)","Talented (Performer (Storyteller))",0,"Talent",null,true,{"$f":"AND(COUNTIF(adv!A:A,B554))","v":false},"NA"]
["Talented (any)","Talented (Pilot (Personal))",0,"Talent",null,true,{"$f":"AND(COUNTIF(adv!A:A,B555))","v":false},"NA"]
["Talented (any)","Talented (Pilot (Flyers))",0,"Talent",null,true,{"$f":"AND(COUNTIF(adv!A:A,B556))","v":false},"NA"]
["Talented (any)","Talented (Pilot (Spacecraft))",0,"Talent",null,true,{"$f":"AND(COUNTIF(adv!A:A,B557))","v":false},"NA"]
["Talented (any)","Talented (Psyniscience)",0,"Talent",null,true,{"$f":"AND(COUNTIF(adv!A:A,B558))","v":false},"NA"]
["Talented (any)","Talented (Scrutiny)",0,"Talent",null,true,{"$f":"AND(COUNTIF(adv!A:A,B559))","v":false},"NA"]
["Talented (any)","Talented (Search)",0,"Talent",null,true,{"$f":"AND(COUNTIF(adv!A:A,B560))","v":false},"NA"]
["Talented (any)","Talented (Secret Tongue)",0,"Talent",null,true,{"$f":"AND(COUNTIF(adv!A:A,B561))","v":false},"NA"]
["Talented (any)","Talented (Security)",0,"Talent",null,true,{"$f":"AND(COUNTIF(adv!A:A,B562))","v":false},"NA"]
["Talented (any)","Talented (Shadowing)",0,"Talent",null,true,{"$f":"AND(COUNTIF(adv!A:A,B563))","v":false},"NA"]
["Talented (any)","Talented (Silent Move)",0,"Talent",null,true,{"$f":"AND(COUNTIF(adv!A:A,B564))","v":false},"NA"]
["Talented (any)","Talented (Sleight of Hand)",0,"Talent",null,true,{"$f":"AND(COUNTIF(adv!A:A,B565))","v":false},"NA"]
["Talented (any)","Talented (Speak Language (Eldar))",0,"Talent",null,true,{"$f":"AND(COUNTIF(adv!A:A,B566))","v":false},"NA"]
["Talented (any)","Talented (Speak Language (High Gothic))",0,"Talent",null,true,{"$f":"AND(COUNTIF(adv!A:A,B567))","v":false},"NA"]
["Talented (any)","Talented (Speak Language (Kroot))",0,"Talent",null,true,{"$f":"AND(COUNTIF(adv!A:A,B568))","v":false},"NA"]
["Talented (any)","Talented (Speak Language (Low Gothic))",0,"Talent",null,true,{"$f":"AND(COUNTIF(adv!A:A,B569))","v":false},"NA"]
["Talented (any)","Talented (Speak Language (Ork))",0,"Talent",null,true,{"$f":"AND(COUNTIF(adv!A:A,B570))","v":false},"NA"]
["Talented (any)","Talented (Speak Language (Techna-Lingua))",0,"Talent",null,true,{"$f":"AND(COUNTIF(adv!A:A,B571))","v":false},"NA"]
["Talented (any)","Talented (Speak Language (Tau))",0,"Talent",null,true,{"$f":"AND(COUNTIF(adv!A:A,B572))","v":false},"NA"]
["Talented (any)","Talented (Survival)",0,"Talent",null,true,{"$f":"AND(COUNTIF(adv!A:A,B573))","v":false},"NA"]
["Talented (any)","Talented (Swim)",0,"Talent",null,true,{"$f":"AND(COUNTIF(adv!A:A,B574))","v":false},"NA"]
["Talented (any)","Talented (Tactics (Air Combat))",0,"Talent",null,true,{"$f":"AND(COUNTIF(adv!A:A,B575))","v":false},"NA"]
["Talented (any)","Talented (Tactics (Armoured Tactics))",0,"Talent",null,true,{"$f":"AND(COUNTIF(adv!A:A,B576))","v":false},"NA"]
["Talented (any)","Talented (Tactics (Assault Doctrine))",0,"Talent",null,true,{"$f":"AND(COUNTIF(adv!A:A,B577))","v":false},"NA"]
["Talented (any)","Talented (Tactics (Defensive Doctrine))",0,"Talent",null,true,{"$f":"AND(COUNTIF(adv!A:A,B578))","v":false},"NA"]
["Talented (any)","Talented (Tactics (Orbital Drop Procedures))",0,"Talent",null,true,{"$f":"AND(COUNTIF(adv!A:A,B579))","v":false},"NA"]
["Talented (any)","Talented (Tactics (Recon and Stealth))",0,"Talent",null,true,{"$f":"AND(COUNTIF(adv!A:A,B580))","v":false},"NA"]
["Talented (any)","Talented (Tactics (Void Combat))",0,"Talent",null,true,{"$f":"AND(COUNTIF(adv!A:A,B581))","v":false},"NA"]
["Talented (any)","Talented (Tech-Use)",0,"Talent",null,true,{"$f":"AND(COUNTIF(adv!A:A,B582))","v":false},"NA"]
["Talented (any)","Talented (Tracking)",0,"Talent",null,true,{"$f":"AND(COUNTIF(adv!A:A,B583))","v":false},"NA"]
["Talented (any)","Talented (Trade (Archeologist))",0,"Talent",null,true,{"$f":"AND(COUNTIF(adv!A:A,B584))","v":false},"NA"]
["Talented (any)","Talented (Trade (Armourer))",0,"Talent",null,true,{"$f":"AND(COUNTIF(adv!A:A,B585))","v":false},"NA"]
["Talented (any)","Talented (Trade (Artisan))",0,"Talent",null,true,{"$f":"AND(COUNTIF(adv!A:A,B586))","v":false},"NA"]
["Talented (any)","Talented (Trade (Astrographer))",0,"Talent",null,true,{"$f":"AND(COUNTIF(adv!A:A,B587))","v":false},"NA"]
["Talented (any)","Talented (Trade (Chymist))",0,"Talent",null,true,{"$f":"AND(COUNTIF(adv!A:A,B588))","v":false},"NA"]
["Talented (any)","Talented (Trade (Cryptographer))",0,"Talent",null,true,{"$f":"AND(COUNTIF(adv!A:A,B589))","v":false},"NA"]
["Talented (any)","Talented (Trade (Explorator))",0,"Talent",null,true,{"$f":"AND(COUNTIF(adv!A:A,B590))","v":false},"NA"]
["Talented (any)","Talented (Trade (Linguist))",0,"Talent",null,true,{"$f":"AND(COUNTIF(adv!A:A,B591))","v":false},"NA"]
["Talented (any)","Talented (Trade (Remembrancer))",0,"Talent",null,true,{"$f":"AND(COUNTIF(adv!A:A,B592))","v":false},"NA"]
["Talented (any)","Talented (Trade (Shipwright))",0,"Talent",null,true,{"$f":"AND(COUNTIF(adv!A:A,B593))","v":false},"NA"]
["Talented (any)","Talented (Trade (Soothsayer))",0,"Talent",null,true,{"$f":"AND(COUNTIF(adv!A:A,B594))","v":false},"NA"]
["Talented (any)","Talented (Trade (Technomat))",0,"Talent",null,true,{"$f":"AND(COUNTIF(adv!A:A,B595))","v":false},"NA"]
["Talented (any)","Talented (Wrangling)",0,"Talent",null,true,{"$f":"AND(COUNTIF(adv!A:A,B596))","v":false},"NA"]
["Thrown Weapon Training (any)","Thrown Weapon Training (Universal)",0,"Talent",null,true,{"$f":"AND(COUNTIF(adv!A:A,B597))","v":false},"NA"]
["Two-Weapon Wielder (any)","Two-Weapon Wielder (Ballistic)",0,"Talent","BS 35, Ag 35",{"$f":"AND(cha_bs>=35,cha_ag>=35)","v":false},{"$f":"AND(COUNTIF(adv!A:A,B598))","v":false},"NA"]
["Two-Weapon Wielder (any)","Two-Weapon Wielder (Melee)",0,"Talent","WS 35, Ag 35",{"$f":"AND(cha_ws>=35,cha_ag>=35)","v":false},{"$f":"AND(COUNTIF(adv!A:A,B599))","v":false},"NA"]

{"sheet":"elite_adv","index":13,"n_rows":1031,"n_cols":5,"rows_kept":1031,"hidden":true}
["Advancement","Type","Chosen","Desc","Dreadnaught"]
["Weapon Skill (simple)","Characteristic",{"$f":"AND(COUNTIF(adv!A:A,A2))","v":false},null,true]
["Weapon Skill (intermediate)","Characteristic",{"$f":"AND(COUNTIF(adv!A:A,A3))","v":false},null,true]
["Weapon Skill (trained)","Characteristic",{"$f":"AND(COUNTIF(adv!A:A,A4))","v":false},null,true]
["Weapon Skill (expert)","Characteristic",{"$f":"AND(COUNTIF(adv!A:A,A5))","v":false},null,true]
["Ballistic Skill (simple)","Characteristic",{"$f":"AND(COUNTIF(adv!A:A,A6))","v":false},null,true]
["Ballistic Skill (intermediate)","Characteristic",{"$f":"AND(COUNTIF(adv!A:A,A7))","v":false},null,true]
["Ballistic Skill (trained)","Characteristic",{"$f":"AND(COUNTIF(adv!A:A,A8))","v":false},null,true]
["Ballistic Skill (expert)","Characteristic",{"$f":"AND(COUNTIF(adv!A:A,A9))","v":false},null,true]
["Strength (simple)","Characteristic",{"$f":"AND(COUNTIF(adv!A:A,A10))","v":false},null,false]
["Strength (intermediate)","Characteristic",{"$f":"AND(COUNTIF(adv!A:A,A11))","v":false},null,false]
["Strength (trained)","Characteristic",{"$f":"AND(COUNTIF(adv!A:A,A12))","v":false},null,false]
["Strength (expert)","Characteristic",{"$f":"AND(COUNTIF(adv!A:A,A13))","v":false},null,false]
["Toughness (simple)","Characteristic",{"$f":"AND(COUNTIF(adv!A:A,A14))","v":false},null,false]
["Toughness (intermediate)","Characteristic",{"$f":"AND(COUNTIF(adv!A:A,A15))","v":false},null,false]
["Toughness (trained)","Characteristic",{"$f":"AND(COUNTIF(adv!A:A,A16))","v":false},null,false]
["Toughness (expert)","Characteristic",{"$f":"AND(COUNTIF(adv!A:A,A17))","v":false},null,false]
["Agility (simple)","Characteristic",{"$f":"AND(COUNTIF(adv!A:A,A18))","v":false},null,false]
["Agility (intermediate)","Characteristic",{"$f":"AND(COUNTIF(adv!A:A,A19))","v":false},null,false]
["Agility (trained)","Characteristic",{"$f":"AND(COUNTIF(adv!A:A,A20))","v":false},null,false]
["Agility (expert)","Characteristic",{"$f":"AND(COUNTIF(adv!A:A,A21))","v":false},null,false]
["Intelligence (simple)","Characteristic",{"$f":"AND(COUNTIF(adv!A:A,A22))","v":false},null,true]
["Intelligence (intermediate)","Characteristic",{"$f":"AND(COUNTIF(adv!A:A,A23))","v":false},null,true]
["Intelligence (trained)","Characteristic",{"$f":"AND(COUNTIF(adv!A:A,A24))","v":false},null,true]
["Intelligence (expert)","Characteristic",{"$f":"AND(COUNTIF(adv!A:A,A25))","v":false},null,true]
["Perception (simple)","Characteristic",{"$f":"AND(COUNTIF(adv!A:A,A26))","v":false},null,true]
["Perception (intermediate)","Characteristic",{"$f":"AND(COUNTIF(adv!A:A,A27))","v":false},null,true]
["Perception (trained)","Characteristic",{"$f":"AND(COUNTIF(adv!A:A,A28))","v":false},null,true]
["Perception (expert)","Characteristic",{"$f":"AND(COUNTIF(adv!A:A,A29))","v":false},null,true]
["Willpower (simple)","Characteristic",{"$f":"AND(COUNTIF(adv!A:A,A30))","v":false},null,true]
["Willpower (intermediate)","Characteristic",{"$f":"AND(COUNTIF(adv!A:A,A31))","v":false},null,true]
["Willpower (trained)","Characteristic",{"$f":"AND(COUNTIF(adv!A:A,A32))","v":false},null,true]
["Willpower (expert)","Characteristic",{"$f":"AND(COUNTIF(adv!A:A,A33))","v":false},null,true]
["Fellowship (simple)","Characteristic",{"$f":"AND(COUNTIF(adv!A:A,A34))","v":false},null,true]
["Fellowship (intermediate)","Characteristic",{"$f":"AND(COUNTIF(adv!A:A,A35))","v":false},null,true]
["Fellowship (trained)","Characteristic",{"$f":"AND(COUNTIF(adv!A:A,A36))","v":false},null,true]
["Fellowship (expert)","Characteristic",{"$f":"AND(COUNTIF(adv!A:A,A37))","v":false},null,true]
["Acrobatics","Skill",{"$f":"AND(COUNTIF(adv!A:A,A38))","v":false},null,false]
["Acrobatics +10","Skill",{"$f":"AND(COUNTIF(adv!A:A,A39))","v":false},null,false]
["Acrobatics +20","Skill",{"$f":"AND(COUNTIF(adv!A:A,A40))","v":false},null,false]
["Awareness","Skill",{"$f":"AND(COUNTIF(adv!A:A,A41))","v":false},null,true]
["Awareness +10","Skill",{"$f":"AND(COUNTIF(adv!A:A,A42))","v":false},null,true]
["Awareness +20","Skill",{"$f":"AND(COUNTIF(adv!A:A,A43))","v":false},null,true]
["Barter","Skill",{"$f":"AND(COUNTIF(adv!A:A,A44))","v":false},null,false]
["Barter +10","Skill",{"$f":"AND(COUNTIF(adv!A:A,A45))","v":false},null,false]
["Barter +20","Skill",{"$f":"AND(COUNTIF(adv!A:A,A46))","v":false},null,false]
["Blather","Skill",{"$f":"AND(COUNTIF(adv!A:A,A47))","v":false},null,false]
["Blather +10","Skill",{"$f":"AND(COUNTIF(adv!A:A,A48))","v":false},null,false]
["Blather +20","Skill",{"$f":"AND(COUNTIF(adv!A:A,A49))","v":false},null,false]
["Carouse","Skill",{"$f":"AND(COUNTIF(adv!A:A,A50))","v":false},null,true]
["Carouse +10","Skill",{"$f":"AND(COUNTIF(adv!A:A,A51))","v":false},null,true]
["Carouse +20","Skill",{"$f":"AND(COUNTIF(adv!A:A,A52))","v":false},null,true]
["Charm","Skill",{"$f":"AND(COUNTIF(adv!A:A,A53))","v":false},null,true]
["Charm +10","Skill",{"$f":"AND(COUNTIF(adv!A:A,A54))","v":false},null,true]
["Charm +20","Skill",{"$f":"AND(COUNTIF(adv!A:A,A55))","v":false},null,true]
["Chem-Use","Skill",{"$f":"AND(COUNTIF(adv!A:A,A56))","v":false},null,false]
["Chem-Use +10","Skill",{"$f":"AND(COUNTIF(adv!A:A,A57))","v":false},null,false]
["Chem-Use +20","Skill",{"$f":"AND(COUNTIF(adv!A:A,A58))","v":false},null,false]
["Ciphers (Xenos Markings)","Skill",{"$f":"AND(COUNTIF(adv!A:A,A59))","v":false},null,true]
["Ciphers (Xenos Markings) +10","Skill",{"$f":"AND(COUNTIF(adv!A:A,A60))","v":false},null,true]
["Ciphers (Xenos Markings) +20","Skill",{"$f":"AND(COUNTIF(adv!A:A,A61))","v":false},null,true]
["Ciphers (Deathwatch)","Skill",{"$f":"AND(COUNTIF(adv!A:A,A62))","v":false},null,true]
["Ciphers (Deathwatch) +10","Skill",{"$f":"AND(COUNTIF(adv!A:A,A63))","v":false},null,true]
["Ciphers (Deathwatch) +20","Skill",{"$f":"AND(COUNTIF(adv!A:A,A64))","v":false},null,true]
["Ciphers (Chapter Runes)","Skill",{"$f":"AND(COUNTIF(adv!A:A,A65))","v":false},null,true]
["Ciphers (Chapter Runes) +10","Skill",{"$f":"AND(COUNTIF(adv!A:A,A66))","v":false},null,true]
["Ciphers (Chapter Runes) +20","Skill",{"$f":"AND(COUNTIF(adv!A:A,A67))","v":false},null,true]
["Ciphers (Imperial Codes)","Skill",{"$f":"AND(COUNTIF(adv!A:A,A68))","v":false},null,true]
["Ciphers (Imperial Codes) +10","Skill",{"$f":"AND(COUNTIF(adv!A:A,A69))","v":false},null,true]
["Ciphers (Imperial Codes) +20","Skill",{"$f":"AND(COUNTIF(adv!A:A,A70))","v":false},null,true]
["Ciphers (Inquisition)","Skill",{"$f":"AND(COUNTIF(adv!A:A,A71))","v":false},null,true]
["Ciphers (Inquisition) +10","Skill",{"$f":"AND(COUNTIF(adv!A:A,A72))","v":false},null,true]
["Ciphers (Inquisition) +20","Skill",{"$f":"AND(COUNTIF(adv!A:A,A73))","v":false},null,true]
["Ciphers (Mercenary Cant)","Skill",{"$f":"AND(COUNTIF(adv!A:A,A74))","v":false},null,true]
["Ciphers (Mercenary Cant) +10","Skill",{"$f":"AND(COUNTIF(adv!A:A,A75))","v":false},null,true]
["Ciphers (Mercenary Cant) +20","Skill",{"$f":"AND(COUNTIF(adv!A:A,A76))","v":false},null,true]
["Ciphers (Underworld)","Skill",{"$f":"AND(COUNTIF(adv!A:A,A77))","v":false},null,true]
["Ciphers (Underworld) +10","Skill",{"$f":"AND(COUNTIF(adv!A:A,A78))","v":false},null,true]
["Ciphers (Underworld) +20","Skill",{"$f":"AND(COUNTIF(adv!A:A,A79))","v":false},null,true]
["Climb","Skill",{"$f":"AND(COUNTIF(adv!A:A,A80))","v":false},null,true]
["Climb +10","Skill",{"$f":"AND(COUNTIF(adv!A:A,A81))","v":false},null,true]
["Climb +20","Skill",{"$f":"AND(COUNTIF(adv!A:A,A82))","v":false},null,true]
["Command","Skill",{"$f":"AND(COUNTIF(adv!A:A,A83))","v":false},null,true]
["Command +10","Skill",{"$f":"AND(COUNTIF(adv!A:A,A84))","v":false},null,true]
["Command +20","Skill",{"$f":"AND(COUNTIF(adv!A:A,A85))","v":false},null,true]
["Concealment","Skill",{"$f":"AND(COUNTIF(adv!A:A,A86))","v":false},null,true]
["Concealment +10","Skill",{"$f":"AND(COUNTIF(adv!A:A,A87))","v":false},null,true]
["Concealment +20","Skill",{"$f":"AND(COUNTIF(adv!A:A,A88))","v":false},null,true]
["Contortionist","Skill",{"$f":"AND(COUNTIF(adv!A:A,A89))","v":false},null,false]
["Contortionist +10","Skill",{"$f":"AND(COUNTIF(adv!A:A,A90))","v":false},null,false]
["Contortionist +20","Skill",{"$f":"AND(COUNTIF(adv!A:A,A91))","v":false},null,false]
["Deceive","Skill",{"$f":"AND(COUNTIF(adv!A:A,A92))","v":false},null,true]
["Deceive +10","Skill",{"$f":"AND(COUNTIF(adv!A:A,A93))","v":false},null,true]
["Deceive +20","Skill",{"$f":"AND(COUNTIF(adv!A:A,A94))","v":false},null,true]
["Demolition","Skill",{"$f":"AND(COUNTIF(adv!A:A,A95))","v":false},null,false]
["Demolition +10","Skill",{"$f":"AND(COUNTIF(adv!A:A,A96))","v":false},null,false]
["Demolition +20","Skill",{"$f":"AND(COUNTIF(adv!A:A,A97))","v":false},null,false]
["Disguise","Skill",{"$f":"AND(COUNTIF(adv!A:A,A98))","v":false},null,false]
["Disguise +10","Skill",{"$f":"AND(COUNTIF(adv!A:A,A99))","v":false},null,false]
["Disguise +20","Skill",{"$f":"AND(COUNTIF(adv!A:A,A100))","v":false},null,false]
["Dodge","Skill",{"$f":"AND(COUNTIF(adv!A:A,A101))","v":false},null,true]
["Dodge +10","Skill",{"$f":"AND(COUNTIF(adv!A:A,A102))","v":false},null,true]
["Dodge +20","Skill",{"$f":"AND(COUNTIF(adv!A:A,A103))","v":false},null,true]
["Drive (Ground Vehicles)","Skill",{"$f":"AND(COUNTIF(adv!A:A,A104))","v":false},null,false]
["Drive (Ground Vehicles) +10","Skill",{"$f":"AND(COUNTIF(adv!A:A,A105))","v":false},null,false]
["Drive (Ground Vehicles) +20","Skill",{"$f":"AND(COUNTIF(adv!A:A,A106))","v":false},null,false]
["Drive (Skimmer/Hover)","Skill",{"$f":"AND(COUNTIF(adv!A:A,A107))","v":false},null,false]
["Drive (Skimmer/Hover) +10","Skill",{"$f":"AND(COUNTIF(adv!A:A,A108))","v":false},null,false]
["Drive (Skimmer/Hover) +20","Skill",{"$f":"AND(COUNTIF(adv!A:A,A109))","v":false},null,false]
["Drive (Walker)","Skill",{"$f":"AND(COUNTIF(adv!A:A,A110))","v":false},null,false]
["Drive (Walker) +10","Skill",{"$f":"AND(COUNTIF(adv!A:A,A111))","v":false},null,false]
["Drive (Walker) +20","Skill",{"$f":"AND(COUNTIF(adv!A:A,A112))","v":false},null,false]
["Evaluate","Skill",{"$f":"AND(COUNTIF(adv!A:A,A113))","v":false},null,true]
["Evaluate +10","Skill",{"$f":"AND(COUNTIF(adv!A:A,A114))","v":false},null,true]
["Evaluate +20","Skill",{"$f":"AND(COUNTIF(adv!A:A,A115))","v":false},null,true]
["Gamble","Skill",{"$f":"AND(COUNTIF(adv!A:A,A116))","v":false},null,true]
["Gamble +10","Skill",{"$f":"AND(COUNTIF(adv!A:A,A117))","v":false},null,true]
["Gamble +20","Skill",{"$f":"AND(COUNTIF(adv!A:A,A118))","v":false},null,true]
["Inquiry","Skill",{"$f":"AND(COUNTIF(adv!A:A,A119))","v":false},null,true]
["Inquiry +10","Skill",{"$f":"AND(COUNTIF(adv!A:A,A120))","v":false},null,true]
["Inquiry +20","Skill",{"$f":"AND(COUNTIF(adv!A:A,A121))","v":false},null,true]
["Interrogation","Skill",{"$f":"AND(COUNTIF(adv!A:A,A122))","v":false},null,true]
["Interrogation +10","Skill",{"$f":"AND(COUNTIF(adv!A:A,A123))","v":false},null,true]
["Interrogation +20","Skill",{"$f":"AND(COUNTIF(adv!A:A,A124))","v":false},null,true]
["Intimidate","Skill",{"$f":"AND(COUNTIF(adv!A:A,A125))","v":false},null,true]
["Intimidate +10","Skill",{"$f":"AND(COUNTIF(adv!A:A,A126))","v":false},null,true]
["Intimidate +20","Skill",{"$f":"AND(COUNTIF(adv!A:A,A127))","v":false},null,true]
["Invocation","Skill",{"$f":"AND(COUNTIF(adv!A:A,A128))","v":false},null,true]
["Invocation +10","Skill",{"$f":"AND(COUNTIF(adv!A:A,A129))","v":false},null,true]
["Invocation +20","Skill",{"$f":"AND(COUNTIF(adv!A:A,A130))","v":false},null,true]
["Lip Reading","Skill",{"$f":"AND(COUNTIF(adv!A:A,A131))","v":false},null,false]
["Lip Reading +10","Skill",{"$f":"AND(COUNTIF(adv!A:A,A132))","v":false},null,false]
["Lip Reading +20","Skill",{"$f":"AND(COUNTIF(adv!A:A,A133))","v":false},null,false]
["Literacy","Skill",{"$f":"AND(COUNTIF(adv!A:A,A134))","v":false},null,true]
["Literacy +10","Skill",{"$f":"AND(COUNTIF(adv!A:A,A135))","v":false},null,true]
["Literacy +20","Skill",{"$f":"AND(COUNTIF(adv!A:A,A136))","v":false},null,true]
["Logic","Skill",{"$f":"AND(COUNTIF(adv!A:A,A137))","v":false},null,true]
["Logic +10","Skill",{"$f":"AND(COUNTIF(adv!A:A,A138))","v":false},null,true]
["Logic +20","Skill",{"$f":"AND(COUNTIF(adv!A:A,A139))","v":false},null,true]
["Lore: Common (Adeptus Arbites)","Skill",{"$f":"AND(COUNTIF(adv!A:A,A140))","v":false},null,true]
["Lore: Common (Adeptus Arbites) +10","Skill",{"$f":"AND(COUNTIF(adv!A:A,A141))","v":false},null,true]
["Lore: Common (Adeptus Arbites) +20","Skill",{"$f":"AND(COUNTIF(adv!A:A,A142))","v":false},null,true]
["Lore: Common (Adeptus Astartes)","Skill",{"$f":"AND(COUNTIF(adv!A:A,A143))","v":false},null,true]
["Lore: Common (Adeptus Astartes) +10","Skill",{"$f":"AND(COUNTIF(adv!A:A,A144))","v":false},null,true]
["Lore: Common (Adeptus Astartes) +20","Skill",{"$f":"AND(COUNTIF(adv!A:A,A145))","v":false},null,true]
["Lore: Common (Adeptus Mechanicus)","Skill",{"$f":"AND(COUNTIF(adv!A:A,A146))","v":false},null,true]
["Lore: Common (Adeptus Mechanicus) +10","Skill",{"$f":"AND(COUNTIF(adv!A:A,A147))","v":false},null,true]
["Lore: Common (Adeptus Mechanicus) +20","Skill",{"$f":"AND(COUNTIF(adv!A:A,A148))","v":false},null,true]
["Lore: Common (Administratum)","Skill",{"$f":"AND(COUNTIF(adv!A:A,A149))","v":false},null,true]
["Lore: Common (Administratum) +10","Skill",{"$f":"AND(COUNTIF(adv!A:A,A150))","v":false},null,true]
["Lore: Common (Administratum) +20","Skill",{"$f":"AND(COUNTIF(adv!A:A,A151))","v":false},null,true]
["Lore: Common (Deathwatch)","Skill",{"$f":"AND(COUNTIF(adv!A:A,A152))","v":false},null,true]
["Lore: Common (Deathwatch) +10","Skill",{"$f":"AND(COUNTIF(adv!A:A,A153))","v":false},null,true]
["Lore: Common (Deathwatch) +20","Skill",{"$f":"AND(COUNTIF(adv!A:A,A154))","v":false},null,true]
["Lore: Common (Ecclesiarchy)","Skill",{"$f":"AND(COUNTIF(adv!A:A,A155))","v":false},null,true]
["Lore: Common (Ecclesiarchy) +10","Skill",{"$f":"AND(COUNTIF(adv!A:A,A156))","v":false},null,true]
["Lore: Common (Ecclesiarchy) +20","Skill",{"$f":"AND(COUNTIF(adv!A:A,A157))","v":false},null,true]
["Lore: Common (Imperial Creed)","Skill",{"$f":"AND(COUNTIF(adv!A:A,A158))","v":false},null,true]
["Lore: Common (Imperial Creed) +10","Skill",{"$f":"AND(COUNTIF(adv!A:A,A159))","v":false},null,true]
["Lore: Common (Imperial Creed) +20","Skill",{"$f":"AND(COUNTIF(adv!A:A,A160))","v":false},null,true]
["Lore: Common (Imperial Guard)","Skill",{"$f":"AND(COUNTIF(adv!A:A,A161))","v":false},null,true]
["Lore: Common (Imperial Guard) +10","Skill",{"$f":"AND(COUNTIF(adv!A:A,A162))","v":false},null,true]
["Lore: Common (Imperial Guard) +20","Skill",{"$f":"AND(COUNTIF(adv!A:A,A163))","v":false},null,true]
["Lore: Common (Imperial Navy)","Skill",{"$f":"AND(COUNTIF(adv!A:A,A164))","v":false},null,true]
["Lore: Common (Imperial Navy) +10","Skill",{"$f":"AND(COUNTIF(adv!A:A,A165))","v":false},null,true]
["Lore: Common (Imperial Navy) +20","Skill",{"$f":"AND(COUNTIF(adv!A:A,A166))","v":false},null,true]
["Lore: Common (Imperium)","Skill",{"$f":"AND(COUNTIF(adv!A:A,A167))","v":false},null,true]
["Lore: Common (Imperium) +10","Skill",{"$f":"AND(COUNTIF(adv!A:A,A168))","v":false},null,true]
["Lore: Common (Imperium) +20","Skill",{"$f":"AND(COUNTIF(adv!A:A,A169))","v":false},null,true]
["Lore: Common (Jericho Reach)","Skill",{"$f":"AND(COUNTIF(adv!A:A,A170))","v":false},null,true]
["Lore: Common (Jericho Reach) +10","Skill",{"$f":"AND(COUNTIF(adv!A:A,A171))","v":false},null,true]
["Lore: Common (Jericho Reach) +20","Skill",{"$f":"AND(COUNTIF(adv!A:A,A172))","v":false},null,true]
["Lore: Common (Tech)","Skill",{"$f":"AND(COUNTIF(adv!A:A,A173))","v":false},null,true]
["Lore: Common (Tech) +10","Skill",{"$f":"AND(COUNTIF(adv!A:A,A174))","v":false},null,true]
["Lore: Common (Tech) +20","Skill",{"$f":"AND(COUNTIF(adv!A:A,A175))","v":false},null,true]
["Lore: Common (War)","Skill",{"$f":"AND(COUNTIF(adv!A:A,A176))","v":false},null,true]
["Lore: Common (War) +10","Skill",{"$f":"AND(COUNTIF(adv!A:A,A177))","v":false},null,true]
["Lore: Common (War) +20","Skill",{"$f":"AND(COUNTIF(adv!A:A,A178))","v":false},null,true]
["Lore: Forbidden (Adeptus Astartes)","Skill",{"$f":"AND(COUNTIF(adv!A:A,A179))","v":false},null,true]
["Lore: Forbidden (Adeptus Astartes) +10","Skill",{"$f":"AND(COUNTIF(adv!A:A,A180))","v":false},null,true]
["Lore: Forbidden (Adeptus Astartes) +20","Skill",{"$f":"AND(COUNTIF(adv!A:A,A181))","v":false},null,true]
["Lore: Forbidden (Adeptus Mechanicus)","Skill",{"$f":"AND(COUNTIF(adv!A:A,A182))","v":false},null,true]
["Lore: Forbidden (Adeptus Mechanicus) +10","Skill",{"$f":"AND(COUNTIF(adv!A:A,A183))","v":false},null,true]
["Lore: Forbidden (Adeptus Mechanicus) +20","Skill",{"$f":"AND(COUNTIF(adv!A:A,A184))","v":false},null,true]
["Lore: Forbidden (Archeotech)","Skill",{"$f":"AND(COUNTIF(adv!A:A,A185))","v":false},null,true]
["Lore: Forbidden (Archeotech) +10","Skill",{"$f":"AND(COUNTIF(adv!A:A,A186))","v":false},null,true]
["Lore: Forbidden (Archeotech) +20","Skill",{"$f":"AND(COUNTIF(adv!A:A,A187))","v":false},null,true]
["Lore: Forbidden (The Black Library)","Skill",{"$f":"AND(COUNTIF(adv!A:A,A188))","v":false},null,true]
["Lore: Forbidden (The Black Library) +10","Skill",{"$f":"AND(COUNTIF(adv!A:A,A189))","v":false},null,true]
["Lore: Forbidden (The Black Library) +20","Skill",{"$f":"AND(COUNTIF(adv!A:A,A190))","v":false},null,true]
["Lore: Forbidden (Daemonology)","Skill",{"$f":"AND(COUNTIF(adv!A:A,A191))","v":false},null,true]
["Lore: Forbidden (Daemonology) +10","Skill",{"$f":"AND(COUNTIF(adv!A:A,A192))","v":false},null,true]
["Lore: Forbidden (Daemonology) +20","Skill",{"$f":"AND(COUNTIF(adv!A:A,A193))","v":false},null,true]
["Lore: Forbidden (Heresy)","Skill",{"$f":"AND(COUNTIF(adv!A:A,A194))","v":false},null,true]
["Lore: Forbidden (Heresy) +10","Skill",{"$f":"AND(COUNTIF(adv!A:A,A195))","v":false},null,true]
["Lore: Forbidden (Heresy) +20","Skill",{"$f":"AND(COUNTIF(adv!A:A,A196))","v":false},null,true]
["Lore: Forbidden (The Inquisition)","Skill",{"$f":"AND(COUNTIF(adv!A:A,A197))","v":false},null,true]
["Lore: Forbidden (The Inquisition) +10","Skill",{"$f":"AND(COUNTIF(adv!A:A,A198))","v":false},null,true]
["Lore: Forbidden (The Inquisition) +20","Skill",{"$f":"AND(COUNTIF(adv!A:A,A199))","v":false},null,true]
["Lore: Scholastic (Legends)","Skill",{"$f":"AND(COUNTIF(adv!A:A,A200))","v":false},null,true]
["Lore: Scholastic (Legends) +10","Skill",{"$f":"AND(COUNTIF(adv!A:A,A201))","v":false},null,true]
["Lore: Scholastic (Legends) +20","Skill",{"$f":"AND(COUNTIF(adv!A:A,A202))","v":false},null,true]
["Lore: Forbidden (Mutants)","Skill",{"$f":"AND(COUNTIF(adv!A:A,A203))","v":false},null,true]
["Lore: Forbidden (Mutants) +10","Skill",{"$f":"AND(COUNTIF(adv!A:A,A204))","v":false},null,true]
["Lore: Forbidden (Mutants) +20","Skill",{"$f":"AND(COUNTIF(adv!A:A,A205))","v":false},null,true]
["Lore: Forbidden (The Primarchs)","Skill",{"$f":"AND(COUNTIF(adv!A:A,A206))","v":false},null,true]
["Lore: Forbidden (The Primarchs) +10","Skill",{"$f":"AND(COUNTIF(adv!A:A,A207))","v":false},null,true]
["Lore: Forbidden (The Primarchs) +20","Skill",{"$f":"AND(COUNTIF(adv!A:A,A208))","v":false},null,true]
["Lore: Forbidden (Psykers)","Skill",{"$f":"AND(COUNTIF(adv!A:A,A209))","v":false},null,true]
["Lore: Forbidden (Psykers) +10","Skill",{"$f":"AND(COUNTIF(adv!A:A,A210))","v":false},null,true]
["Lore: Forbidden (Psykers) +20","Skill",{"$f":"AND(COUNTIF(adv!A:A,A211))","v":false},null,true]
["Lore: Forbidden (The Traitor Legions)","Skill",{"$f":"AND(COUNTIF(adv!A:A,A212))","v":false},null,true]
["Lore: Forbidden (The Traitor Legions) +10","Skill",{"$f":"AND(COUNTIF(adv!A:A,A213))","v":false},null,true]
["Lore: Forbidden (The Traitor Legions) +20","Skill",{"$f":"AND(COUNTIF(adv!A:A,A214))","v":false},null,true]
["Lore: Forbidden (The Warp)","Skill",{"$f":"AND(COUNTIF(adv!A:A,A215))","v":false},null,true]
["Lore: Forbidden (The Warp) +10","Skill",{"$f":"AND(COUNTIF(adv!A:A,A216))","v":false},null,true]
["Lore: Forbidden (The Warp) +20","Skill",{"$f":"AND(COUNTIF(adv!A:A,A217))","v":false},null,true]
["Lore: Forbidden (Xenos)","Skill",{"$f":"AND(COUNTIF(adv!A:A,A218))","v":false},null,true]
["Lore: Forbidden (Xenos) +10","Skill",{"$f":"AND(COUNTIF(adv!A:A,A219))","v":false},null,true]
["Lore: Forbidden (Xenos) +20","Skill",{"$f":"AND(COUNTIF(adv!A:A,A220))","v":false},null,true]
["Lore: Scholastic (Archaic)","Skill",{"$f":"AND(COUNTIF(adv!A:A,A221))","v":false},null,true]
["Lore: Scholastic (Archaic) +10","Skill",{"$f":"AND(COUNTIF(adv!A:A,A222))","v":false},null,true]
["Lore: Scholastic (Archaic) +20","Skill",{"$f":"AND(COUNTIF(adv!A:A,A223))","v":false},null,true]
["Lore: Scholastic (Astromancy)","Skill",{"$f":"AND(COUNTIF(adv!A:A,A224))","v":false},null,true]
["Lore: Scholastic (Astromancy) +10","Skill",{"$f":"AND(COUNTIF(adv!A:A,A225))","v":false},null,true]
["Lore: Scholastic (Astromancy) +20","Skill",{"$f":"AND(COUNTIF(adv!A:A,A226))","v":false},null,true]
["Lore: Scholastic (Beasts)","Skill",{"$f":"AND(COUNTIF(adv!A:A,A227))","v":false},null,true]
["Lore: Scholastic (Beasts) +10","Skill",{"$f":"AND(COUNTIF(adv!A:A,A228))","v":false},null,true]
["Lore: Scholastic (Beasts) +20","Skill",{"$f":"AND(COUNTIF(adv!A:A,A229))","v":false},null,true]
["Lore: Scholastic (Bureaucracy)","Skill",{"$f":"AND(COUNTIF(adv!A:A,A230))","v":false},null,true]
["Lore: Scholastic (Bureaucracy) +10","Skill",{"$f":"AND(COUNTIF(adv!A:A,A231))","v":false},null,true]
["Lore: Scholastic (Bureaucracy) +20","Skill",{"$f":"AND(COUNTIF(adv!A:A,A232))","v":false},null,true]
["Lore: Scholastic (Chymistry)","Skill",{"$f":"AND(COUNTIF(adv!A:A,A233))","v":false},null,true]
["Lore: Scholastic (Chymistry) +10","Skill",{"$f":"AND(COUNTIF(adv!A:A,A234))","v":false},null,true]
["Lore: Scholastic (Chymistry) +20","Skill",{"$f":"AND(COUNTIF(adv!A:A,A235))","v":false},null,true]
["Lore: Scholastic (Codex Astartes)","Skill",{"$f":"AND(COUNTIF(adv!A:A,A236))","v":false},null,true]
["Lore: Scholastic (Codex Astartes) +10","Skill",{"$f":"AND(COUNTIF(adv!A:A,A237))","v":false},null,true]
["Lore: Scholastic (Codex Astartes) +20","Skill",{"$f":"AND(COUNTIF(adv!A:A,A238))","v":false},null,true]
["Lore: Scholastic (Cryptology)","Skill",{"$f":"AND(COUNTIF(adv!A:A,A239))","v":false},null,true]
["Lore: Scholastic (Cryptology) +10","Skill",{"$f":"AND(COUNTIF(adv!A:A,A240))","v":false},null,true]
["Lore: Scholastic (Cryptology) +20","Skill",{"$f":"AND(COUNTIF(adv!A:A,A241))","v":false},null,true]
["Lore: Scholastic (Heraldry)","Skill",{"$f":"AND(COUNTIF(adv!A:A,A242))","v":false},null,true]
["Lore: Scholastic (Heraldry) +10","Skill",{"$f":"AND(COUNTIF(adv!A:A,A243))","v":false},null,true]
["Lore: Scholastic (Heraldry) +20","Skill",{"$f":"AND(COUNTIF(adv!A:A,A244))","v":false},null,true]
["Lore: Scholastic (Imperial Creed)","Skill",{"$f":"AND(COUNTIF(adv!A:A,A245))","v":false},null,true]
["Lore: Scholastic (Imperial Creed) +10","Skill",{"$f":"AND(COUNTIF(adv!A:A,A246))","v":false},null,true]
["Lore: Scholastic (Imperial Creed) +20","Skill",{"$f":"AND(COUNTIF(adv!A:A,A247))","v":false},null,true]
["Lore: Scholastic (Judgement)","Skill",{"$f":"AND(COUNTIF(adv!A:A,A248))","v":false},null,true]
["Lore: Scholastic (Judgement) +10","Skill",{"$f":"AND(COUNTIF(adv!A:A,A249))","v":false},null,true]
["Lore: Scholastic (Judgement) +20","Skill",{"$f":"AND(COUNTIF(adv!A:A,A250))","v":false},null,true]
["Lore: Scholastic (Legend)","Skill",{"$f":"AND(COUNTIF(adv!A:A,A251))","v":false},null,true]
["Lore: Scholastic (Legend) +10","Skill",{"$f":"AND(COUNTIF(adv!A:A,A252))","v":false},null,true]
["Lore: Scholastic (Legend) +20","Skill",{"$f":"AND(COUNTIF(adv!A:A,A253))","v":false},null,true]
["Lore: Scholastic (Numerology)","Skill",{"$f":"AND(COUNTIF(adv!A:A,A254))","v":false},null,true]
["Lore: Scholastic (Numerology) +10","Skill",{"$f":"AND(COUNTIF(adv!A:A,A255))","v":false},null,true]
["Lore: Scholastic (Numerology) +20","Skill",{"$f":"AND(COUNTIF(adv!A:A,A256))","v":false},null,true]
["Lore: Scholastic (Occult)","Skill",{"$f":"AND(COUNTIF(adv!A:A,A257))","v":false},null,true]
["Lore: Scholastic (Occult) +10","Skill",{"$f":"AND(COUNTIF(adv!A:A,A258))","v":false},null,true]
["Lore: Scholastic (Occult) +20","Skill",{"$f":"AND(COUNTIF(adv!A:A,A259))","v":false},null,true]
["Lore: Scholastic (Philosophy)","Skill",{"$f":"AND(COUNTIF(adv!A:A,A260))","v":false},null,true]
["Lore: Scholastic (Philosophy) +10","Skill",{"$f":"AND(COUNTIF(adv!A:A,A261))","v":false},null,true]
["Lore: Scholastic (Philosophy) +20","Skill",{"$f":"AND(COUNTIF(adv!A:A,A262))","v":false},null,true]
["Lore: Scholastic (Tactica Imperialis)","Skill",{"$f":"AND(COUNTIF(adv!A:A,A263))","v":false},null,true]
["Lore: Scholastic (Tactica Imperialis) +10","Skill",{"$f":"AND(COUNTIF(adv!A:A,A264))","v":false},null,true]
["Lore: Scholastic (Tactica Imperialis) +20","Skill",{"$f":"AND(COUNTIF(adv!A:A,A265))","v":false},null,true]
["Medicae","Skill",{"$f":"AND(COUNTIF(adv!A:A,A266))","v":false},null,false]
["Medicae +10","Skill",{"$f":"AND(COUNTIF(adv!A:A,A267))","v":false},null,false]
["Medicae +20","Skill",{"$f":"AND(COUNTIF(adv!A:A,A268))","v":false},null,false]
["Navigation (Surface)","Skill",{"$f":"AND(COUNTIF(adv!A:A,A269))","v":false},null,true]
["Navigation (Surface) +10","Skill",{"$f":"AND(COUNTIF(adv!A:A,A270))","v":false},null,true]
["Navigation (Surface) +20","Skill",{"$f":"AND(COUNTIF(adv!A:A,A271))","v":false},null,true]
["Navigation (Stellar)","Skill",{"$f":"AND(COUNTIF(adv!A:A,A272))","v":false},null,true]
["Navigation (Stellar) +10","Skill",{"$f":"AND(COUNTIF(adv!A:A,A273))","v":false},null,true]
["Navigation (Stellar) +20","Skill",{"$f":"AND(COUNTIF(adv!A:A,A274))","v":false},null,true]
["Performer (Dancer)","Skill",{"$f":"AND(COUNTIF(adv!A:A,A275))","v":false},null,false]
["Performer (Dancer) +10","Skill",{"$f":"AND(COUNTIF(adv!A:A,A276))","v":false},null,false]
["Performer (Dancer) +20","Skill",{"$f":"AND(COUNTIF(adv!A:A,A277))","v":false},null,false]
["Performer (Musician)","Skill",{"$f":"AND(COUNTIF(adv!A:A,A278))","v":false},null,false]
["Performer (Musician) +10","Skill",{"$f":"AND(COUNTIF(adv!A:A,A279))","v":false},null,false]
["Performer (Musician) +20","Skill",{"$f":"AND(COUNTIF(adv!A:A,A280))","v":false},null,false]
["Performer (Singer)","Skill",{"$f":"AND(COUNTIF(adv!A:A,A281))","v":false},null,false]
["Performer (Singer) +10","Skill",{"$f":"AND(COUNTIF(adv!A:A,A282))","v":false},null,false]
["Performer (Singer) +20","Skill",{"$f":"AND(COUNTIF(adv!A:A,A283))","v":false},null,false]
["Performer (Storyteller)","Skill",{"$f":"AND(COUNTIF(adv!A:A,A284))","v":false},null,false]
["Performer (Storyteller) +10","Skill",{"$f":"AND(COUNTIF(adv!A:A,A285))","v":false},null,false]
["Performer (Storyteller) +20","Skill",{"$f":"AND(COUNTIF(adv!A:A,A286))","v":false},null,false]
["Pilot (Personal)","Skill",{"$f":"AND(COUNTIF(adv!A:A,A287))","v":false},null,false]
["Pilot (Personal) +10","Skill",{"$f":"AND(COUNTIF(adv!A:A,A288))","v":false},null,false]
["Pilot (Personal) +20","Skill",{"$f":"AND(COUNTIF(adv!A:A,A289))","v":false},null,false]
["Pilot (Flyers)","Skill",{"$f":"AND(COUNTIF(adv!A:A,A290))","v":false},null,false]
["Pilot (Flyers) +10","Skill",{"$f":"AND(COUNTIF(adv!A:A,A291))","v":false},null,false]
["Pilot (Flyers) +20","Skill",{"$f":"AND(COUNTIF(adv!A:A,A292))","v":false},null,false]
["Pilot (Spacecraft)","Skill",{"$f":"AND(COUNTIF(adv!A:A,A293))","v":false},null,false]
["Pilot (Spacecraft) +10","Skill",{"$f":"AND(COUNTIF(adv!A:A,A294))","v":false},null,false]
["Pilot (Spacecraft) +20","Skill",{"$f":"AND(COUNTIF(adv!A:A,A295))","v":false},null,false]
["Psyniscience","Skill",{"$f":"AND(COUNTIF(adv!A:A,A296))","v":false},null,true]
["Psyniscience +10","Skill",{"$f":"AND(COUNTIF(adv!A:A,A297))","v":false},null,true]
["Psyniscience +20","Skill",{"$f":"AND(COUNTIF(adv!A:A,A298))","v":false},null,true]
["Scrutiny","Skill",{"$f":"AND(COUNTIF(adv!A:A,A299))","v":false},null,true]
["Scrutiny +10","Skill",{"$f":"AND(COUNTIF(adv!A:A,A300))","v":false},null,true]
["Scrutiny +20","Skill",{"$f":"AND(COUNTIF(adv!A:A,A301))","v":false},null,true]
["Search","Skill",{"$f":"AND(COUNTIF(adv!A:A,A302))","v":false},null,true]
["Search +10","Skill",{"$f":"AND(COUNTIF(adv!A:A,A303))","v":false},null,true]
["Search +20","Skill",{"$f":"AND(COUNTIF(adv!A:A,A304))","v":false},null,true]
["Secret Tongue","Skill",{"$f":"AND(COUNTIF(adv!A:A,A305))","v":false},null,false]
["Secret Tongue +10","Skill",{"$f":"AND(COUNTIF(adv!A:A,A306))","v":false},null,false]
["Secret Tongue +20","Skill",{"$f":"AND(COUNTIF(adv!A:A,A307))","v":false},null,false]
["Security","Skill",{"$f":"AND(COUNTIF(adv!A:A,A308))","v":false},null,false]
["Security +10","Skill",{"$f":"AND(COUNTIF(adv!A:A,A309))","v":false},null,false]
["Security +20","Skill",{"$f":"AND(COUNTIF(adv!A:A,A310))","v":false},null,false]
["Shadowing","Skill",{"$f":"AND(COUNTIF(adv!A:A,A311))","v":false},null,true]
["Shadowing +10","Skill",{"$f":"AND(COUNTIF(adv!A:A,A312))","v":false},null,true]
["Shadowing +20","Skill",{"$f":"AND(COUNTIF(adv!A:A,A313))","v":false},null,true]
["Silent Move","Skill",{"$f":"AND(COUNTIF(adv!A:A,A314))","v":false},null,true]
["Silent Move +10","Skill",{"$f":"AND(COUNTIF(adv!A:A,A315))","v":false},null,true]
["Silent Move +20","Skill",{"$f":"AND(COUNTIF(adv!A:A,A316))","v":false},null,true]
["Sleight of Hand","Skill",{"$f":"AND(COUNTIF(adv!A:A,A317))","v":false},null,false]
["Sleight of Hand +10","Skill",{"$f":"AND(COUNTIF(adv!A:A,A318))","v":false},null,false]
["Sleight of Hand +20","Skill",{"$f":"AND(COUNTIF(adv!A:A,A319))","v":false},null,false]
["Speak Language (Eldar)","Skill",{"$f":"AND(COUNTIF(adv!A:A,A320))","v":false},null,true]
["Speak Language (Eldar) +10","Skill",{"$f":"AND(COUNTIF(adv!A:A,A321))","v":false},null,true]
["Speak Language (Eldar) +20","Skill",{"$f":"AND(COUNTIF(adv!A:A,A322))","v":false},null,true]
["Speak Language (High Gothic)","Skill",{"$f":"AND(COUNTIF(adv!A:A,A323))","v":false},null,true]
["Speak Language (High Gothic) +10","Skill",{"$f":"AND(COUNTIF(adv!A:A,A324))","v":false},null,true]
["Speak Language (High Gothic) +20","Skill",{"$f":"AND(COUNTIF(adv!A:A,A325))","v":false},null,true]
["Speak Language (Kroot)","Skill",{"$f":"AND(COUNTIF(adv!A:A,A326))","v":false},null,true]
["Speak Language (Kroot) +10","Skill",{"$f":"AND(COUNTIF(adv!A:A,A327))","v":false},null,true]
["Speak Language (Kroot) +20","Skill",{"$f":"AND(COUNTIF(adv!A:A,A328))","v":false},null,true]
["Speak Language (Low Gothic)","Skill",{"$f":"AND(COUNTIF(adv!A:A,A329))","v":false},null,true]
["Speak Language (Low Gothic) +10","Skill",{"$f":"AND(COUNTIF(adv!A:A,A330))","v":false},null,true]
["Speak Language (Low Gothic) +20","Skill",{"$f":"AND(COUNTIF(adv!A:A,A331))","v":false},null,true]
["Speak Language (Ork)","Skill",{"$f":"AND(COUNTIF(adv!A:A,A332))","v":false},null,true]
["Speak Language (Ork) +10","Skill",{"$f":"AND(COUNTIF(adv!A:A,A333))","v":false},null,true]
["Speak Language (Ork) +20","Skill",{"$f":"AND(COUNTIF(adv!A:A,A334))","v":false},null,true]
["Speak Language (Techna-Lingua)","Skill",{"$f":"AND(COUNTIF(adv!A:A,A335))","v":false},null,true]
["Speak Language (Techna-Lingua) +10","Skill",{"$f":"AND(COUNTIF(adv!A:A,A336))","v":false},null,true]
["Speak Language (Techna-Lingua) +20","Skill",{"$f":"AND(COUNTIF(adv!A:A,A337))","v":false},null,true]
["Speak Language (Tau)","Skill",{"$f":"AND(COUNTIF(adv!A:A,A338))","v":false},null,true]
["Speak Language (Tau) +10","Skill",{"$f":"AND(COUNTIF(adv!A:A,A339))","v":false},null,true]
["Speak Language (Tau) +20","Skill",{"$f":"AND(COUNTIF(adv!A:A,A340))","v":false},null,true]
["Survival","Skill",{"$f":"AND(COUNTIF(adv!A:A,A341))","v":false},null,false]
["Survival +10","Skill",{"$f":"AND(COUNTIF(adv!A:A,A342))","v":false},null,false]
["Survival +20","Skill",{"$f":"AND(COUNTIF(adv!A:A,A343))","v":false},null,false]
["Swim","Skill",{"$f":"AND(COUNTIF(adv!A:A,A344))","v":false},null,false]
["Swim +10","Skill",{"$f":"AND(COUNTIF(adv!A:A,A345))","v":false},null,false]
["Swim +20","Skill",{"$f":"AND(COUNTIF(adv!A:A,A346))","v":false},null,false]
["Tactics (Air Combat)","Skill",{"$f":"AND(COUNTIF(adv!A:A,A347))","v":false},null,true]
["Tactics (Air Combat) +10","Skill",{"$f":"AND(COUNTIF(adv!A:A,A348))","v":false},null,true]
["Tactics (Air Combat) +20","Skill",{"$f":"AND(COUNTIF(adv!A:A,A349))","v":false},null,true]
["Tactics (Armoured Tactics)","Skill",{"$f":"AND(COUNTIF(adv!A:A,A350))","v":false},null,true]
["Tactics (Armoured Tactics) +10","Skill",{"$f":"AND(COUNTIF(adv!A:A,A351))","v":false},null,true]
["Tactics (Armoured Tactics) +20","Skill",{"$f":"AND(COUNTIF(adv!A:A,A352))","v":false},null,true]
["Tactics (Assault Doctrine)","Skill",{"$f":"AND(COUNTIF(adv!A:A,A353))","v":false},null,true]
["Tactics (Assault Doctrine) +10","Skill",{"$f":"AND(COUNTIF(adv!A:A,A354))","v":false},null,true]
["Tactics (Assault Doctrine) +20","Skill",{"$f":"AND(COUNTIF(adv!A:A,A355))","v":false},null,true]
["Tactics (Defensive Doctrine)","Skill",{"$f":"AND(COUNTIF(adv!A:A,A356))","v":false},null,true]
["Tactics (Defensive Doctrine) +10","Skill",{"$f":"AND(COUNTIF(adv!A:A,A357))","v":false},null,true]
["Tactics (Defensive Doctrine) +20","Skill",{"$f":"AND(COUNTIF(adv!A:A,A358))","v":false},null,true]
["Tactics (Orbital Drop Procedures)","Skill",{"$f":"AND(COUNTIF(adv!A:A,A359))","v":false},null,true]
["Tactics (Orbital Drop Procedures) +10","Skill",{"$f":"AND(COUNTIF(adv!A:A,A360))","v":false},null,true]
["Tactics (Orbital Drop Procedures) +20","Skill",{"$f":"AND(COUNTIF(adv!A:A,A361))","v":false},null,true]
["Tactics (Recon and Stealth)","Skill",{"$f":"AND(COUNTIF(adv!A:A,A362))","v":false},null,true]
["Tactics (Recon and Stealth) +10","Skill",{"$f":"AND(COUNTIF(adv!A:A,A363))","v":false},null,true]
["Tactics (Recon and Stealth) +20","Skill",{"$f":"AND(COUNTIF(adv!A:A,A364))","v":false},null,true]
["Tactics (Void Combat)","Skill",{"$f":"AND(COUNTIF(adv!A:A,A365))","v":false},null,true]
["Tactics (Void Combat) +10","Skill",{"$f":"AND(COUNTIF(adv!A:A,A366))","v":false},null,true]
["Tactics (Void Combat) +20","Skill",{"$f":"AND(COUNTIF(adv!A:A,A367))","v":false},null,true]
["Tech-Use","Skill",{"$f":"AND(COUNTIF(adv!A:A,A368))","v":false},null,true]
["Tech-Use +10","Skill",{"$f":"AND(COUNTIF(adv!A:A,A369))","v":false},null,true]
["Tech-Use +20","Skill",{"$f":"AND(COUNTIF(adv!A:A,A370))","v":false},null,true]
["Tracking","Skill",{"$f":"AND(COUNTIF(adv!A:A,A371))","v":false},null,true]
["Tracking +10","Skill",{"$f":"AND(COUNTIF(adv!A:A,A372))","v":false},null,true]
["Tracking +20","Skill",{"$f":"AND(COUNTIF(adv!A:A,A373))","v":false},null,true]
["Trade (Archeologist)","Skill",{"$f":"AND(COUNTIF(adv!A:A,A374))","v":false},null,false]
["Trade (Archeologist) +10","Skill",{"$f":"AND(COUNTIF(adv!A:A,A375))","v":false},null,false]
["Trade (Archeologist) +20","Skill",{"$f":"AND(COUNTIF(adv!A:A,A376))","v":false},null,false]
["Trade (Armourer)","Skill",{"$f":"AND(COUNTIF(adv!A:A,A377))","v":false},null,false]
["Trade (Armourer) +10","Skill",{"$f":"AND(COUNTIF(adv!A:A,A378))","v":false},null,false]
["Trade (Armourer) +20","Skill",{"$f":"AND(COUNTIF(adv!A:A,A379))","v":false},null,false]
["Trade (Artisan)","Skill",{"$f":"AND(COUNTIF(adv!A:A,A380))","v":false},null,false]
["Trade (Artisan) +10","Skill",{"$f":"AND(COUNTIF(adv!A:A,A381))","v":false},null,false]
["Trade (Artisan) +20","Skill",{"$f":"AND(COUNTIF(adv!A:A,A382))","v":false},null,false]
["Trade (Astrographer)","Skill",{"$f":"AND(COUNTIF(adv!A:A,A383))","v":false},null,false]
["Trade (Astrographer) +10","Skill",{"$f":"AND(COUNTIF(adv!A:A,A384))","v":false},null,false]
["Trade (Astrographer) +20","Skill",{"$f":"AND(COUNTIF(adv!A:A,A385))","v":false},null,false]
["Trade (Chymist)","Skill",{"$f":"AND(COUNTIF(adv!A:A,A386))","v":false},null,false]
["Trade (Chymist) +10","Skill",{"$f":"AND(COUNTIF(adv!A:A,A387))","v":false},null,false]
["Trade (Chymist) +20","Skill",{"$f":"AND(COUNTIF(adv!A:A,A388))","v":false},null,false]
["Trade (Cryptographer)","Skill",{"$f":"AND(COUNTIF(adv!A:A,A389))","v":false},null,false]
["Trade (Cryptographer) +10","Skill",{"$f":"AND(COUNTIF(adv!A:A,A390))","v":false},null,false]
["Trade (Cryptographer) +20","Skill",{"$f":"AND(COUNTIF(adv!A:A,A391))","v":false},null,false]
["Trade (Explorator)","Skill",{"$f":"AND(COUNTIF(adv!A:A,A392))","v":false},null,false]
["Trade (Explorator) +10","Skill",{"$f":"AND(COUNTIF(adv!A:A,A393))","v":false},null,false]
["Trade (Explorator) +20","Skill",{"$f":"AND(COUNTIF(adv!A:A,A394))","v":false},null,false]
["Trade (Forge Master)","Skill",{"$f":"AND(COUNTIF(adv!A:A,A395))","v":false},null,false]
["Trade (Forge Master) +10","Skill",{"$f":"AND(COUNTIF(adv!A:A,A396))","v":false},null,false]
["Trade (Forge Master) +20","Skill",{"$f":"AND(COUNTIF(adv!A:A,A397))","v":false},null,false]
["Trade (Linguist)","Skill",{"$f":"AND(COUNTIF(adv!A:A,A398))","v":false},null,false]
["Trade (Linguist) +10","Skill",{"$f":"AND(COUNTIF(adv!A:A,A399))","v":false},null,false]
["Trade (Linguist) +20","Skill",{"$f":"AND(COUNTIF(adv!A:A,A400))","v":false},null,false]
["Trade (Remembrancer)","Skill",{"$f":"AND(COUNTIF(adv!A:A,A401))","v":false},null,false]
["Trade (Remembrancer) +10","Skill",{"$f":"AND(COUNTIF(adv!A:A,A402))","v":false},null,false]
["Trade (Remembrancer) +20","Skill",{"$f":"AND(COUNTIF(adv!A:A,A403))","v":false},null,false]
["Trade (Shipwright)","Skill",{"$f":"AND(COUNTIF(adv!A:A,A404))","v":false},null,false]
["Trade (Shipwright) +10","Skill",{"$f":"AND(COUNTIF(adv!A:A,A405))","v":false},null,false]
["Trade (Shipwright) +20","Skill",{"$f":"AND(COUNTIF(adv!A:A,A406))","v":false},null,false]
["Trade (Soothsayer)","Skill",{"$f":"AND(COUNTIF(adv!A:A,A407))","v":false},null,false]
["Trade (Soothsayer) +10","Skill",{"$f":"AND(COUNTIF(adv!A:A,A408))","v":false},null,false]
["Trade (Soothsayer) +20","Skill",{"$f":"AND(COUNTIF(adv!A:A,A409))","v":false},null,false]
["Trade (Technomat)","Skill",{"$f":"AND(COUNTIF(adv!A:A,A410))","v":false},null,false]
["Trade (Technomat) +10","Skill",{"$f":"AND(COUNTIF(adv!A:A,A411))","v":false},null,false]
["Trade (Technomat) +20","Skill",{"$f":"AND(COUNTIF(adv!A:A,A412))","v":false},null,false]
["Wrangling","Skill",{"$f":"AND(COUNTIF(adv!A:A,A413))","v":false},null,false]
["Wrangling +10","Skill",{"$f":"AND(COUNTIF(adv!A:A,A414))","v":false},null,false]
["Wrangling +20","Skill",{"$f":"AND(COUNTIF(adv!A:A,A415))","v":false},null,false]
["Abhor the Witch","Talent",{"$f":"AND(COUNTIF(adv!A:A,A416))","v":false},"Spend Fate Point before a mission to gain resistance to Psychic Powers.",true]
["Air of Authority","Talent",{"$f":"AND(COUNTIF(adv!A:A,A417))","v":false},"Affect more targets with Test.",true]
["Ambidextrous","Talent",{"$f":"AND(COUNTIF(adv!A:A,A418))","v":false},"Use either hand equally well.",true]
["Armour-Monger","Talent",{"$f":"AND(COUNTIF(adv!A:A,A419))","v":false},"Increase the efficacy of physical armour.",false]
["Artificer","Talent",{"$f":"AND(COUNTIF(adv!A:A,A420))","v":false},"Item is upgraded to Exceptional craftsmanship, or becomes Master-Crafted if it was already of Exceptional craftsmanship.",false]
["Assassin Strike","Talent",{"$f":"AND(COUNTIF(adv!A:A,A421))","v":false},"On a successful Acrobatics Test after making a melee attack, character may move as a Free Action.",false]
["Astartes Weapon Training","Talent",{"$f":"AND(COUNTIF(adv!A:A,A422))","v":false},null,true]
["Astartes Weapon Specialisation","Talent",{"$f":"AND(COUNTIF(adv!A:A,A423))","v":false},null,true]
["Autosanguine","Talent",{"$f":"AND(COUNTIF(adv!A:A,A424))","v":false},"Heal 2 damage/day, always Lightly Damaged.",false]
["Basic Weapon Training†","Talent",{"$f":"AND(COUNTIF(adv!A:A,A425))","v":false},"Use weapon group without penalty.",false]
["Basic Weapon Training (Bolt)","Talent",{"$f":"AND(COUNTIF(adv!A:A,A426))","v":false},"Use weapon group without penalty.",false]
["Basic Weapon Training (Las)","Talent",{"$f":"AND(COUNTIF(adv!A:A,A427))","v":false},"Use weapon group without penalty.",false]
["Basic Weapon Training (Launcher)","Talent",{"$f":"AND(COUNTIF(adv!A:A,A428))","v":false},"Use weapon group without penalty.",false]
["Basic Weapon Training (Melta)","Talent",{"$f":"AND(COUNTIF(adv!A:A,A429))","v":false},"Use weapon group without penalty.",false]
["Basic Weapon Training (Plasma)","Talent",{"$f":"AND(COUNTIF(adv!A:A,A430))","v":false},"Use weapon group without penalty.",false]
["Basic Weapon Training (Primitive)","Talent",{"$f":"AND(COUNTIF(adv!A:A,A431))","v":false},"Use weapon group without penalty.",false]
["Basic Weapon Training (SP)","Talent",{"$f":"AND(COUNTIF(adv!A:A,A432))","v":false},"Use weapon group without penalty.",false]
["Basic Weapon Training (Universal)","Talent",{"$f":"AND(COUNTIF(adv!A:A,A433))","v":false},"Use weapon group without penalty.",false]
["Bastion of Iron Will","Talent",{"$f":"AND(COUNTIF(adv!A:A,A434))","v":false},"Double Defensive Psy Rating for Opposed Tests.",true]
["Battle Rage","Talent",{"$f":"AND(COUNTIF(adv!A:A,A435))","v":false},"Parry while frenzied.",true]
["Berserk Charge","Talent",{"$f":"AND(COUNTIF(adv!A:A,A436))","v":false},"Gain +20 bonus when charging.",true]
["Binary Chatter","Talent",{"$f":"AND(COUNTIF(adv!A:A,A437))","v":false},"+10 bonus to control servitors.",true]
["Blademaster","Talent",{"$f":"AND(COUNTIF(adv!A:A,A438))","v":false},"Re-roll missed attack, once per Round.",true]
["Blind Fighting","Talent",{"$f":"AND(COUNTIF(adv!A:A,A439))","v":false},"Suffer half the usual penalties when vision is obscured.",false]
["Bolter Drill","Talent",{"$f":"AND(COUNTIF(adv!A:A,A440))","v":false},"Get an extra shot when firing a bolt weapon on full or semi-auto.",false]
["Born in the Saddle","Talent",{"$f":"AND(COUNTIF(adv!A:A,A441))","v":false},"Ignore penalties for Dodge Reaction, attempt 180 degrees turn.",false]
["Bulging Biceps","Talent",{"$f":"AND(COUNTIF(adv!A:A,A442))","v":false},"Remove bracing requirement for certain weapons.",false]
["Call to Vengeance","Talent",{"$f":"AND(COUNTIF(adv!A:A,A443))","v":false},"Spend Full Action when a Battle-Brother is taken out of action to regain full Cohesion.",true]
["Catfall","Talent",{"$f":"AND(COUNTIF(adv!A:A,A444))","v":false},"Reduce falling damage.",false]
["Chem Geld","Talent",{"$f":"AND(COUNTIF(adv!A:A,A445))","v":false},"Immune to seduction, resistant to charm.",false]
["Chosen Representative","Talent",{"$f":"AND(COUNTIF(adv!A:A,A446))","v":false},null,false]
["Cleanse and Purify","Talent",{"$f":"AND(COUNTIF(adv!A:A,A447))","v":false},"Increases the effect of your flamer attacks.",true]
["Commanding Presence","Talent",{"$f":"AND(COUNTIF(adv!A:A,A448))","v":false},null,false]
["Combat Formation","Talent",{"$f":"AND(COUNTIF(adv!A:A,A449))","v":false},"Use Int Bonus for Initiative.",true]
["Combat Master","Talent",{"$f":"AND(COUNTIF(adv!A:A,A450))","v":false},"Opponents get no bonus for outnumbering the character.",true]
["Combat Sense","Talent",{"$f":"AND(COUNTIF(adv!A:A,A451))","v":false},"Use Per Bonus instead of Ag Bonus for Initiative.",true]
["Concealed Cavity","Talent",{"$f":"AND(COUNTIF(adv!A:A,A452))","v":false},"Character has a secret compartment on his person.",false]
["Counter Attack","Talent",{"$f":"AND(COUNTIF(adv!A:A,A453))","v":false},"Gain free attack with successful Parry.",true]
["Crack Shot","Talent",{"$f":"AND(COUNTIF(adv!A:A,A454))","v":false},"Deal +2 Critical Damage with ranged weapon.",true]
["Crippling Strike","Talent",{"$f":"AND(COUNTIF(adv!A:A,A455))","v":false},"Deal +4 Critical Damage with melee weapon.",true]
["Crushing Blow","Talent",{"$f":"AND(COUNTIF(adv!A:A,A456))","v":false},"Deal +2 Damage with melee weapons.",false]
["Deadeye Shot","Talent",{"$f":"AND(COUNTIF(adv!A:A,A457))","v":false},"Called Shots are at –10 penalty.",true]
["Death From Above","Talent",{"$f":"AND(COUNTIF(adv!A:A,A458))","v":false},"Cause greater damage when charging or dropping into combat using a jump pack.",false]
["Deathwatch Training","Talent",{"$f":"AND(COUNTIF(adv!A:A,A459))","v":false},"The Space Marine gains bonuses when fighting aliens.",true]
["Deflect Shot","Talent",{"$f":"AND(COUNTIF(adv!A:A,A460))","v":false},"Character can parry primitive ranged attacks.",false]
["Die Hard","Talent",{"$f":"AND(COUNTIF(adv!A:A,A461))","v":false},"Re-roll death chance incurred by blood loss.",false]
["Disarm","Talent",{"$f":"AND(COUNTIF(adv!A:A,A462))","v":false},"Force opponent to drop weapon.",false]
["Disturbing Voice","Talent",{"$f":"AND(COUNTIF(adv!A:A,A463))","v":false},"+10 bonus to Intimidate and Interrogation, –10 penalty to Fel.",false]
["Double Team","Talent",{"$f":"AND(COUNTIF(adv!A:A,A464))","v":false},"Gain additional +10 bonus for ganging up.",true]
["Dual Shot","Talent",{"$f":"AND(COUNTIF(adv!A:A,A465))","v":false},"One Ballistic Skill Test hits target twice.",false]
["Dual Strike","Talent",{"$f":"AND(COUNTIF(adv!A:A,A466))","v":false},"One Weapon Skill Test hits target twice.",false]
["Duty Unto Death","Talent",{"$f":"AND(COUNTIF(adv!A:A,A467))","v":false},null,false]
["Electrical Succour","Talent",{"$f":"AND(COUNTIF(adv!A:A,A468))","v":false},"+10 bonus to T Tests to remove Fatigue",false]
["Electro Graft Use","Talent",{"$f":"AND(COUNTIF(adv!A:A,A469))","v":false},"+10 bonus to Inquiry, Tech Use, Common Knowledge.",false]
["Enemy†","Talent",{"$f":"AND(COUNTIF(adv!A:A,A470))","v":false},"An organisation or group particularly despises the character.",true]
["Enemy (Adeptus Arbites)","Talent",{"$f":"AND(COUNTIF(adv!A:A,A471))","v":false},"An organisation or group particularly despises the character.",true]
["Enemy (Adeptus Astra Telepathica)","Talent",{"$f":"AND(COUNTIF(adv!A:A,A472))","v":false},"An organisation or group particularly despises the character.",true]
["Enemy (Adeptus Astartes)","Talent",{"$f":"AND(COUNTIF(adv!A:A,A473))","v":false},"An organisation or group particularly despises the character.",true]
["Enemy (Adeptus Mechanicus)","Talent",{"$f":"AND(COUNTIF(adv!A:A,A474))","v":false},"An organisation or group particularly despises the character.",true]
["Enemy (Adepta Sororitas)","Talent",{"$f":"AND(COUNTIF(adv!A:A,A475))","v":false},"An organisation or group particularly despises the character.",true]
["Enemy (Adeptus Titanicus)","Talent",{"$f":"AND(COUNTIF(adv!A:A,A476))","v":false},"An organisation or group particularly despises the character.",true]
["Enemy (Administratum)","Talent",{"$f":"AND(COUNTIF(adv!A:A,A477))","v":false},"An organisation or group particularly despises the character.",true]
["Enemy (Astropaths)","Talent",{"$f":"AND(COUNTIF(adv!A:A,A478))","v":false},"An organisation or group particularly despises the character.",true]
["Enemy (Chartist Captains)","Talent",{"$f":"AND(COUNTIF(adv!A:A,A479))","v":false},"An organisation or group particularly despises the character.",true]
["Enemy (Ecclesiarchy)","Talent",{"$f":"AND(COUNTIF(adv!A:A,A480))","v":false},"An organisation or group particularly despises the character.",true]
["Enemy (Imperial Guard)","Talent",{"$f":"AND(COUNTIF(adv!A:A,A481))","v":false},"An organisation or group particularly despises the character.",true]
["Enemy (Imperial Navy)","Talent",{"$f":"AND(COUNTIF(adv!A:A,A482))","v":false},"An organisation or group particularly despises the character.",true]
["Enemy (Inquisition)","Talent",{"$f":"AND(COUNTIF(adv!A:A,A483))","v":false},"An organisation or group particularly despises the character.",true]
["Enemy (Navigators)","Talent",{"$f":"AND(COUNTIF(adv!A:A,A484))","v":false},"An organisation or group particularly despises the character.",true]
["Enemy (Officio Assassinorum)","Talent",{"$f":"AND(COUNTIF(adv!A:A,A485))","v":false},"An organisation or group particularly despises the character.",true]
["Enemy (PDF)","Talent",{"$f":"AND(COUNTIF(adv!A:A,A486))","v":false},"An organisation or group particularly despises the character.",true]
["Enemy (Planetary Governors)","Talent",{"$f":"AND(COUNTIF(adv!A:A,A487))","v":false},"An organisation or group particularly despises the character.",true]
["Enemy (Rogue Trader)","Talent",{"$f":"AND(COUNTIF(adv!A:A,A488))","v":false},"An organisation or group particularly despises the character.",true]
["Enemy (Schola Progenium)","Talent",{"$f":"AND(COUNTIF(adv!A:A,A489))","v":false},"An organisation or group particularly despises the character.",true]
["Enemy (Scholastica Psykana)","Talent",{"$f":"AND(COUNTIF(adv!A:A,A490))","v":false},"An organisation or group particularly despises the character.",true]
["Energy Cache","Talent",{"$f":"AND(COUNTIF(adv!A:A,A491))","v":false},"Luminen Blast, Charge and Shock don’t cause Fatigue.",false]
["Enhanced Bionic Frame","Talent",{"$f":"AND(COUNTIF(adv!A:A,A492))","v":false},null,false]
["Eye of Vengeance","Talent",{"$f":"AND(COUNTIF(adv!A:A,A493))","v":false},"Fire a single shot to penetrate armour and increase the chance of Righteous Fury.",true]
["Exemplar of Honour","Talent",{"$f":"AND(COUNTIF(adv!A:A,A494))","v":false},"Exchange a Fate Point for a point of Cohesion.",true]
["Exotic Weapon Training†","Talent",{"$f":"AND(COUNTIF(adv!A:A,A495))","v":false},"Gain proficiency with an exotic weapon type.",true]
["Exotic Weapon Training (Astartes Conversion Beamer)","Talent",{"$f":"AND(COUNTIF(adv!A:A,A496))","v":false},"Gain proficiency with an exotic weapon type.",true]
["Exotic Weapon Training (Astartes Digital Flamer)","Talent",{"$f":"AND(COUNTIF(adv!A:A,A497))","v":false},"Gain proficiency with an exotic weapon type.",true]
["Exotic Weapon Training (Astartes Digital Laser)","Talent",{"$f":"AND(COUNTIF(adv!A:A,A498))","v":false},"Gain proficiency with an exotic weapon type.",true]
["Exotic Weapon Training (Astartes Digital Melta)","Talent",{"$f":"AND(COUNTIF(adv!A:A,A499))","v":false},"Gain proficiency with an exotic weapon type.",true]
["Exotic Weapon Training (Astartes Sniper Rifle)","Talent",{"$f":"AND(COUNTIF(adv!A:A,A500))","v":false},"Gain proficiency with an exotic weapon type.",true]
["Favoured by the Warp","Talent",{"$f":"AND(COUNTIF(adv!A:A,A501))","v":false},"Roll twice for Psychic Phenomena (see page 187) and take better result.",true]
["Fearless","Talent",{"$f":"AND(COUNTIF(adv!A:A,A502))","v":false},"Immune to Fear and Pinning.",true]
["Feedback Screech","Talent",{"$f":"AND(COUNTIF(adv!A:A,A503))","v":false},"30m radius, Test WP or lose Half Action.",false]
["Ferric Lure","Talent",{"$f":"AND(COUNTIF(adv!A:A,A504))","v":false},"WP Test to call 1kg/WP Bonus of metal objects.",false]
["Ferric Summons","Talent",{"$f":"AND(COUNTIF(adv!A:A,A505))","v":false},"WP Test to call 2kg/WP Bonus of metal objects.",false]
["Flame Weapon Training†","Talent",{"$f":"AND(COUNTIF(adv!A:A,A506))","v":false},"Gain proficiency with a group of flame weapons.",false]
["Flame Weapon Training (Astartes Flamer)","Talent",{"$f":"AND(COUNTIF(adv!A:A,A507))","v":false},"Gain proficiency with a group of flame weapons.",false]
["Flame Weapon Training (Astartes Hand Flamer)","Talent",{"$f":"AND(COUNTIF(adv!A:A,A508))","v":false},"Gain proficiency with a group of flame weapons.",false]
["Flame Weapon Training (Astartes Heavy Flamer)","Talent",{"$f":"AND(COUNTIF(adv!A:A,A509))","v":false},"Gain proficiency with a group of flame weapons.",false]
["Flesh Render","Talent",{"$f":"AND(COUNTIF(adv!A:A,A510))","v":false},"Cause additional damage with chain weapons.",false]
["Foresight","Talent",{"$f":"AND(COUNTIF(adv!A:A,A511))","v":false},"Contemplate to gain +10 bonus on next Test.",true]
["Frenzy","Talent",{"$f":"AND(COUNTIF(adv!A:A,A512))","v":false},"Enter psychotic rage to gain combat bonuses.",true]
["Furious Assault","Talent",{"$f":"AND(COUNTIF(adv!A:A,A513))","v":false},"On a successful WS Test, gain a free second attack.",true]
["Good Reputation†","Talent",{"$f":"AND(COUNTIF(adv!A:A,A514))","v":false},"The character has a good reputation amongst a certain group.",true]
["Good Reputation (Adeptus Arbites)","Talent",{"$f":"AND(COUNTIF(adv!A:A,A515))","v":false},"The character has a good reputation amongst a certain group.",true]
["Good Reputation (Adeptus Astra Telepathica)","Talent",{"$f":"AND(COUNTIF(adv!A:A,A516))","v":false},"The character has a good reputation amongst a certain group.",true]
["Good Reputation (Adeptus Astartes)","Talent",{"$f":"AND(COUNTIF(adv!A:A,A517))","v":false},"The character has a good reputation amongst a certain group.",true]
["Good Reputation (Adeptus Mechanicus)","Talent",{"$f":"AND(COUNTIF(adv!A:A,A518))","v":false},"The character has a good reputation amongst a certain group.",true]
["Good Reputation (Adepta Sororitas)","Talent",{"$f":"AND(COUNTIF(adv!A:A,A519))","v":false},"The character has a good reputation amongst a certain group.",true]
["Good Reputation (Adeptus Titanicus)","Talent",{"$f":"AND(COUNTIF(adv!A:A,A520))","v":false},"The character has a good reputation amongst a certain group.",true]
["Good Reputation (Administratum)","Talent",{"$f":"AND(COUNTIF(adv!A:A,A521))","v":false},"The character has a good reputation amongst a certain group.",true]
["Good Reputation (Astropaths)","Talent",{"$f":"AND(COUNTIF(adv!A:A,A522))","v":false},"The character has a good reputation amongst a certain group.",true]
["Good Reputation (Chartist Captains)","Talent",{"$f":"AND(COUNTIF(adv!A:A,A523))","v":false},"The character has a good reputation amongst a certain group.",true]
["Good Reputation (Ecclesiarchy)","Talent",{"$f":"AND(COUNTIF(adv!A:A,A524))","v":false},"The character has a good reputation amongst a certain group.",true]
["Good Reputation (Imperial Guard)","Talent",{"$f":"AND(COUNTIF(adv!A:A,A525))","v":false},"The character has a good reputation amongst a certain group.",true]
["Good Reputation (Imperial Navy)","Talent",{"$f":"AND(COUNTIF(adv!A:A,A526))","v":false},"The character has a good reputation amongst a certain group.",true]
["Good Reputation (Inquisition)","Talent",{"$f":"AND(COUNTIF(adv!A:A,A527))","v":false},"The character has a good reputation amongst a certain group.",true]
["Good Reputation (Navigators)","Talent",{"$f":"AND(COUNTIF(adv!A:A,A528))","v":false},"The character has a good reputation amongst a certain group.",true]
["Good Reputation (Officio Assassinorum)","Talent",{"$f":"AND(COUNTIF(adv!A:A,A529))","v":false},"The character has a good reputation amongst a certain group.",true]
["Good Reputation (PDF)","Talent",{"$f":"AND(COUNTIF(adv!A:A,A530))","v":false},"The character has a good reputation amongst a certain group.",true]
["Good Reputation (Planetary Governors)","Talent",{"$f":"AND(COUNTIF(adv!A:A,A531))","v":false},"The character has a good reputation amongst a certain group.",true]
["Good Reputation (Rogue Trader)","Talent",{"$f":"AND(COUNTIF(adv!A:A,A532))","v":false},"The character has a good reputation amongst a certain group.",true]
["Good Reputation (Schola Progenium)","Talent",{"$f":"AND(COUNTIF(adv!A:A,A533))","v":false},"The character has a good reputation amongst a certain group.",true]
["Good Reputation (Scholastica Psykana)","Talent",{"$f":"AND(COUNTIF(adv!A:A,A534))","v":false},"The character has a good reputation amongst a certain group.",true]
["Gun Blessing","Talent",{"$f":"AND(COUNTIF(adv!A:A,A535))","v":false},"Un-jam Int Bonus guns in 10m radius.",false]
["Gunslinger","Talent",{"$f":"AND(COUNTIF(adv!A:A,A536))","v":false},"Fighting with two pistols incurs only –10 penalty.",true]
["Guerilla Training","Talent",{"$f":"AND(COUNTIF(adv!A:A,A537))","v":false},"Ignore penalties to Silent Move and Concealment normally inflicted by power armour.",false]
["Hammer Blow","Talent",{"$f":"AND(COUNTIF(adv!A:A,A538))","v":false},"Make a thunderous single strike with a melee weapon.",false]
["Hard Target","Talent",{"$f":"AND(COUNTIF(adv!A:A,A539))","v":false},"Opponents take –20 to BS Tests when character charges or runs.",false]
["Hardy","Talent",{"$f":"AND(COUNTIF(adv!A:A,A540))","v":false},"You always heal as if Lightly Damaged.",false]
["Hatred†","Talent",{"$f":"AND(COUNTIF(adv!A:A,A541))","v":false},"Gain +10 bonus to attack hated creatures.",true]
["Hatred (Chaos Space Marines)","Talent",{"$f":"AND(COUNTIF(adv!A:A,A542))","v":false},"Gain +10 bonus to attack hated creatures.",true]
["Hatred (Daemons)","Talent",{"$f":"AND(COUNTIF(adv!A:A,A543))","v":false},"Gain +10 bonus to attack hated creatures.",true]
["Hatred (Dark Eldar)","Talent",{"$f":"AND(COUNTIF(adv!A:A,A544))","v":false},"Gain +10 bonus to attack hated creatures.",true]
["Hatred (Heretics)","Talent",{"$f":"AND(COUNTIF(adv!A:A,A545))","v":false},"Gain +10 bonus to attack hated creatures.",true]
["Hatred (Mutants)","Talent",{"$f":"AND(COUNTIF(adv!A:A,A546))","v":false},"Gain +10 bonus to attack hated creatures.",true]
["Hatred (Psykers)","Talent",{"$f":"AND(COUNTIF(adv!A:A,A547))","v":false},"Gain +10 bonus to attack hated creatures.",true]
["Hatred (Tyranids)","Talent",{"$f":"AND(COUNTIF(adv!A:A,A548))","v":false},"Gain +10 bonus to attack hated creatures.",true]
["Hatred (Orks)","Talent",{"$f":"AND(COUNTIF(adv!A:A,A549))","v":false},"Gain +10 bonus to attack hated creatures.",true]
["Hatred (Tau)","Talent",{"$f":"AND(COUNTIF(adv!A:A,A550))","v":false},"Gain +10 bonus to attack hated creatures.",true]
["Hatred (Eldar)","Talent",{"$f":"AND(COUNTIF(adv!A:A,A551))","v":false},"Gain +10 bonus to attack hated creatures.",true]
["Hatred (The Traitor Legions)","Talent",{"$f":"AND(COUNTIF(adv!A:A,A552))","v":false},"Gain +10 bonus to attack hated creatures.",true]
["Hatred (Word Bearers Traitor Legionnaires)","Talent",{"$f":"AND(COUNTIF(adv!A:A,A553))","v":false},"Gain +10 bonus to attack hated creatures.",true]
["Heavy Weapon Training†","Talent",{"$f":"AND(COUNTIF(adv!A:A,A554))","v":false},"Gain proficiency with a heavy weapon group.",false]
["Heavy Weapon Training (Bolt)","Talent",{"$f":"AND(COUNTIF(adv!A:A,A555))","v":false},"Gain proficiency with a heavy weapon group.",false]
["Heavy Weapon Training (Las)","Talent",{"$f":"AND(COUNTIF(adv!A:A,A556))","v":false},"Gain proficiency with a heavy weapon group.",false]
["Heavy Weapon Training (Launcher)","Talent",{"$f":"AND(COUNTIF(adv!A:A,A557))","v":false},"Gain proficiency with a heavy weapon group.",false]
["Heavy Weapon Training (Melta)","Talent",{"$f":"AND(COUNTIF(adv!A:A,A558))","v":false},"Gain proficiency with a heavy weapon group.",false]
["Heavy Weapon Training (Plasma)","Talent",{"$f":"AND(COUNTIF(adv!A:A,A559))","v":false},"Gain proficiency with a heavy weapon group.",false]
["Heavy Weapon Training (Primitive)","Talent",{"$f":"AND(COUNTIF(adv!A:A,A560))","v":false},"Gain proficiency with a heavy weapon group.",false]
["Heavy Weapon Training (SP)","Talent",{"$f":"AND(COUNTIF(adv!A:A,A561))","v":false},"Gain proficiency with a heavy weapon group.",false]
["Heightened Senses†","Talent",{"$f":"AND(COUNTIF(adv!A:A,A562))","v":false},"Gain +10 bonus to particular sense.",false]
["Heightened Senses (Sight)","Talent",{"$f":"AND(COUNTIF(adv!A:A,A563))","v":false},"Gain +10 bonus to particular sense.",false]
["Heightened Senses (Sound)","Talent",{"$f":"AND(COUNTIF(adv!A:A,A564))","v":false},"Gain +10 bonus to particular sense.",false]
["Heightened Senses (Smell)","Talent",{"$f":"AND(COUNTIF(adv!A:A,A565))","v":false},"Gain +10 bonus to particular sense.",false]
["Heightened Senses (Taste)","Talent",{"$f":"AND(COUNTIF(adv!A:A,A566))","v":false},"Gain +10 bonus to particular sense.",false]
["Heightened Senses (Touch)","Talent",{"$f":"AND(COUNTIF(adv!A:A,A567))","v":false},"Gain +10 bonus to particular sense.",false]
["Hip Shooting","Talent",{"$f":"AND(COUNTIF(adv!A:A,A568))","v":false},"Gain a free attack while moving.",false]
["Hunter of Aliens","Talent",{"$f":"AND(COUNTIF(adv!A:A,A569))","v":false},"Gain an advantage in combating aliens.",true]
["Hunter of Aliens (Orks ONLY)","Talent",{"$f":"AND(COUNTIF(adv!A:A,A570))","v":false},"Gain an advantage in combating aliens.",false]
["Icon of Duty","Talent",{"$f":"AND(COUNTIF(adv!A:A,A571))","v":false},null,false]
["Improved Warp Sense","Talent",{"$f":"AND(COUNTIF(adv!A:A,A572))","v":false},"Allows Psyniscience Test as Free Action.",true]
["Independent Targeting","Talent",{"$f":"AND(COUNTIF(adv!A:A,A573))","v":false},"Fire at two or more targets further than 10m apart.",true]
["Infused Knowledge","Talent",{"$f":"AND(COUNTIF(adv!A:A,A574))","v":false},"Treat Common and Scholastic Lore as Basic Skills.",true]
["Inspire Wrath","Talent",{"$f":"AND(COUNTIF(adv!A:A,A575))","v":false},"Inspire crowds to anger.",true]
["Into the Jaws of Hell","Talent",{"$f":"AND(COUNTIF(adv!A:A,A576))","v":false},"Minions gain immunity to Pinning and Fear whilst in character’s presence.",true]
["Iron Discipline","Talent",{"$f":"AND(COUNTIF(adv!A:A,A577))","v":false},"Minions can re-roll Fear and Pinning Tests.",true]
["Iron Jaw","Talent",{"$f":"AND(COUNTIF(adv!A:A,A578))","v":false},"Test Toughness to overcome Stunning.",false]
["Jaded","Talent",{"$f":"AND(COUNTIF(adv!A:A,A579))","v":false},"Never gain IP from ordinary horrors.",false]
["Killing Strike","Talent",{"$f":"AND(COUNTIF(adv!A:A,A580))","v":false},"Spend a Fate Point to make your melee attack impossible to parry or dodge.",true]
["Last Man Standing","Talent",{"$f":"AND(COUNTIF(adv!A:A,A581))","v":false},"Immune to Pinning by Pistols and Basic Weapons. Improves Cover.",false]
["Leap Up","Talent",{"$f":"AND(COUNTIF(adv!A:A,A582))","v":false},"Stand up as a Free Action.",false]
["Light Sleeper","Talent",{"$f":"AND(COUNTIF(adv!A:A,A583))","v":false},"Count as awake, even when asleep.",false]
["Lightning Attack","Talent",{"$f":"AND(COUNTIF(adv!A:A,A584))","v":false},"Attack three times with a Full Action.",true]
["Lightning Reflexes","Talent",{"$f":"AND(COUNTIF(adv!A:A,A585))","v":false},"Add twice Ag Bonus to Initiative rolls.",false]
["Litany of Hate","Talent",{"$f":"AND(COUNTIF(adv!A:A,A586))","v":false},"Extend benefits of Hatred to allies.",true]
["Logis Implant","Talent",{"$f":"AND(COUNTIF(adv!A:A,A587))","v":false},"+10 bonus on WS and BS on successful Tech-Use Test.",false]
["Luminen Blast","Talent",{"$f":"AND(COUNTIF(adv!A:A,A588))","v":false},"1d10+WP Bonus Energy Damage bolt. Causes Fatigue.",false]
["Luminen Charge","Talent",{"$f":"AND(COUNTIF(adv!A:A,A589))","v":false},"Test to power/charge tech. Causes Fatigue.",false]
["Luminen Shock","Talent",{"$f":"AND(COUNTIF(adv!A:A,A590))","v":false},"1d10+3 Energy Damage shock. Causes Fatigue.",false]
["Machinator Array","Talent",{"$f":"AND(COUNTIF(adv!A:A,A591))","v":false},"The character has advanced Mechanicus augmetics.",false]
["Maglev Grace","Talent",{"$f":"AND(COUNTIF(adv!A:A,A592))","v":false},"Hover 1d10+TB minutes once per day.",false]
["Maglev Transcendence","Talent",{"$f":"AND(COUNTIF(adv!A:A,A593))","v":false},"Hover 2d10+TB minutes twice per day.",false]
["Marksman","Talent",{"$f":"AND(COUNTIF(adv!A:A,A594))","v":false},"No penalties for firing at long or extreme range.",true]
["Master Chirurgeon","Talent",{"$f":"AND(COUNTIF(adv!A:A,A595))","v":false},"Perform advanced medical procedures.",false]
["Master Enginseer","Talent",{"$f":"AND(COUNTIF(adv!A:A,A596))","v":false},"Use a Fate Point for automatic success.",false]
["Master Orator","Talent",{"$f":"AND(COUNTIF(adv!A:A,A597))","v":false},"Affect 10 times the normal numbers with a Fellowship Test.",true]
["Mechadendrite Use†","Talent",{"$f":"AND(COUNTIF(adv!A:A,A598))","v":false},"The character can use a type of Mechadendrite.",false]
["Mechadendrite Use (Servo-arm)","Talent",{"$f":"AND(COUNTIF(adv!A:A,A599))","v":false},"The character can use a type of Mechadendrite.",false]
["Mechadendrite Use (Weapon)","Talent",{"$f":"AND(COUNTIF(adv!A:A,A600))","v":false},"The character can use a type of Mechadendrite.",false]
["Mechadendrite Use (Utility)","Talent",{"$f":"AND(COUNTIF(adv!A:A,A601))","v":false},"The character can use a type of Mechadendrite.",false]
["Meditation","Talent",{"$f":"AND(COUNTIF(adv!A:A,A602))","v":false},"The character may enter a trance to remove Fatigue.",false]
["Melee Weapon Training†","Talent",{"$f":"AND(COUNTIF(adv!A:A,A603))","v":false},"Gain proficiency with a group of melee weapons.",false]
["Melee Weapon Training (Chain)","Talent",{"$f":"AND(COUNTIF(adv!A:A,A604))","v":false},"Gain proficiency with a group of melee weapons.",false]
["Melee Weapon Training (Shock)","Talent",{"$f":"AND(COUNTIF(adv!A:A,A605))","v":false},"Gain proficiency with a group of melee weapons.",false]
["Melee Weapon Training (Power)","Talent",{"$f":"AND(COUNTIF(adv!A:A,A606))","v":false},"Gain proficiency with a group of melee weapons.",false]
["Melee Weapon Training (Primitive)","Talent",{"$f":"AND(COUNTIF(adv!A:A,A607))","v":false},"Gain proficiency with a group of melee weapons.",false]
["Melee Weapon Training (Universal)","Talent",{"$f":"AND(COUNTIF(adv!A:A,A608))","v":false},"Gain proficiency with a group of melee weapons.",false]
["Mental Rage","Talent",{"$f":"AND(COUNTIF(adv!A:A,A609))","v":false},"The character may use Psychic Powers while in the throes of frenzy.",true]
["Mighty Shot","Talent",{"$f":"AND(COUNTIF(adv!A:A,A610))","v":false},"Deal +2 Damage with ranged attacks.",false]
["Mimic","Talent",{"$f":"AND(COUNTIF(adv!A:A,A611))","v":false},"The character can copy voices.",false]
["Nerves of Steel","Talent",{"$f":"AND(COUNTIF(adv!A:A,A612))","v":false},"Re-roll failed tests to avoid pinning.",false]
["Orthoproxy","Talent",{"$f":"AND(COUNTIF(adv!A:A,A613))","v":false},"+20 bonus to resist mind control or interrogation.",false]
["Paranoia","Talent",{"$f":"AND(COUNTIF(adv!A:A,A614))","v":false},"The character is alert for danger.",true]
["Peer†","Talent",{"$f":"AND(COUNTIF(adv!A:A,A615))","v":false},"Gain +10 bonus on Fel Tests to interact with organisation.",true]
["Peer (Adeptus Arbites)","Talent",{"$f":"AND(COUNTIF(adv!A:A,A616))","v":false},"Gain +10 bonus on Fel Tests to interact with organisation.",true]
["Peer (Adeptus Astra Telepathica)","Talent",{"$f":"AND(COUNTIF(adv!A:A,A617))","v":false},"Gain +10 bonus on Fel Tests to interact with organisation.",true]
["Peer (Adeptus Astartes)","Talent",{"$f":"AND(COUNTIF(adv!A:A,A618))","v":false},"Gain +10 bonus on Fel Tests to interact with organisation.",true]
["Peer (Adeptus Mechanicus)","Talent",{"$f":"AND(COUNTIF(adv!A:A,A619))","v":false},"Gain +10 bonus on Fel Tests to interact with organisation.",true]
["Peer (Adepta Sororitas)","Talent",{"$f":"AND(COUNTIF(adv!A:A,A620))","v":false},"Gain +10 bonus on Fel Tests to interact with organisation.",true]
["Peer (Adeptus Titanicus)","Talent",{"$f":"AND(COUNTIF(adv!A:A,A621))","v":false},"Gain +10 bonus on Fel Tests to interact with organisation.",true]
["Peer (Administratum)","Talent",{"$f":"AND(COUNTIF(adv!A:A,A622))","v":false},"Gain +10 bonus on Fel Tests to interact with organisation.",true]
["Peer (Astropaths)","Talent",{"$f":"AND(COUNTIF(adv!A:A,A623))","v":false},"Gain +10 bonus on Fel Tests to interact with organisation.",true]
["Peer (Chartist Captains)","Talent",{"$f":"AND(COUNTIF(adv!A:A,A624))","v":false},"Gain +10 bonus on Fel Tests to interact with organisation.",true]
["Peer (Ecclesiarchy)","Talent",{"$f":"AND(COUNTIF(adv!A:A,A625))","v":false},"Gain +10 bonus on Fel Tests to interact with organisation.",true]
["Peer (Imperial Guard)","Talent",{"$f":"AND(COUNTIF(adv!A:A,A626))","v":false},"Gain +10 bonus on Fel Tests to interact with organisation.",true]
["Peer (Imperial Navy)","Talent",{"$f":"AND(COUNTIF(adv!A:A,A627))","v":false},"Gain +10 bonus on Fel Tests to interact with organisation.",true]
["Peer (Inquisition)","Talent",{"$f":"AND(COUNTIF(adv!A:A,A628))","v":false},"Gain +10 bonus on Fel Tests to interact with organisation.",true]
["Peer (Navigators)","Talent",{"$f":"AND(COUNTIF(adv!A:A,A629))","v":false},"Gain +10 bonus on Fel Tests to interact with organisation.",true]
["Peer (Officio Assassinorum)","Talent",{"$f":"AND(COUNTIF(adv!A:A,A630))","v":false},"Gain +10 bonus on Fel Tests to interact with organisation.",true]
["Peer (PDF)","Talent",{"$f":"AND(COUNTIF(adv!A:A,A631))","v":false},"Gain +10 bonus on Fel Tests to interact with organisation.",true]
["Peer (Planetary Governors)","Talent",{"$f":"AND(COUNTIF(adv!A:A,A632))","v":false},"Gain +10 bonus on Fel Tests to interact with organisation.",true]
["Peer (Rogue Trader)","Talent",{"$f":"AND(COUNTIF(adv!A:A,A633))","v":false},"Gain +10 bonus on Fel Tests to interact with organisation.",true]
["Peer (Schola Progenium)","Talent",{"$f":"AND(COUNTIF(adv!A:A,A634))","v":false},"Gain +10 bonus on Fel Tests to interact with organisation.",true]
["Peer (Scholastica Psykana)","Talent",{"$f":"AND(COUNTIF(adv!A:A,A635))","v":false},"Gain +10 bonus on Fel Tests to interact with organisation.",true]
["Peer (Ultramarines)","Talent",{"$f":"AND(COUNTIF(adv!A:A,A636))","v":false},"Gain +10 bonus on Fel Tests to interact with organisation.",true]
["Pistol Weapon Training†","Talent",{"$f":"AND(COUNTIF(adv!A:A,A637))","v":false},"Gain proficiency with a group of pistol weapons.",false]
["Pistol Weapon Training (Bolt)","Talent",{"$f":"AND(COUNTIF(adv!A:A,A638))","v":false},"Gain proficiency with a group of pistol weapons.",false]
["Pistol Weapon Training (Las)","Talent",{"$f":"AND(COUNTIF(adv!A:A,A639))","v":false},"Gain proficiency with a group of pistol weapons.",false]
["Pistol Weapon Training (Launcher)","Talent",{"$f":"AND(COUNTIF(adv!A:A,A640))","v":false},"Gain proficiency with a group of pistol weapons.",false]
["Pistol Weapon Training (Melta)","Talent",{"$f":"AND(COUNTIF(adv!A:A,A641))","v":false},"Gain proficiency with a group of pistol weapons.",false]
["Pistol Weapon Training (Plasma)","Talent",{"$f":"AND(COUNTIF(adv!A:A,A642))","v":false},"Gain proficiency with a group of pistol weapons.",false]
["Pistol Weapon Training (Primitive)","Talent",{"$f":"AND(COUNTIF(adv!A:A,A643))","v":false},"Gain proficiency with a group of pistol weapons.",false]
["Pistol Weapon Training (SP)","Talent",{"$f":"AND(COUNTIF(adv!A:A,A644))","v":false},"Gain proficiency with a group of pistol weapons.",false]
["Pistol Weapon Training (Universal)","Talent",{"$f":"AND(COUNTIF(adv!A:A,A645))","v":false},"Gain proficiency with a group of pistol weapons.",false]
["Polyglot","Talent",{"$f":"AND(COUNTIF(adv!A:A,A646))","v":false},"The character has an innate ability with languages.",true]
["Precise Blow","Talent",{"$f":"AND(COUNTIF(adv!A:A,A647))","v":false},"No penalty for attacks against specific locations.",true]
["Preternatural Speed","Talent",{"$f":"AND(COUNTIF(adv!A:A,A648))","v":false},"Use Swift and Lightning Attack as a Half Action and when charging.",false]
["Prosanguine","Talent",{"$f":"AND(COUNTIF(adv!A:A,A649))","v":false},"Heal 1d5 Damage once per day.",false]
["Psy Rating 1","Talent",{"$f":"AND(COUNTIF(adv!A:A,A650))","v":false},"Become a more powerful Psyker, rated 1 –10.",true]
["Psy Rating 2","Talent",{"$f":"AND(COUNTIF(adv!A:A,A651))","v":false},"Become a more powerful Psyker, rated 1 –10.",true]
["Psy Rating 3","Talent",{"$f":"AND(COUNTIF(adv!A:A,A652))","v":false},"Become a more powerful Psyker, rated 1 –10.",true]
["Psy Rating 4","Talent",{"$f":"AND(COUNTIF(adv!A:A,A653))","v":false},"Become a more powerful Psyker, rated 1 –10.",true]
["Psy Rating 5","Talent",{"$f":"AND(COUNTIF(adv!A:A,A654))","v":false},"Become a more powerful Psyker, rated 1 –10.",true]
["Psy Rating 6","Talent",{"$f":"AND(COUNTIF(adv!A:A,A655))","v":false},"Become a more powerful Psyker, rated 1 –10.",true]
["Psy Rating 7","Talent",{"$f":"AND(COUNTIF(adv!A:A,A656))","v":false},"Become a more powerful Psyker, rated 1 –10.",true]
["Psy Rating 8","Talent",{"$f":"AND(COUNTIF(adv!A:A,A657))","v":false},"Become a more powerful Psyker, rated 1 –10.",true]
["Psy Rating 9","Talent",{"$f":"AND(COUNTIF(adv!A:A,A658))","v":false},"Become a more powerful Psyker, rated 1 –10.",true]
["Psy Rating 10","Talent",{"$f":"AND(COUNTIF(adv!A:A,A659))","v":false},"Become a more powerful Psyker, rated 1 –10.",true]
["Psychic Technique†","Talent",{"$f":"AND(COUNTIF(adv!A:A,A660))","v":false},"Gain an extra Psychic Technique.",true]
["Psychic Technique (Astrotelepathy)","Talent",{"$f":"AND(COUNTIF(adv!A:A,A661))","v":false},"Gain an extra Psychic Technique.",true]
["Psychic Technique (Compel)","Talent",{"$f":"AND(COUNTIF(adv!A:A,A662))","v":false},"Gain an extra Psychic Technique.",true]
["Psychic Technique (Dominate)","Talent",{"$f":"AND(COUNTIF(adv!A:A,A663))","v":false},"Gain an extra Psychic Technique.",true]
["Psychic Technique (Inspire)","Talent",{"$f":"AND(COUNTIF(adv!A:A,A664))","v":false},"Gain an extra Psychic Technique.",true]
["Psychic Technique (Long-range Telepathy)","Talent",{"$f":"AND(COUNTIF(adv!A:A,A665))","v":false},"Gain an extra Psychic Technique.",true]
["Psychic Technique (Mind Probe)","Talent",{"$f":"AND(COUNTIF(adv!A:A,A666))","v":false},"Gain an extra Psychic Technique.",true]
["Psychic Technique (Mind Scan)","Talent",{"$f":"AND(COUNTIF(adv!A:A,A667))","v":false},"Gain an extra Psychic Technique.",true]
["Psychic Technique (Short-range Telepathy)","Talent",{"$f":"AND(COUNTIF(adv!A:A,A668))","v":false},"Gain an extra Psychic Technique.",true]
["Psychic Technique (Augury)","Talent",{"$f":"AND(COUNTIF(adv!A:A,A669))","v":false},"Gain an extra Psychic Technique.",true]
["Psychic Technique (Divination)","Talent",{"$f":"AND(COUNTIF(adv!A:A,A670))","v":false},"Gain an extra Psychic Technique.",true]
["Psychic Technique (Lifting the Veil)","Talent",{"$f":"AND(COUNTIF(adv!A:A,A671))","v":false},"Gain an extra Psychic Technique.",true]
["Psychic Technique (Possibility Shield)","Talent",{"$f":"AND(COUNTIF(adv!A:A,A672))","v":false},"Gain an extra Psychic Technique.",true]
["Psychic Technique (Psychometry)","Talent",{"$f":"AND(COUNTIF(adv!A:A,A673))","v":false},"Gain an extra Psychic Technique.",true]
["Psychic Technique (Reading)","Talent",{"$f":"AND(COUNTIF(adv!A:A,A674))","v":false},"Gain an extra Psychic Technique.",true]
["Psychic Technique (Avenger)","Talent",{"$f":"AND(COUNTIF(adv!A:A,A675))","v":false},"Gain an extra Psychic Technique.",true]
["Psychic Technique (Force Dome)","Talent",{"$f":"AND(COUNTIF(adv!A:A,A676))","v":false},"Gain an extra Psychic Technique.",true]
["Psychic Technique (The Gate of Infinity)","Talent",{"$f":"AND(COUNTIF(adv!A:A,A677))","v":false},"Gain an extra Psychic Technique.",true]
["Psychic Technique (Iron Arm)","Talent",{"$f":"AND(COUNTIF(adv!A:A,A678))","v":false},"Gain an extra Psychic Technique.",true]
["Psychic Technique (Machine Curse)","Talent",{"$f":"AND(COUNTIF(adv!A:A,A679))","v":false},"Gain an extra Psychic Technique.",true]
["Psychic Technique (Might of the Ancients)","Talent",{"$f":"AND(COUNTIF(adv!A:A,A680))","v":false},"Gain an extra Psychic Technique.",true]
["Psychic Technique (Smite)","Talent",{"$f":"AND(COUNTIF(adv!A:A,A681))","v":false},"Gain an extra Psychic Technique.",true]
["Psychic Technique (Veil of Time)","Talent",{"$f":"AND(COUNTIF(adv!A:A,A682))","v":false},"Gain an extra Psychic Technique.",true]
["Psychic Technique (Vortex of Doom)","Talent",{"$f":"AND(COUNTIF(adv!A:A,A683))","v":false},"Gain an extra Psychic Technique.",true]
["Psychic Technique (Blood Boil)","Talent",{"$f":"AND(COUNTIF(adv!A:A,A684))","v":false},"Gain an extra Psychic Technique.",true]
["Psychic Technique (Blood Lance)","Talent",{"$f":"AND(COUNTIF(adv!A:A,A685))","v":false},"Gain an extra Psychic Technique.",true]
["Psychic Technique (Fear the Darkness)","Talent",{"$f":"AND(COUNTIF(adv!A:A,A686))","v":false},"Gain an extra Psychic Technique.",true]
["Psychic Technique (Might of Heroes)","Talent",{"$f":"AND(COUNTIF(adv!A:A,A687))","v":false},"Gain an extra Psychic Technique.",true]
["Psychic Technique (Shackle Soul)","Talent",{"$f":"AND(COUNTIF(adv!A:A,A688))","v":false},"Gain an extra Psychic Technique.",true]
["Psychic Technique (Wings of Sanguinius)","Talent",{"$f":"AND(COUNTIF(adv!A:A,A689))","v":false},"Gain an extra Psychic Technique.",true]
["Psychic Technique (Force Barrier)","Talent",{"$f":"AND(COUNTIF(adv!A:A,A690))","v":false},"Gain an extra Psychic Technique.",true]
["Psychic Technique (Hellfire)","Talent",{"$f":"AND(COUNTIF(adv!A:A,A691))","v":false},"Gain an extra Psychic Technique.",true]
["Psychic Technique (Mask of Shadows)","Talent",{"$f":"AND(COUNTIF(adv!A:A,A692))","v":false},"Gain an extra Psychic Technique.",true]
["Psychic Technique (Mind Worm)","Talent",{"$f":"AND(COUNTIF(adv!A:A,A693))","v":false},"Gain an extra Psychic Technique.",true]
["Psychic Technique (True Strike)","Talent",{"$f":"AND(COUNTIF(adv!A:A,A694))","v":false},"Gain an extra Psychic Technique.",true]
["Psychic Technique (Weaken Resolve)","Talent",{"$f":"AND(COUNTIF(adv!A:A,A695))","v":false},"Gain an extra Psychic Technique.",true]
["Psychic Technique (Fury of the Wolf Spirits)","Talent",{"$f":"AND(COUNTIF(adv!A:A,A696))","v":false},"Gain an extra Psychic Technique.",true]
["Psychic Technique (Living Lightning)","Talent",{"$f":"AND(COUNTIF(adv!A:A,A697))","v":false},"Gain an extra Psychic Technique.",true]
["Psychic Technique (Storm Caller)","Talent",{"$f":"AND(COUNTIF(adv!A:A,A698))","v":false},"Gain an extra Psychic Technique.",true]
["Psychic Technique (Tempest’s Wrath)","Talent",{"$f":"AND(COUNTIF(adv!A:A,A699))","v":false},"Gain an extra Psychic Technique.",true]
["Psychic Technique (Thunderclap)","Talent",{"$f":"AND(COUNTIF(adv!A:A,A700))","v":false},"Gain an extra Psychic Technique.",true]
["Psychic Technique (Ancestors’ Rage)","Talent",{"$f":"AND(COUNTIF(adv!A:A,A701))","v":false},"Gain an extra Psychic Technique.",true]
["Psychic Technique (Call to Arms)","Talent",{"$f":"AND(COUNTIF(adv!A:A,A702))","v":false},"Gain an extra Psychic Technique.",true]
["Psychic Technique (Crown of Lightning)","Talent",{"$f":"AND(COUNTIF(adv!A:A,A703))","v":false},"Gain an extra Psychic Technique.",true]
["Psychic Technique (Hammer of the Emperor)","Talent",{"$f":"AND(COUNTIF(adv!A:A,A704))","v":false},"Gain an extra Psychic Technique.",true]
["Psychic Technique (Mark of Scorn)","Talent",{"$f":"AND(COUNTIF(adv!A:A,A705))","v":false},"Gain an extra Psychic Technique.",true]
["Psychic Technique (Thunders Shell)","Talent",{"$f":"AND(COUNTIF(adv!A:A,A706))","v":false},"Gain an extra Psychic Technique.",true]
["Psychic Technique (Fury of the Ancients)","Talent",{"$f":"AND(COUNTIF(adv!A:A,A707))","v":false},"Gain an extra Psychic Technique.",true]
["Psychic Technique (Glory of the Emperor)","Talent",{"$f":"AND(COUNTIF(adv!A:A,A708))","v":false},"Gain an extra Psychic Technique.",true]
["Psychic Technique (Inspiring Word)","Talent",{"$f":"AND(COUNTIF(adv!A:A,A709))","v":false},"Gain an extra Psychic Technique.",true]
["Psychic Technique (Paragon)","Talent",{"$f":"AND(COUNTIF(adv!A:A,A710))","v":false},"Gain an extra Psychic Technique.",true]
["Psychic Technique (War Cry)","Talent",{"$f":"AND(COUNTIF(adv!A:A,A711))","v":false},"Gain an extra Psychic Technique.",true]
["Psychic Technique (Word of the Emperor)","Talent",{"$f":"AND(COUNTIF(adv!A:A,A712))","v":false},"Gain an extra Psychic Technique.",true]
["Psychic Technique (Noble Praetorian)","Talent",{"$f":"AND(COUNTIF(adv!A:A,A713))","v":false},"Gain an extra Psychic Technique.",true]
["Psychic Technique (Ultimate Sacrifice)","Talent",{"$f":"AND(COUNTIF(adv!A:A,A714))","v":false},"Gain an extra Psychic Technique.",true]
["Psychic Technique (Stonebane)","Talent",{"$f":"AND(COUNTIF(adv!A:A,A715))","v":false},"Gain an extra Psychic Technique.",true]
["Psychic Technique (The Golden Son)","Talent",{"$f":"AND(COUNTIF(adv!A:A,A716))","v":false},"Gain an extra Psychic Technique.",true]
["Psychic Technique (Into the Crucible)","Talent",{"$f":"AND(COUNTIF(adv!A:A,A717))","v":false},"Gain an extra Psychic Technique.",true]
["Psychic Technique (Wave of Penance)","Talent",{"$f":"AND(COUNTIF(adv!A:A,A718))","v":false},"Gain an extra Psychic Technique.",true]
["Psychic Technique (Alien Minds)","Talent",{"$f":"AND(COUNTIF(adv!A:A,A719))","v":false},"Gain an extra Psychic Technique.",true]
["Psychic Technique (Bond of Brotherhood)","Talent",{"$f":"AND(COUNTIF(adv!A:A,A720))","v":false},"Gain an extra Psychic Technique.",true]
["Psychic Technique (Deus Ex Ferrum)","Talent",{"$f":"AND(COUNTIF(adv!A:A,A721))","v":false},"Gain an extra Psychic Technique.",true]
["Psychic Technique (Betrayal of the Flesh)","Talent",{"$f":"AND(COUNTIF(adv!A:A,A722))","v":false},"Gain an extra Psychic Technique.",true]
["Psychic Technique (Punish the Weak)","Talent",{"$f":"AND(COUNTIF(adv!A:A,A723))","v":false},"Gain an extra Psychic Technique.",true]
["Psychic Technique (Corax's Ingenuity)","Talent",{"$f":"AND(COUNTIF(adv!A:A,A724))","v":false},"Gain an extra Psychic Technique.",true]
["Psychic Technique (Curse of the Raven)","Talent",{"$f":"AND(COUNTIF(adv!A:A,A725))","v":false},"Gain an extra Psychic Technique.",true]
["Psychic Technique (The Unkindness of Deliverance)","Talent",{"$f":"AND(COUNTIF(adv!A:A,A726))","v":false},"Gain an extra Psychic Technique.",true]
["Psychic Technique (Fury of the Salamander)","Talent",{"$f":"AND(COUNTIF(adv!A:A,A727))","v":false},"Gain an extra Psychic Technique.",true]
["Psychic Technique (Heat of the Furnace)","Talent",{"$f":"AND(COUNTIF(adv!A:A,A728))","v":false},"Gain an extra Psychic Technique.",true]
["Psychic Technique (Nocturne's Fire)","Talent",{"$f":"AND(COUNTIF(adv!A:A,A729))","v":false},"Gain an extra Psychic Technique.",true]
["Psychic Technique (Vulkan's Anvil)","Talent",{"$f":"AND(COUNTIF(adv!A:A,A730))","v":false},"Gain an extra Psychic Technique.",true]
["Psychic Technique (Heart of the Khan)","Talent",{"$f":"AND(COUNTIF(adv!A:A,A731))","v":false},"Gain an extra Psychic Technique.",true]
["Psychic Technique (Spirits of the Steppes)","Talent",{"$f":"AND(COUNTIF(adv!A:A,A732))","v":false},"Gain an extra Psychic Technique.",true]
["Psychic Technique (Stormlance)","Talent",{"$f":"AND(COUNTIF(adv!A:A,A733))","v":false},"Gain an extra Psychic Technique.",true]
["Psychic Technique (The Howling Wind)","Talent",{"$f":"AND(COUNTIF(adv!A:A,A734))","v":false},"Gain an extra Psychic Technique.",true]
["Quick Draw","Talent",{"$f":"AND(COUNTIF(adv!A:A,A735))","v":false},"Ready as a Free Action.",false]
["Rapid Reaction","Talent",{"$f":"AND(COUNTIF(adv!A:A,A736))","v":false},"Test Ag to negate surprise.",false]
["Rapid Reload","Talent",{"$f":"AND(COUNTIF(adv!A:A,A737))","v":false},"Reduce reload time.",false]
["Resistance†","Talent",{"$f":"AND(COUNTIF(adv!A:A,A738))","v":false},"Gain +10 bonus to Resistance Tests.",false]
["Resistance (Cold)","Talent",{"$f":"AND(COUNTIF(adv!A:A,A739))","v":false},"Gain +10 bonus to Resistance Tests.",false]
["Resistance (Fear)","Talent",{"$f":"AND(COUNTIF(adv!A:A,A740))","v":false},"Gain +10 bonus to Resistance Tests.",false]
["Resistance (Heat)","Talent",{"$f":"AND(COUNTIF(adv!A:A,A741))","v":false},"Gain +10 bonus to Resistance Tests.",false]
["Resistance (Poisons)","Talent",{"$f":"AND(COUNTIF(adv!A:A,A742))","v":false},"Gain +10 bonus to Resistance Tests.",false]
["Resistance (Psychic Powers)","Talent",{"$f":"AND(COUNTIF(adv!A:A,A743))","v":false},"Gain +10 bonus to Resistance Tests.",false]
["Rite of Awe","Talent",{"$f":"AND(COUNTIF(adv!A:A,A744))","v":false},"50m radius, –10 to all Tests due to Fear.",false]
["Rite of Fear","Talent",{"$f":"AND(COUNTIF(adv!A:A,A745))","v":false},"Fear Rating 1 for two minutes in a 50m radius.",false]
["Rite of Pure Thought","Talent",{"$f":"AND(COUNTIF(adv!A:A,A746))","v":false},"The character is immune to emotion.",false]
["Rite of Sanctioning","Talent",{"$f":"AND(COUNTIF(adv!A:A,A747))","v":false},"Reduces Psychic Phenomenon.",true]
["Rival†","Talent",{"$f":"AND(COUNTIF(adv!A:A,A748))","v":false},"A group or organisation bears the character animosity",false]
["Rival (Adeptus Arbites)","Talent",{"$f":"AND(COUNTIF(adv!A:A,A749))","v":false},"A group or organisation bears the character animosity",false]
["Rival (Adeptus Astra Telepathica)","Talent",{"$f":"AND(COUNTIF(adv!A:A,A750))","v":false},"A group or organisation bears the character animosity",false]
["Rival (Adeptus Astartes)","Talent",{"$f":"AND(COUNTIF(adv!A:A,A751))","v":false},"A group or organisation bears the character animosity",false]
["Rival (Adeptus Mechanicus)","Talent",{"$f":"AND(COUNTIF(adv!A:A,A752))","v":false},"A group or organisation bears the character animosity",false]
["Rival (Adepta Sororitas)","Talent",{"$f":"AND(COUNTIF(adv!A:A,A753))","v":false},"A group or organisation bears the character animosity",false]
["Rival (Adeptus Titanicus)","Talent",{"$f":"AND(COUNTIF(adv!A:A,A754))","v":false},"A group or organisation bears the character animosity",false]
["Rival (Administratum)","Talent",{"$f":"AND(COUNTIF(adv!A:A,A755))","v":false},"A group or organisation bears the character animosity",false]
["Rival (Astropaths)","Talent",{"$f":"AND(COUNTIF(adv!A:A,A756))","v":false},"A group or organisation bears the character animosity",false]
["Rival (Chartist Captains)","Talent",{"$f":"AND(COUNTIF(adv!A:A,A757))","v":false},"A group or organisation bears the character animosity",false]
["Rival (Ecclesiarchy)","Talent",{"$f":"AND(COUNTIF(adv!A:A,A758))","v":false},"A group or organisation bears the character animosity",false]
["Rival (Imperial Guard)","Talent",{"$f":"AND(COUNTIF(adv!A:A,A759))","v":false},"A group or organisation bears the character animosity",false]
["Rival (Imperial Navy)","Talent",{"$f":"AND(COUNTIF(adv!A:A,A760))","v":false},"A group or organisation bears the character animosity",false]
["Rival (Inquisition)","Talent",{"$f":"AND(COUNTIF(adv!A:A,A761))","v":false},"A group or organisation bears the character animosity",false]
["Rival (Navigators)","Talent",{"$f":"AND(COUNTIF(adv!A:A,A762))","v":false},"A group or organisation bears the character animosity",false]
["Rival (Officio Assassinorum)","Talent",{"$f":"AND(COUNTIF(adv!A:A,A763))","v":false},"A group or organisation bears the character animosity",false]
["Rival (PDF)","Talent",{"$f":"AND(COUNTIF(adv!A:A,A764))","v":false},"A group or organisation bears the character animosity",false]
["Rival (Planetary Governors)","Talent",{"$f":"AND(COUNTIF(adv!A:A,A765))","v":false},"A group or organisation bears the character animosity",false]
["Rival (Rogue Trader)","Talent",{"$f":"AND(COUNTIF(adv!A:A,A766))","v":false},"A group or organisation bears the character animosity",false]
["Rival (Schola Progenium)","Talent",{"$f":"AND(COUNTIF(adv!A:A,A767))","v":false},"A group or organisation bears the character animosity",false]
["Rival (Scholastica Psykana)","Talent",{"$f":"AND(COUNTIF(adv!A:A,A768))","v":false},"A group or organisation bears the character animosity",false]
["Scourge of Heretics","Talent",{"$f":"AND(COUNTIF(adv!A:A,A769))","v":false},"Gain an advantage when battling traitors and heretics.",true]
["Servo-harness Integration","Talent",{"$f":"AND(COUNTIF(adv!A:A,A770))","v":false},"Gain the ability to use a Servo-harness.",false]
["Sharpshooter","Talent",{"$f":"AND(COUNTIF(adv!A:A,A771))","v":false},"No penalties for called shots.",true]
["Sound Constitution","Talent",{"$f":"AND(COUNTIF(adv!A:A,A772))","v":false},"Gain an additional Wound.",false]
["Siegecraft","Talent",{"$f":"AND(COUNTIF(adv!A:A,A773))","v":false},null,false]
["Signature Wargear","Talent",{"$f":"AND(COUNTIF(adv!A:A,A774))","v":false},"One item up to 20 Requisition becomes standard issue.",false]
["Signature Wargear (Master)","Talent",{"$f":"AND(COUNTIF(adv!A:A,A775))","v":false},"One item up to 40 Requisition becomes standard issue and gain an additional benefit.",false]
["Signature Wargear: Hero†","Talent",{"$f":"AND(COUNTIF(adv!A:A,A776))","v":false},"One item up to 70 Requisition becomes standard issue.",false]
["Signature Wargear: Hero (Weapon)","Talent",{"$f":"AND(COUNTIF(adv!A:A,A777))","v":false},"One item up to 70 Requisition becomes standard issue.",false]
["Signature Wargear: Hero (Armour)","Talent",{"$f":"AND(COUNTIF(adv!A:A,A778))","v":false},"One item up to 70 Requisition becomes standard issue.",false]
["Signature Wargear: Hero (Artificer Armour)","Talent",{"$f":"AND(COUNTIF(adv!A:A,A779))","v":false},"One item up to 70 Requisition becomes standard issue.",false]
["Signature Wargear: Hero (Relic)","Talent",{"$f":"AND(COUNTIF(adv!A:A,A780))","v":false},"One item up to 70 Requisition becomes standard issue.",false]
["Signature Wargear: Hero (Wargear)","Talent",{"$f":"AND(COUNTIF(adv!A:A,A781))","v":false},"One item up to 70 Requisition becomes standard issue.",false]
["Slayer of Daemons","Talent",{"$f":"AND(COUNTIF(adv!A:A,A782))","v":false},"Gain an advantage when fighting warp entities.",true]
["Sprint","Talent",{"$f":"AND(COUNTIF(adv!A:A,A783))","v":false},"Move more quickly in combat.",false]
["Stalwart Defence","Talent",{"$f":"AND(COUNTIF(adv!A:A,A784))","v":false},"Hold a chosen point with indomitable determination and a storm of fire.",false]
["Step Aside","Talent",{"$f":"AND(COUNTIF(adv!A:A,A785))","v":false},"Gain extra Dodge in a Round.",false]
["Street Fighting","Talent",{"$f":"AND(COUNTIF(adv!A:A,A786))","v":false},"Deal +2 Critical Damage with knives or unarmed attacks.",false]
["Storm of Iron","Talent",{"$f":"AND(COUNTIF(adv!A:A,A787))","v":false},"Cause additional Damage against Hordes with ranged weapons.",true]
["Strong Minded","Talent",{"$f":"AND(COUNTIF(adv!A:A,A788))","v":false},"Re-roll failed WP Tests made to resist Psychic Powers.",true]
["Sure Strike","Talent",{"$f":"AND(COUNTIF(adv!A:A,A789))","v":false},"Choose location on a successful attack.",true]
["Survivor","Talent",{"$f":"AND(COUNTIF(adv!A:A,A790))","v":false},null,false]
["Swift Attack","Talent",{"$f":"AND(COUNTIF(adv!A:A,A791))","v":false},"Attack twice with a Full Action.",true]
["Takedown","Talent",{"$f":"AND(COUNTIF(adv!A:A,A792))","v":false},"Make a special attack to Stun opponent.",false]
["Talented†","Talent",{"$f":"AND(COUNTIF(adv!A:A,A793))","v":false},"Gain +10 bonus to corresponding Skill Test.",true]
["Talented (Acrobatics)","Talent",{"$f":"AND(COUNTIF(adv!A:A,A794))","v":false},"Gain +10 bonus to corresponding Skill Test.",true]
["Talented (Awareness)","Talent",{"$f":"AND(COUNTIF(adv!A:A,A795))","v":false},"Gain +10 bonus to corresponding Skill Test.",true]
["Talented (Barter)","Talent",{"$f":"AND(COUNTIF(adv!A:A,A796))","v":false},"Gain +10 bonus to corresponding Skill Test.",true]
["Talented (Blather)","Talent",{"$f":"AND(COUNTIF(adv!A:A,A797))","v":false},"Gain +10 bonus to corresponding Skill Test.",true]
["Talented (Carouse)","Talent",{"$f":"AND(COUNTIF(adv!A:A,A798))","v":false},"Gain +10 bonus to corresponding Skill Test.",true]
["Talented (Charm)","Talent",{"$f":"AND(COUNTIF(adv!A:A,A799))","v":false},"Gain +10 bonus to corresponding Skill Test.",true]
["Talented (Chem-Use)","Talent",{"$f":"AND(COUNTIF(adv!A:A,A800))","v":false},"Gain +10 bonus to corresponding Skill Test.",true]
["Talented (Ciphers (Xenos Markings))","Talent",{"$f":"AND(COUNTIF(adv!A:A,A801))","v":false},"Gain +10 bonus to corresponding Skill Test.",true]
["Talented (Ciphers (Deathwatch))","Talent",{"$f":"AND(COUNTIF(adv!A:A,A802))","v":false},"Gain +10 bonus to corresponding Skill Test.",true]
["Talented (Ciphers (Chapter Runes))","Talent",{"$f":"AND(COUNTIF(adv!A:A,A803))","v":false},"Gain +10 bonus to corresponding Skill Test.",true]
["Talented (Ciphers (Imperial Codes))","Talent",{"$f":"AND(COUNTIF(adv!A:A,A804))","v":false},"Gain +10 bonus to corresponding Skill Test.",true]
["Talented (Ciphers (Inquisition))","Talent",{"$f":"AND(COUNTIF(adv!A:A,A805))","v":false},"Gain +10 bonus to corresponding Skill Test.",true]
["Talented (Ciphers (Mercenary Cant))","Talent",{"$f":"AND(COUNTIF(adv!A:A,A806))","v":false},"Gain +10 bonus to corresponding Skill Test.",true]
["Talented (Ciphers (Underworld))","Talent",{"$f":"AND(COUNTIF(adv!A:A,A807))","v":false},"Gain +10 bonus to corresponding Skill Test.",true]
["Talented (Climb)","Talent",{"$f":"AND(COUNTIF(adv!A:A,A808))","v":false},"Gain +10 bonus to corresponding Skill Test.",true]
["Talented (Command)","Talent",{"$f":"AND(COUNTIF(adv!A:A,A809))","v":false},"Gain +10 bonus to corresponding Skill Test.",true]
["Talented (Concealment)","Talent",{"$f":"AND(COUNTIF(adv!A:A,A810))","v":false},"Gain +10 bonus to corresponding Skill Test.",true]
["Talented (Contortionist)","Talent",{"$f":"AND(COUNTIF(adv!A:A,A811))","v":false},"Gain +10 bonus to corresponding Skill Test.",true]
["Talented (Decieve)","Talent",{"$f":"AND(COUNTIF(adv!A:A,A812))","v":false},"Gain +10 bonus to corresponding Skill Test.",true]
["Talented (Demonlition)","Talent",{"$f":"AND(COUNTIF(adv!A:A,A813))","v":false},"Gain +10 bonus to corresponding Skill Test.",true]
["Talented (Disguise)","Talent",{"$f":"AND(COUNTIF(adv!A:A,A814))","v":false},"Gain +10 bonus to corresponding Skill Test.",true]
["Talented (Dodge)","Talent",{"$f":"AND(COUNTIF(adv!A:A,A815))","v":false},"Gain +10 bonus to corresponding Skill Test.",true]
["Talented (Drive (Ground Vehicles))","Talent",{"$f":"AND(COUNTIF(adv!A:A,A816))","v":false},"Gain +10 bonus to corresponding Skill Test.",true]
["Talented (Drive (Skimmer/Hover))","Talent",{"$f":"AND(COUNTIF(adv!A:A,A817))","v":false},"Gain +10 bonus to corresponding Skill Test.",true]
["Talented (Drive (Walker))","Talent",{"$f":"AND(COUNTIF(adv!A:A,A818))","v":false},"Gain +10 bonus to corresponding Skill Test.",true]
["Talented (Evaluate)","Talent",{"$f":"AND(COUNTIF(adv!A:A,A819))","v":false},"Gain +10 bonus to corresponding Skill Test.",true]
["Talented (Gamble)","Talent",{"$f":"AND(COUNTIF(adv!A:A,A820))","v":false},"Gain +10 bonus to corresponding Skill Test.",true]
["Talented (Inquiry)","Talent",{"$f":"AND(COUNTIF(adv!A:A,A821))","v":false},"Gain +10 bonus to corresponding Skill Test.",true]
["Talented (Interrogation)","Talent",{"$f":"AND(COUNTIF(adv!A:A,A822))","v":false},"Gain +10 bonus to corresponding Skill Test.",true]
["Talented (Intimidate)","Talent",{"$f":"AND(COUNTIF(adv!A:A,A823))","v":false},"Gain +10 bonus to corresponding Skill Test.",true]
["Talented (Invocation)","Talent",{"$f":"AND(COUNTIF(adv!A:A,A824))","v":false},"Gain +10 bonus to corresponding Skill Test.",true]
["Talented (Lip Reading)","Talent",{"$f":"AND(COUNTIF(adv!A:A,A825))","v":false},"Gain +10 bonus to corresponding Skill Test.",true]
["Talented (Literacy)","Talent",{"$f":"AND(COUNTIF(adv!A:A,A826))","v":false},"Gain +10 bonus to corresponding Skill Test.",true]
["Talented (Logic)","Talent",{"$f":"AND(COUNTIF(adv!A:A,A827))","v":false},"Gain +10 bonus to corresponding Skill Test.",true]
["Talented (Lore: Common (Adeptus Arbites))","Talent",{"$f":"AND(COUNTIF(adv!A:A,A828))","v":false},"Gain +10 bonus to corresponding Skill Test.",true]
["Talented (Lore: Common (Adeptus Astartes))","Talent",{"$f":"AND(COUNTIF(adv!A:A,A829))","v":false},"Gain +10 bonus to corresponding Skill Test.",true]
["Talented (Lore: Common (Adeptus Mechanicus))","Talent",{"$f":"AND(COUNTIF(adv!A:A,A830))","v":false},"Gain +10 bonus to corresponding Skill Test.",true]
["Talented (Lore: Common (Administratum))","Talent",{"$f":"AND(COUNTIF(adv!A:A,A831))","v":false},"Gain +10 bonus to corresponding Skill Test.",true]
["Talented (Lore: Common (Deathwatch))","Talent",{"$f":"AND(COUNTIF(adv!A:A,A832))","v":false},"Gain +10 bonus to corresponding Skill Test.",true]
["Talented (Lore: Common (Ecclesiarchy))","Talent",{"$f":"AND(COUNTIF(adv!A:A,A833))","v":false},"Gain +10 bonus to corresponding Skill Test.",true]
["Talented (Lore: Common (Imperial Creed))","Talent",{"$f":"AND(COUNTIF(adv!A:A,A834))","v":false},"Gain +10 bonus to corresponding Skill Test.",true]
["Talented (Lore: Common (Imperial Guard))","Talent",{"$f":"AND(COUNTIF(adv!A:A,A835))","v":false},"Gain +10 bonus to corresponding Skill Test.",true]
["Talented (Lore: Common (Imperial Navy))","Talent",{"$f":"AND(COUNTIF(adv!A:A,A836))","v":false},"Gain +10 bonus to corresponding Skill Test.",true]
["Talented (Lore: Common (Imperium))","Talent",{"$f":"AND(COUNTIF(adv!A:A,A837))","v":false},"Gain +10 bonus to corresponding Skill Test.",true]
["Talented (Lore: Common (Jericho Reach))","Talent",{"$f":"AND(COUNTIF(adv!A:A,A838))","v":false},"Gain +10 bonus to corresponding Skill Test.",true]
["Talented (Lore: Common (Tech))","Talent",{"$f":"AND(COUNTIF(adv!A:A,A839))","v":false},"Gain +10 bonus to corresponding Skill Test.",true]
["Talented (Lore: Common (War))","Talent",{"$f":"AND(COUNTIF(adv!A:A,A840))","v":false},"Gain +10 bonus to corresponding Skill Test.",true]
["Talented (Lore: Forbidden (Adeptus Astartes))","Talent",{"$f":"AND(COUNTIF(adv!A:A,A841))","v":false},"Gain +10 bonus to corresponding Skill Test.",true]
["Talented (Lore: Forbidden (Adeptus Mechanicus))","Talent",{"$f":"AND(COUNTIF(adv!A:A,A842))","v":false},"Gain +10 bonus to corresponding Skill Test.",true]
["Talented (Lore: Forbidden (Archeotech))","Talent",{"$f":"AND(COUNTIF(adv!A:A,A843))","v":false},"Gain +10 bonus to corresponding Skill Test.",true]
["Talented (Lore: Forbidden (The Black Library))","Talent",{"$f":"AND(COUNTIF(adv!A:A,A844))","v":false},"Gain +10 bonus to corresponding Skill Test.",true]
["Talented (Lore: Forbidden (Daemonology))","Talent",{"$f":"AND(COUNTIF(adv!A:A,A845))","v":false},"Gain +10 bonus to corresponding Skill Test.",true]
["Talented (Lore: Forbidden (Heresy))","Talent",{"$f":"AND(COUNTIF(adv!A:A,A846))","v":false},"Gain +10 bonus to corresponding Skill Test.",true]
["Talented (Lore: Forbidden (The Inquisition))","Talent",{"$f":"AND(COUNTIF(adv!A:A,A847))","v":false},"Gain +10 bonus to corresponding Skill Test.",true]
["Talented (Lore: Forbidden (Mutants))","Talent",{"$f":"AND(COUNTIF(adv!A:A,A848))","v":false},"Gain +10 bonus to corresponding Skill Test.",true]
["Talented (Lore: Forbidden (Psykers))","Talent",{"$f":"AND(COUNTIF(adv!A:A,A849))","v":false},"Gain +10 bonus to corresponding Skill Test.",true]
["Talented (Lore: Forbidden (The Traitor Legions))","Talent",{"$f":"AND(COUNTIF(adv!A:A,A850))","v":false},"Gain +10 bonus to corresponding Skill Test.",true]
["Talented (Lore: Forbidden (The Warp))","Talent",{"$f":"AND(COUNTIF(adv!A:A,A851))","v":false},"Gain +10 bonus to corresponding Skill Test.",true]
["Talented (Lore: Forbidden (Xenos))","Talent",{"$f":"AND(COUNTIF(adv!A:A,A852))","v":false},"Gain +10 bonus to corresponding Skill Test.",true]
["Talented (Lore: Scolastic (Archaic))","Talent",{"$f":"AND(COUNTIF(adv!A:A,A853))","v":false},"Gain +10 bonus to corresponding Skill Test.",true]
["Talented (Lore: Scolastic (Astromancy))","Talent",{"$f":"AND(COUNTIF(adv!A:A,A854))","v":false},"Gain +10 bonus to corresponding Skill Test.",true]
["Talented (Lore: Scolastic (Beasts))","Talent",{"$f":"AND(COUNTIF(adv!A:A,A855))","v":false},"Gain +10 bonus to corresponding Skill Test.",true]
["Talented (Lore: Scolastic (Bureaucracy))","Talent",{"$f":"AND(COUNTIF(adv!A:A,A856))","v":false},"Gain +10 bonus to corresponding Skill Test.",true]
["Talented (Lore: Scolastic (Chymistry))","Talent",{"$f":"AND(COUNTIF(adv!A:A,A857))","v":false},"Gain +10 bonus to corresponding Skill Test.",true]
["Talented (Lore: Scolastic (Codex Astartes))","Talent",{"$f":"AND(COUNTIF(adv!A:A,A858))","v":false},"Gain +10 bonus to corresponding Skill Test.",true]
["Talented (Lore: Scolastic (Cryptology))","Talent",{"$f":"AND(COUNTIF(adv!A:A,A859))","v":false},"Gain +10 bonus to corresponding Skill Test.",true]
["Talented (Lore: Scolastic (Heraldry))","Talent",{"$f":"AND(COUNTIF(adv!A:A,A860))","v":false},"Gain +10 bonus to corresponding Skill Test.",true]
["Talented (Lore: Scolastic (Imperial Creed))","Talent",{"$f":"AND(COUNTIF(adv!A:A,A861))","v":false},"Gain +10 bonus to corresponding Skill Test.",true]
["Talented (Lore: Scolastic (Judgement))","Talent",{"$f":"AND(COUNTIF(adv!A:A,A862))","v":false},"Gain +10 bonus to corresponding Skill Test.",true]
["Talented (Lore: Scolastic (Legend))","Talent",{"$f":"AND(COUNTIF(adv!A:A,A863))","v":false},"Gain +10 bonus to corresponding Skill Test.",true]
["Talented (Lore: Scolastic (Numerology))","Talent",{"$f":"AND(COUNTIF(adv!A:A,A864))","v":false},"Gain +10 bonus to corresponding Skill Test.",true]
["Talented (Lore: Scolastic (Occult))","Talent",{"$f":"AND(COUNTIF(adv!A:A,A865))","v":false},"Gain +10 bonus to corresponding Skill Test.",true]
["Talented (Lore: Scolastic (Philosophy))","Talent",{"$f":"AND(COUNTIF(adv!A:A,A866))","v":false},"Gain +10 bonus to corresponding Skill Test.",true]
["Talented (Lore: Scolastic (Tactica Imperialis))","Talent",{"$f":"AND(COUNTIF(adv!A:A,A867))","v":false},"Gain +10 bonus to corresponding Skill Test.",true]
["Talented (Medicae)","Talent",{"$f":"AND(COUNTIF(adv!A:A,A868))","v":false},"Gain +10 bonus to corresponding Skill Test.",true]
["Talented (Navigation (Surface))","Talent",{"$f":"AND(COUNTIF(adv!A:A,A869))","v":false},"Gain +10 bonus to corresponding Skill Test.",true]
["Talented (Navigation (Stellar))","Talent",{"$f":"AND(COUNTIF(adv!A:A,A870))","v":false},"Gain +10 bonus to corresponding Skill Test.",true]
["Talented (Performer (Dancer))","Talent",{"$f":"AND(COUNTIF(adv!A:A,A871))","v":false},"Gain +10 bonus to corresponding Skill Test.",true]
["Talented (Performer (Musician))","Talent",{"$f":"AND(COUNTIF(adv!A:A,A872))","v":false},"Gain +10 bonus to corresponding Skill Test.",true]
["Talented (Performer (Singer))","Talent",{"$f":"AND(COUNTIF(adv!A:A,A873))","v":false},"Gain +10 bonus to corresponding Skill Test.",true]
["Talented (Performer (Storyteller))","Talent",{"$f":"AND(COUNTIF(adv!A:A,A874))","v":false},"Gain +10 bonus to corresponding Skill Test.",true]
["Talented (Pilot (Personal))","Talent",{"$f":"AND(COUNTIF(adv!A:A,A875))","v":false},"Gain +10 bonus to corresponding Skill Test.",true]
["Talented (Pilot (Flyers))","Talent",{"$f":"AND(COUNTIF(adv!A:A,A876))","v":false},"Gain +10 bonus to corresponding Skill Test.",true]
["Talented (Pilot (Spacecraft))","Talent",{"$f":"AND(COUNTIF(adv!A:A,A877))","v":false},"Gain +10 bonus to corresponding Skill Test.",true]
["Talented (Psyniscience)","Talent",{"$f":"AND(COUNTIF(adv!A:A,A878))","v":false},"Gain +10 bonus to corresponding Skill Test.",true]
["Talented (Scrutiny)","Talent",{"$f":"AND(COUNTIF(adv!A:A,A879))","v":false},"Gain +10 bonus to corresponding Skill Test.",true]
["Talented (Search)","Talent",{"$f":"AND(COUNTIF(adv!A:A,A880))","v":false},"Gain +10 bonus to corresponding Skill Test.",true]
["Talented (Secret Tongue)","Talent",{"$f":"AND(COUNTIF(adv!A:A,A881))","v":false},"Gain +10 bonus to corresponding Skill Test.",true]
["Talented (Security)","Talent",{"$f":"AND(COUNTIF(adv!A:A,A882))","v":false},"Gain +10 bonus to corresponding Skill Test.",true]
["Talented (Shadowing)","Talent",{"$f":"AND(COUNTIF(adv!A:A,A883))","v":false},"Gain +10 bonus to corresponding Skill Test.",true]
["Talented (Silent Move)","Talent",{"$f":"AND(COUNTIF(adv!A:A,A884))","v":false},"Gain +10 bonus to corresponding Skill Test.",true]
["Talented (Sleight of Hand)","Talent",{"$f":"AND(COUNTIF(adv!A:A,A885))","v":false},"Gain +10 bonus to corresponding Skill Test.",true]
["Talented (Speak Language (Eldar))","Talent",{"$f":"AND(COUNTIF(adv!A:A,A886))","v":false},"Gain +10 bonus to corresponding Skill Test.",true]
["Talented (Speak Language (High Gothic))","Talent",{"$f":"AND(COUNTIF(adv!A:A,A887))","v":false},"Gain +10 bonus to corresponding Skill Test.",true]
["Talented (Speak Language (Kroot))","Talent",{"$f":"AND(COUNTIF(adv!A:A,A888))","v":false},"Gain +10 bonus to corresponding Skill Test.",true]
["Talented (Speak Language (Low Gothic))","Talent",{"$f":"AND(COUNTIF(adv!A:A,A889))","v":false},"Gain +10 bonus to corresponding Skill Test.",true]
["Talented (Speak Language (Ork))","Talent",{"$f":"AND(COUNTIF(adv!A:A,A890))","v":false},"Gain +10 bonus to corresponding Skill Test.",true]
["Talented (Speak Language (Techna-Lingua))","Talent",{"$f":"AND(COUNTIF(adv!A:A,A891))","v":false},"Gain +10 bonus to corresponding Skill Test.",true]
["Talented (Speak Language (Tau))","Talent",{"$f":"AND(COUNTIF(adv!A:A,A892))","v":false},"Gain +10 bonus to corresponding Skill Test.",true]
["Talented (Survival)","Talent",{"$f":"AND(COUNTIF(adv!A:A,A893))","v":false},"Gain +10 bonus to corresponding Skill Test.",true]
["Talented (Swim)","Talent",{"$f":"AND(COUNTIF(adv!A:A,A894))","v":false},"Gain +10 bonus to corresponding Skill Test.",true]
["Talented (Tactics (Air Combat))","Talent",{"$f":"AND(COUNTIF(adv!A:A,A895))","v":false},"Gain +10 bonus to corresponding Skill Test.",true]
["Talented (Tactics (Armoured Tactics))","Talent",{"$f":"AND(COUNTIF(adv!A:A,A896))","v":false},"Gain +10 bonus to corresponding Skill Test.",true]
["Talented (Tactics (Assault Doctrine))","Talent",{"$f":"AND(COUNTIF(adv!A:A,A897))","v":false},"Gain +10 bonus to corresponding Skill Test.",true]
["Talented (Tactics (Defensive Doctrine))","Talent",{"$f":"AND(COUNTIF(adv!A:A,A898))","v":false},"Gain +10 bonus to corresponding Skill Test.",true]
["Talented (Tactics (Orbital Drop Procedures))","Talent",{"$f":"AND(COUNTIF(adv!A:A,A899))","v":false},"Gain +10 bonus to corresponding Skill Test.",true]
["Talented (Tactics (Recon and Stealth))","Talent",{"$f":"AND(COUNTIF(adv!A:A,A900))","v":false},"Gain +10 bonus to corresponding Skill Test.",true]
["Talented (Tactics (Void Combat))","Talent",{"$f":"AND(COUNTIF(adv!A:A,A901))","v":false},"Gain +10 bonus to corresponding Skill Test.",true]
["Talented (Tech-Use)","Talent",{"$f":"AND(COUNTIF(adv!A:A,A902))","v":false},"Gain +10 bonus to corresponding Skill Test.",true]
["Talented (Tracking)","Talent",{"$f":"AND(COUNTIF(adv!A:A,A903))","v":false},"Gain +10 bonus to corresponding Skill Test.",true]
["Talented (Trade (Archeologist))","Talent",{"$f":"AND(COUNTIF(adv!A:A,A904))","v":false},"Gain +10 bonus to corresponding Skill Test.",true]
["Talented (Trade (Armourer))","Talent",{"$f":"AND(COUNTIF(adv!A:A,A905))","v":false},"Gain +10 bonus to corresponding Skill Test.",true]
["Talented (Trade (Artisan))","Talent",{"$f":"AND(COUNTIF(adv!A:A,A906))","v":false},"Gain +10 bonus to corresponding Skill Test.",true]
["Talented (Trade (Astrographer))","Talent",{"$f":"AND(COUNTIF(adv!A:A,A907))","v":false},"Gain +10 bonus to corresponding Skill Test.",true]
["Talented (Trade (Chymist))","Talent",{"$f":"AND(COUNTIF(adv!A:A,A908))","v":false},"Gain +10 bonus to corresponding Skill Test.",true]
["Talented (Trade (Cryptographer))","Talent",{"$f":"AND(COUNTIF(adv!A:A,A909))","v":false},"Gain +10 bonus to corresponding Skill Test.",true]
["Talented (Trade (Explorator))","Talent",{"$f":"AND(COUNTIF(adv!A:A,A910))","v":false},"Gain +10 bonus to corresponding Skill Test.",true]
["Talented (Trade (Linguist))","Talent",{"$f":"AND(COUNTIF(adv!A:A,A911))","v":false},"Gain +10 bonus to corresponding Skill Test.",true]
["Talented (Trade (Remembrancer))","Talent",{"$f":"AND(COUNTIF(adv!A:A,A912))","v":false},"Gain +10 bonus to corresponding Skill Test.",true]
["Talented (Trade (Shipwright))","Talent",{"$f":"AND(COUNTIF(adv!A:A,A913))","v":false},"Gain +10 bonus to corresponding Skill Test.",true]
["Talented (Trade (Soothsayer))","Talent",{"$f":"AND(COUNTIF(adv!A:A,A914))","v":false},"Gain +10 bonus to corresponding Skill Test.",true]
["Talented (Trade (Technomat))","Talent",{"$f":"AND(COUNTIF(adv!A:A,A915))","v":false},"Gain +10 bonus to corresponding Skill Test.",true]
["Talented (Wrangling)","Talent",{"$f":"AND(COUNTIF(adv!A:A,A916))","v":false},"Gain +10 bonus to corresponding Skill Test.",true]
["Target Selection","Talent",{"$f":"AND(COUNTIF(adv!A:A,A917))","v":false},"Shoot into melee without penalty.",true]
["Technical Knock","Talent",{"$f":"AND(COUNTIF(adv!A:A,A918))","v":false},"Un-jam a gun as Half Action.",false]
["The Flesh is Weak 1","Talent",{"$f":"AND(COUNTIF(adv!A:A,A919))","v":false},"Replace parts of the body with iron and machine.",false]
["The Flesh is Weak 2","Talent",{"$f":"AND(COUNTIF(adv!A:A,A920))","v":false},"Replace parts of the body with iron and machine.",false]
["The Flesh is Weak 3","Talent",{"$f":"AND(COUNTIF(adv!A:A,A921))","v":false},"Replace parts of the body with iron and machine.",false]
["The Flesh is Weak 4","Talent",{"$f":"AND(COUNTIF(adv!A:A,A922))","v":false},"Replace parts of the body with iron and machine.",false]
["The Flesh is Weak 5","Talent",{"$f":"AND(COUNTIF(adv!A:A,A923))","v":false},"Replace parts of the body with iron and machine.",false]
["Thrown Weapon Training†","Talent",{"$f":"AND(COUNTIF(adv!A:A,A924))","v":false},"Gain proficiency with a group of thrown weapons.",false]
["Thrown Weapon Training (Universal)","Talent",{"$f":"AND(COUNTIF(adv!A:A,A925))","v":false},"Gain proficiency with a group of thrown weapons.",false]
["Thunder Charge","Talent",{"$f":"AND(COUNTIF(adv!A:A,A926))","v":false},"Break enemies with the momentum of an armoured charge.",true]
["Total Recall","Talent",{"$f":"AND(COUNTIF(adv!A:A,A927))","v":false},"The character can remember trivial facts and minor details.",true]
["True Grit","Talent",{"$f":"AND(COUNTIF(adv!A:A,A928))","v":false},"Reduce Critical Damage the character takes.",false]
["Two-Weapon Wielder†","Talent",{"$f":"AND(COUNTIF(adv!A:A,A929))","v":false},"Attack twice when wielding two weapons.",false]
["Two-Weapon Wielder (Ballistic)","Talent",{"$f":"AND(COUNTIF(adv!A:A,A930))","v":false},"Attack twice when wielding two weapons.",true]
["Two-Weapon Wielder (Melee)","Talent",{"$f":"AND(COUNTIF(adv!A:A,A931))","v":false},"Attack twice when wielding two weapons.",true]
["Unarmed Master","Talent",{"$f":"AND(COUNTIF(adv!A:A,A932))","v":false},"Attacks do 1d10+SB Damage and lack the Primitive trait.",false]
["Unarmed Warrior","Talent",{"$f":"AND(COUNTIF(adv!A:A,A933))","v":false},"Deal 1d10 –3+SB with unarmed attacks.",false]
["Unbowed and Unbroken","Talent",{"$f":"AND(COUNTIF(adv!A:A,A934))","v":false},"Perform an act of defiance to remove Cohesion Damage suffered in previous turn.",true]
["Unshakeable Faith","Talent",{"$f":"AND(COUNTIF(adv!A:A,A935))","v":false},"The character may re-roll failed Fear Tests.",false]
["Wall of Steel","Talent",{"$f":"AND(COUNTIF(adv!A:A,A936))","v":false},"Gain extra Parry each Round.",false]
["Warp Affinity","Talent",{"$f":"AND(COUNTIF(adv!A:A,A937))","v":false},"Re-roll Psychic Phenomenon.",true]
["Warp Conduit","Talent",{"$f":"AND(COUNTIF(adv!A:A,A938))","v":false},"+1 to Psy Rating when pushing.",true]
["Warp Sense","Talent",{"$f":"AND(COUNTIF(adv!A:A,A939))","v":false},"Allows Psyniscience Test as Half Action.",true]
["Weapon-Tech","Talent",{"$f":"AND(COUNTIF(adv!A:A,A940))","v":false},"Increase the efficacy of weapons wielded by the Techmarine or Mechanicus Implants.",false]
["Web of Peers","Talent",{"$f":"AND(COUNTIF(adv!A:A,A941))","v":false},null,false]
["Wisdom of the Ancients","Talent",{"$f":"AND(COUNTIF(adv!A:A,A942))","v":false},"Spend a Fate Point to get insight on a situation.",true]
["Whirlwind of Death","Talent",{"$f":"AND(COUNTIF(adv!A:A,A943))","v":false},"Cause additional Damage against hordes in melee.",true]
["Adeptus Astartes","Trait",{"$f":"AND(COUNTIF(adv!A:A,A944))","v":false},null,false]
["Amorphous","Trait",{"$f":"AND(COUNTIF(adv!A:A,A945))","v":false},"Creature is a blob, and slow.",false]
["Armour Plating","Trait",{"$f":"AND(COUNTIF(adv!A:A,A946))","v":false},"Increase Armour Points by 2.",false]
["Auto-stabilised","Trait",{"$f":"AND(COUNTIF(adv!A:A,A947))","v":false},"Always counts as braced.",false]
["Bestial","Trait",{"$f":"AND(COUNTIF(adv!A:A,A948))","v":false},"No need to make Survival Tests in natural habitat, test Willpower to avoid flight.",false]
["Blind","Trait",{"$f":"AND(COUNTIF(adv!A:A,A949))","v":false},"Cannot see.",false]
["Blood Soaked Tide","Trait",{"$f":"AND(COUNTIF(adv!A:A,A950))","v":false},"A horde becomes Frenzied and Fearless rather than breaking.",false]
["Brutal Charge","Trait",{"$f":"AND(COUNTIF(adv!A:A,A951))","v":false},"+3 damage on a charge.",false]
["Burrower","Trait",{"$f":"AND(COUNTIF(adv!A:A,A952))","v":false},"Move by digging.",false]
["Crawler","Trait",{"$f":"AND(COUNTIF(adv!A:A,A953))","v":false},"Calculate Movement by half Agility Bonus. No penalties for moving over difficult terrain.",false]
["Daemonic","Trait",{"$f":"AND(COUNTIF(adv!A:A,A954))","v":false},"Double TB against normal weapons, immune to disease and poison.",false]
["Dark Sight","Trait",{"$f":"AND(COUNTIF(adv!A:A,A955))","v":false},"See in darkness.",false]
["Disciplined","Trait",{"$f":"AND(COUNTIF(adv!A:A,A956))","v":false},"A horde is resistant to breaking.",false]
["Engine of War","Trait",{"$f":"AND(COUNTIF(adv!A:A,A957))","v":false},null,false]
["Fighting Withdrawal","Trait",{"$f":"AND(COUNTIF(adv!A:A,A958))","v":false},"A horde that breaks moves back in good order.",false]
["Fire Drill","Trait",{"$f":"AND(COUNTIF(adv!A:A,A959))","v":false},"A horde gains an extra ranged attack.",false]
["Fear 1","Trait",{"$f":"AND(COUNTIF(adv!A:A,A960))","v":false},"Forces others to make Fear Tests to avoid Shock and Madness.",false]
["Fear 2","Trait",{"$f":"AND(COUNTIF(adv!A:A,A961))","v":false},"Forces others to make Fear Tests to avoid Shock and Madness.",false]
["Fear 3","Trait",{"$f":"AND(COUNTIF(adv!A:A,A962))","v":false},"Forces others to make Fear Tests to avoid Shock and Madness.",false]
["Fear 4","Trait",{"$f":"AND(COUNTIF(adv!A:A,A963))","v":false},"Forces others to make Fear Tests to avoid Shock and Madness.",false]
["Flyer","Trait",{"$f":"AND(COUNTIF(adv!A:A,A964))","v":false},"Fly and enter any altitude.",false]
["From Beyond","Trait",{"$f":"AND(COUNTIF(adv!A:A,A965))","v":false},"Immune to Fear, Pinning, Insanity Points, and mind-affecting powers.",false]
["Hoverer","Trait",{"$f":"AND(COUNTIF(adv!A:A,A966))","v":false},"Fly and enter the hover altitude",false]
["Improved Natural Weapons","Trait",{"$f":"AND(COUNTIF(adv!A:A,A967))","v":false},"Creature’s Natural Weapons are no longer Primitive.",false]
["Incorporeal","Trait",{"$f":"AND(COUNTIF(adv!A:A,A968))","v":false},"Creature can become insubstantial.",false]
["Instinctive Behaviour (Tyranid) [Feed]","Trait",{"$f":"AND(COUNTIF(adv!A:A,A969))","v":false},"Creature has a set of reactions to stimuli.",false]
["Instinctive Behaviour (Tyranid) (Lurk)","Trait",{"$f":"AND(COUNTIF(adv!A:A,A970))","v":false},"Creature has a set of reactions to stimuli.",false]
["Instinctive Behaviour (Tyranid) (Stalk)","Trait",{"$f":"AND(COUNTIF(adv!A:A,A971))","v":false},"Creature has a set of reactions to stimuli.",false]
["Machine","Trait",{"$f":"AND(COUNTIF(adv!A:A,A972))","v":false},"Creature gains immunities and resistances.",false]
["Mechanicus Implants","Trait",{"$f":"AND(COUNTIF(adv!A:A,A973))","v":false},null,false]
["Multiple Arms","Trait",{"$f":"AND(COUNTIF(adv!A:A,A974))","v":false},"Creature gains extra attack with multiple attack action, +10 T, +10 to Strength Tests involving movement.",false]
["Natural Armour","Trait",{"$f":"AND(COUNTIF(adv!A:A,A975))","v":false},"Gain one or more Armour Points to all locations.",false]
["Natural Weapons","Trait",{"$f":"AND(COUNTIF(adv!A:A,A976))","v":false},"Unarmed attacks deal 1d10+SB damage.",false]
["Overwhelming","Trait",{"$f":"AND(COUNTIF(adv!A:A,A977))","v":false},"A Horde does extra damage in melee.",false]
["Phase","Trait",{"$f":"AND(COUNTIF(adv!A:A,A978))","v":false},"Switch between incorporeal and corporeal as a Half Action.",false]
["Possession","Trait",{"$f":"AND(COUNTIF(adv!A:A,A979))","v":false},"Take control of another creature.",false]
["Quadruped","Trait",{"$f":"AND(COUNTIF(adv!A:A,A980))","v":false},"Movement equals AB×2.",false]
["Regeneration","Trait",{"$f":"AND(COUNTIF(adv!A:A,A981))","v":false},"Test Toughness to remove 1 damage.",false]
["Size (Miniscule)","Trait",{"$f":"AND(COUNTIF(adv!A:A,A982))","v":false},"Determines creature’s size and benefits.",false]
["Size (Puny)","Trait",{"$f":"AND(COUNTIF(adv!A:A,A983))","v":false},"Determines creature’s size and benefits.",false]
["Size (Scrawny)","Trait",{"$f":"AND(COUNTIF(adv!A:A,A984))","v":false},"Determines creature’s size and benefits.",false]
["Size (Average)","Trait",{"$f":"AND(COUNTIF(adv!A:A,A985))","v":false},"Determines creature’s size and benefits.",false]
["Size (Hulking)","Trait",{"$f":"AND(COUNTIF(adv!A:A,A986))","v":false},"Determines creature’s size and benefits.",false]
["Size (Enormous)","Trait",{"$f":"AND(COUNTIF(adv!A:A,A987))","v":false},"Determines creature’s size and benefits.",false]
["Size (Massive)","Trait",{"$f":"AND(COUNTIF(adv!A:A,A988))","v":false},"Determines creature’s size and benefits.",false]
["Sonar Sense","Trait",{"$f":"AND(COUNTIF(adv!A:A,A989))","v":false},"Perceive surroundings flawlessly within 30 metres.",false]
["Soul-bound","Trait",{"$f":"AND(COUNTIF(adv!A:A,A990))","v":false},"Bound to a particular group or creatures in exchange for certain benefits.",false]
["Stampede","Trait",{"$f":"AND(COUNTIF(adv!A:A,A991))","v":false},"Failed Willpower Test causes creature to flee, trampling anything in its path.",false]
["Strange Physiology","Trait",{"$f":"AND(COUNTIF(adv!A:A,A992))","v":false},"Death when damage equals Wounds.",false]
["Stuff of Nightmares","Trait",{"$f":"AND(COUNTIF(adv!A:A,A993))","v":false},"Gain appalling list of immunities.",false]
["Sturdy","Trait",{"$f":"AND(COUNTIF(adv!A:A,A994))","v":false},"+20 bonus to resist grapple and takedown.",false]
["Synapse Creature (Tyranid)","Trait",{"$f":"AND(COUNTIF(adv!A:A,A995))","v":false},"This creature grants the Fearless Talent to nearby Tyranids",false]
["Touched By The Fates","Trait",{"$f":"AND(COUNTIF(adv!A:A,A996))","v":false},"The being has Fate Points and may benefit from Righteous Fury.",false]
["Toxic","Trait",{"$f":"AND(COUNTIF(adv!A:A,A997))","v":false},"Gain poisonous attack.",false]
["Tyranid","Trait",{"$f":"AND(COUNTIF(adv!A:A,A998))","v":false},"This creature possesses many immunities.",false]
["Undying","Trait",{"$f":"AND(COUNTIF(adv!A:A,A999))","v":false},"The creature does not need to breathe and cannot be harmed by diseases, poisons, or toxic effects.",false]
["Unnatural Weapon Skill (x2)","Trait",{"$f":"AND(COUNTIF(adv!A:A,A1000))","v":false},"Increases one Characteristic Bonus.",false]
["Unnatural Weapon Skill (x3)","Trait",{"$f":"AND(COUNTIF(adv!A:A,A1001))","v":false},"Increases one Characteristic Bonus.",false]
["Unnatural Weapon Skill (x4)","Trait",{"$f":"AND(COUNTIF(adv!A:A,A1002))","v":false},"Increases one Characteristic Bonus.",false]
["Unnatural Ballistic Skill (x2)","Trait",{"$f":"AND(COUNTIF(adv!A:A,A1003))","v":false},"Increases one Characteristic Bonus.",false]
["Unnatural Ballistic Skill (x3)","Trait",{"$f":"AND(COUNTIF(adv!A:A,A1004))","v":false},"Increases one Characteristic Bonus.",false]
["Unnatural Ballistic Skill (x4)","Trait",{"$f":"AND(COUNTIF(adv!A:A,A1005))","v":false},"Increases one Characteristic Bonus.",false]
["Unnatural Strength (x2)","Trait",{"$f":"AND(COUNTIF(adv!A:A,A1006))","v":false},"Increases one Characteristic Bonus.",false]
["Unnatural Strength (x3)","Trait",{"$f":"AND(COUNTIF(adv!A:A,A1007))","v":false},"Increases one Characteristic Bonus.",false]
["Unnatural Strength (x4)","Trait",{"$f":"AND(COUNTIF(adv!A:A,A1008))","v":false},"Increases one Characteristic Bonus.",false]
["Unnatural Toughness (x2)","Trait",{"$f":"AND(COUNTIF(adv!A:A,A1009))","v":false},"Increases one Characteristic Bonus.",false]
["Unnatural Toughness (x3)","Trait",{"$f":"AND(COUNTIF(adv!A:A,A1010))","v":false},"Increases one Characteristic Bonus.",false]
["Unnatural Toughness (x4)","Trait",{"$f":"AND(COUNTIF(adv!A:A,A1011))","v":false},"Increases one Characteristic Bonus.",false]
["Unnatural Agility (x2)","Trait",{"$f":"AND(COUNTIF(adv!A:A,A1012))","v":false},"Increases one Characteristic Bonus.",false]
["Unnatural Agility (x3)","Trait",{"$f":"AND(COUNTIF(adv!A:A,A1013))","v":false},"Increases one Characteristic Bonus.",false]
["Unnatural Agility (x4)","Trait",{"$f":"AND(COUNTIF(adv!A:A,A1014))","v":false},"Increases one Characteristic Bonus.",false]
["Unnatural Intelligence (x2)","Trait",{"$f":"AND(COUNTIF(adv!A:A,A1015))","v":false},"Increases one Characteristic Bonus.",false]
["Unnatural Intelligence (x3)","Trait",{"$f":"AND(COUNTIF(adv!A:A,A1016))","v":false},"Increases one Characteristic Bonus.",false]
["Unnatural Intelligence (x4)","Trait",{"$f":"AND(COUNTIF(adv!A:A,A1017))","v":false},"Increases one Characteristic Bonus.",false]
["Unnatural Perception (x2)","Trait",{"$f":"AND(COUNTIF(adv!A:A,A1018))","v":false},"Increases one Characteristic Bonus.",false]
["Unnatural Perception (x3)","Trait",{"$f":"AND(COUNTIF(adv!A:A,A1019))","v":false},"Increases one Characteristic Bonus.",false]
["Unnatural Perception (x4)","Trait",{"$f":"AND(COUNTIF(adv!A:A,A1020))","v":false},"Increases one Characteristic Bonus.",false]
["Unnatural Willpower (x2)","Trait",{"$f":"AND(COUNTIF(adv!A:A,A1021))","v":false},"Increases one Characteristic Bonus.",false]
["Unnatural Willpower (x3)","Trait",{"$f":"AND(COUNTIF(adv!A:A,A1022))","v":false},"Increases one Characteristic Bonus.",false]
["Unnatural Willpower (x4)","Trait",{"$f":"AND(COUNTIF(adv!A:A,A1023))","v":false},"Increases one Characteristic Bonus.",false]
["Unnatural Fellowship (x2)","Trait",{"$f":"AND(COUNTIF(adv!A:A,A1024))","v":false},"Increases one Characteristic Bonus.",false]
["Unnatural Fellowship (x3)","Trait",{"$f":"AND(COUNTIF(adv!A:A,A1025))","v":false},"Increases one Characteristic Bonus.",false]
["Unnatural Fellowship (x4)","Trait",{"$f":"AND(COUNTIF(adv!A:A,A1026))","v":false},"Increases one Characteristic Bonus.",false]
["Unnatural Senses","Trait",{"$f":"AND(COUNTIF(adv!A:A,A1027))","v":false},"Perceive surroundings by uncanny means.",false]
["Unnatural Speed","Trait",{"$f":"AND(COUNTIF(adv!A:A,A1028))","v":false},"Double Agility Bonus for purpose of determining movement.",false]
["Warp Instability","Trait",{"$f":"AND(COUNTIF(adv!A:A,A1029))","v":false},"Creature must deal damage if damaged, or be cast back into the Warp.",false]
["Warp Weapons","Trait",{"$f":"AND(COUNTIF(adv!A:A,A1030))","v":false},"Creature’s weapons ignore Armour.",false]
["Weight of Years","Trait",{"$f":"AND(COUNTIF(adv!A:A,A1031))","v":false},null,false]

{"sheet":"distinctions","index":14,"n_rows":28,"n_cols":9,"rows_kept":28,"hidden":true}
["Group","Marks","Cost",null,"Distinction","Mark 1","Mark 2","Mark 3","Cost"]
["Command","Aura of Leadership",750,null,"Tyrannic War Veteran","Campaign Hero (Tyrannids)","Favoured Foe (Tyrannids)",null,1100]
["Command","Chosen of the Chapter",750,null,"Sanguinary Guard","Angel of Death","Brothers of the Blood","Chosen of the Chapter",2500]
["Command","Endless Favour",600,null,"Emperor's Champion","Chosen of the Chapter","Master of Blades (Power Sword/Power Fist)","Unshakable",2350]
["Command","Enduring Name",500,null,"Deathwing","Chosen of the Chapter","Forbidden Lore (the Fallen)","Master of Secrets",1650]
["Command","First Among Equals",1000,null,"Tempest Blade","Master of Blades (Power Sword, Thunder Hammer)","Mighty Lineage",null,1500]
["Command","Greater Authority",600]
["Command","Lord of the Domain",400]
["Command","Mighty Lineage",500]
["Command","Universal Renown",1000]
["Combat","Angel of Death",1000]
["Combat","Brothers of the Blood",750]
["Combat","Campaign Hero",600]
["Combat","Death World Veteran",400]
["Combat","Favoured Foe",500]
["Combat","Master of Arms",1000]
["Combat","Master of Blades",1000]
["Combat","Peerless Warrior",1000]
["Combat","Waekness as Strength",750]
["Determination","Forbidden Lore",400]
["Determination","Jaws of Intellect",750]
["Determination","Master of Secrets",500]
["Determination","Mental Ascension",600]
["Determination","Reason and Will",600]
["Determination","Secrets of Others",500]
["Determination","Tactical Experience",750]
["Determination","Unshakable",600]
["Determination","Watcher",500]

{"sheet":"wargear","index":15,"n_rows":305,"n_cols":8,"rows_kept":305,"hidden":true}
["Name","Choice","Choice2","Wt","Req","Renown Rank","Renown","Stats"]
["Astartes Backpack Ammo Supply","Ammunition","Special Issue",false,0,"NA",0,false]
["Breaching Rounds","Ammunition","Special Issue",false,8,"Distinguished",40,false]
["Dragonfire Shells","Ammunition","Special Issue",false,28,"Respected",20,false]
["Hellfire Rounds","Ammunition","Special Issue",false,25,"NA",0,false]
["Ignis Rounds","Ammunition","Special Issue",false,10,"Famed",60,false]
["Implosion Shells","Ammunition","Special Issue",false,27,"Respected",20,false]
["Kraken Rounds","Ammunition","Special Issue",false,15,"NA",0,false]
["Metal Storm Rounds","Ammunition","Special Issue",false,15,"NA",0,false]
["Penetrator Rounds","Ammunition","Special Issue",false,6,"Distinguished",40,false]
["Razor-Web","Ammunition","Special Issue",false,6,"Famed",60,false]
["Shredder Rounds","Ammunition","Special Issue",false,7,"Distinguished",40,false]
["Slug Rounds","Ammunition","Special Issue",false,4,"NA",0,false]
["Stalker Rounds","Ammunition","Special Issue",false,5,"NA",0,false]
["Vengeance Rounds","Ammunition","Special Issue",false,25,"Famed",60,false]
["Witch Bolts","Ammunition","Special Issue",false,12,"Distinguished",40,false]
["Bolt Shells","Ammunition","Standard",false,0,"NA",0,false]
["Bullets","Ammunition","Standard",false,0,"NA",0,false]
["Charge Pack","Ammunition","Standard",false,0,"NA",0,false]
["Exotic","Ammunition","Standard",false,0,"Varies",0,false]
["Fuel","Ammunition","Standard",false,0,"NA",0,false]
["Melta Canister","Ammunition","Standard",false,0,"Varies",0,false]
["Needle Precipitator","Ammunition","Standard",false,0,"NA",0,false]
["Plasma Flask","Ammunition","Standard",false,0,"Varies",0,false]
["Shells","Ammunition","Standard",false,0,"NA",0,false]
["Astartes Scout Armour","Armour","Armour",30,0,"NA",0,"Armour"]
["Carapace Armour","Armour","Armour",15,0,"NA",0,"Armour"]
["Deathwatch Scout Armour","Armour","Armour",30,0,"NA",0,"Armour"]
["Flak Armour","Armour","Armour",15,0,"NA",0,"Armour"]
["Primitive Armour","Armour","Armour","Varies",0,"NA",0,"Armour"]
["Masking Screen","Armour","Armour Upgrades",0.5,25,"Distinguished",40,false]
["Astartes Artificer Armour","Armour","Astartes Power Armour",100,60,"Hero",80,"Armour"]
["Astartes Terminator Armour","Armour","Astartes Power Armour",400,100,"Famed",60,"Armour"]
["Mk1 \"Thunder\" Armour","Armour","Astartes Power Armour","200 - 250",0,"NA",0,"Armour"]
["Mk2 \"Crusade\" Armour","Armour","Astartes Power Armour",280,0,"NA",0,"Armour"]
["Mk3 \"Iron\" Armour","Armour","Astartes Power Armour",300,0,"NA",0,"Armour"]
["Mk4 \"Maximus\" Armour","Armour","Astartes Power Armour",220,0,"NA",0,"Armour"]
["Mk5 \"Heresy\" Armour","Armour","Astartes Power Armour",200,0,"NA",0,"Armour"]
["Mk6 \"Corvus\" Armour","Armour","Astartes Power Armour",170,0,"NA",0,"Armour"]
["Mk7 \"Aquila\" Armour","Armour","Astartes Power Armour",180,0,"NA",0,"Armour"]
["Mk8 \"Errant\" Armour","Armour","Astartes Power Armour",190,0,"NA",0,"Armour"]
["Diagnostor Helmet","Armour","Helmet",30,15,"NA",0,"Armour"]
["Fenris-Pattern Wolf Helm","Armour","Helmet",4,0,"NA",0,"Armour"]
["Skull Helm","Armour","Helmet",4,0,"NA",0,"Armour"]
["Chapter Heraldry Tabard","Chapter Trappings","Black Templars",false,0,"NA",0,false]
["Deathwatch / Squad Heraldry Tabard","Chapter Trappings","Black Templars",false,0,"NA",0,false]
["Devotion Chain","Chapter Trappings","Black Templars",false,0,"NA",0,false]
["Ornamental Tabard","Chapter Trappings","Black Templars",false,0,"NA",0,false]
["Blood Drop Pendant","Chapter Trappings","Blood Angels",false,0,"NA",0,false]
["Golden Icon: Icon of Inspiration","Chapter Trappings","Blood Angels",false,0,"NA",0,false]
["Golden Icon: Purity Focus","Chapter Trappings","Blood Angels",false,0,"NA",0,false]
["Golden Icon: Wings of Wrath","Chapter Trappings","Blood Angels",false,0,"NA",0,false]
["Ceremonial Sword","Chapter Trappings","Dark Angels",5,3,"NA",0,"Weapons"]
["Robe of Secrets","Chapter Trappings","Dark Angels",false,0,"NA",0,false]
["Scholar's Robe","Chapter Trappings","Dark Angels",false,0,"NA",0,false]
["Seeker's Robe","Chapter Trappings","Dark Angels",false,0,"NA",0,false]
["Ossific Relic","Chapter Trappings","Imperial Fists",false,0,"NA",0,false]
["Scrimshaw Tools","Chapter Trappings","Imperial Fists",false,0,"NA",0,false]
["Totem of the Bloodied Hunter","Chapter Trappings","Space Wolves",false,0,"NA",0,false]
["Totem of the Sea Wolf","Chapter Trappings","Space Wolves",false,0,"NA",0,false]
["Totem of the Sun Wolf","Chapter Trappings","Space Wolves",false,0,"NA",0,false]
["Wolf Pelt","Chapter Trappings","Space Wolves",false,0,"NA",0,false]
["Sacris Claymore","Chapter Trappings","Storm Wardens",10,3,"NA",0,"Weapons"]
["Tempest Amulet: Amulet of Might","Chapter Trappings","Storm Wardens",false,0,"NA",0,false]
["Tempest Amulet: Guardian Amulet","Chapter Trappings","Storm Wardens",false,0,"NA",0,false]
["Tempest Amulet: Victory Signature","Chapter Trappings","Storm Wardens",false,0,"NA",0,false]
["Cingulum: Adamantine Inlays","Chapter Trappings","Ultramarines",false,0,"NA",0,false]
["Cingulum: Honour Bells","Chapter Trappings","Ultramarines",false,0,"NA",0,false]
["Cingulum: Marks of Leadership","Chapter Trappings","Ultramarines",false,0,"NA",0,false]
["Heraldry Scroll","Chapter Trappings","Ultramarines",false,0,"NA",0,false]
["Bionic Hand","Chapter Trappings","Iron Hands",false,0,"NA",0,false]
["Sable Heraldry: Raven Claw","Chapter Trappings","Raven Guard",false,0,"NA",0,false]
["Sable Heraldry: Raven Calvaria","Chapter Trappings","Raven Guard",false,0,"NA",0,false]
["Helmet Picter","Chapter Trappings","Raven Guard",false,0,"NA",0,false]
["Promethean Sigils: The Flame","Chapter Trappings","Salamanders",false,0,"NA",0,false]
["Promethean Sigils: Tools of the Forge","Chapter Trappings","Salamanders",false,0,"NA",0,false]
["Promethean Sigils: Wyrm-hide","Chapter Trappings","Salamanders",false,0,"NA",0,false]
["Vigil Brazier","Chapter Trappings","Salamanders",false,0,"NA",0,false]
["Honour Gift: Torandor Pelt","Chapter Trappings","White Scars",false,0,"NA",0,false]
["Honour Gift: Fragment of Foes Defeated","Chapter Trappings","White Scars",false,0,"NA",0,false]
["Honour Gift: Savage Totem","Chapter Trappings","White Scars",false,0,"NA",0,false]
["Duelling Tulwar","Chapter Trappings","White Scars",false,0,"NA",0,false]
["Astartes Servo-Arm","Cybernetics","Cybernetics",false,30,"NA",0,false]
["Astartes Servo-Harness","Cybernetics","Cybernetics",false,50,"Famed",60,false]
["Auger Array","Cybernetics","Cybernetics",false,15,"NA",0,false]
["Bionic Arm","Cybernetics","Cybernetics",false,15,"NA",0,false]
["Bionic Hand","Cybernetics","Cybernetics",false,10,"Famed",60,false]
["Bionic Heart","Cybernetics","Cybernetics",false,15,"NA",0,false]
["Bionic Locomotion (Legs etc)","Cybernetics","Cybernetics",false,15,"NA",0,false]
["Bionic Respiratory System","Cybernetics","Cybernetics",false,10,"NA",0,false]
["Cybernetic Senses","Cybernetics","Cybernetics",false,15,"NA",0,false]
["MIU","Cybernetics","Cybernetics",false,15,"NA",0,false]
["Deadlock (Toxin)","Drugs and Consumables","Drugs and Consumables",false,10,"NA",0,false]
["Delay Agent (Toxin)","Drugs and Consumables","Drugs and Consumables",false,6,"NA",0,false]
["De-Tox","Drugs and Consumables","Drugs and Consumables",false,10,"NA",0,false]
["Genophage (Toxin)","Drugs and Consumables","Drugs and Consumables",false,0,"NA",0,false]
["Injector","Drugs and Consumables","Drugs and Consumables",false,3,"NA",0,false]
["Narthecium","Drugs and Consumables","Drugs and Consumables",5,10,"NA",0,false]
["Pain Suppressant","Drugs and Consumables","Drugs and Consumables",false,10,"NA",0,false]
["Repair Cement","Drugs and Consumables","Drugs and Consumables",0.5,1,"NA",0,false]
["Resuscitex","Drugs and Consumables","Drugs and Consumables",false,5,"NA",0,false]
["Sacred Ungents","Drugs and Consumables","Drugs and Consumables",false,20,"NA",0,false]
["Astartes Cluster Mines","Equipment & Tools","Equipment & Tools",4,5,"NA",0,false]
["Astartes Combat Webbing","Equipment & Tools","Equipment & Tools",false,3,"NA",0,false]
["Astartes Grapnel","Equipment & Tools","Equipment & Tools",false,3,"NA",0,false]
["Astartes Harness","Equipment & Tools","Equipment & Tools",8,4,"NA",0,false]
["Astartes Jump Pack","Equipment & Tools","Equipment & Tools",50,15,"NA",0,false]
["Astartes Magboots","Equipment & Tools","Equipment & Tools",5,3,"NA",0,false]
["Astartes Psychic Hood","Equipment & Tools","Equipment & Tools",15,25,"Distinguished",40,false]
["Astartes Signum","Equipment & Tools","Equipment & Tools",5,35,"Distinguished",40,false]
["Astartes Signum Link","Equipment & Tools","Equipment & Tools",0.5,20,"NA",0,false]
["Astartes Targeter","Equipment & Tools","Equipment & Tools",4,25,"Distinguished",40,false]
["Auspex","Equipment & Tools","Equipment & Tools",0.5,12,"NA",0,false]
["Auto-sense Goggle","Equipment & Tools","Equipment & Tools",false,10,"NA",0,false]
["Back Banner","Equipment & Tools","Equipment & Tools",5,15,"NA",0,false]
["Cameleoline Cloak","Equipment & Tools","Equipment & Tools",false,20,"NA",0,false]
["Cameleoline Tarpaulin","Equipment & Tools","Equipment & Tools",false,5,"NA",0,false]
["Cartograph","Equipment & Tools","Equipment & Tools",0.5,5,"NA",0,false]
["Charm","Equipment & Tools","Equipment & Tools",false,6,"NA",0,false]
["Chrono","Equipment & Tools","Equipment & Tools",false,1,"NA",0,false]
["Clavis","Equipment & Tools","Equipment & Tools",false,0,"Distinguished",40,false]
["Codex Astartes","Equipment & Tools","Equipment & Tools",0.5,0,"NA",0,false]
["Combi Tool","Equipment & Tools","Equipment & Tools",1,15,"NA",0,false]
["Data Slate","Equipment & Tools","Equipment & Tools",0.5,5,"NA",0,false]
["Demolition Charges","Equipment & Tools","Equipment & Tools",1,10,"NA",0,false]
["Diagnosticator","Equipment & Tools","Equipment & Tools",false,25,"Distinguished",40,false]
["Dilation Field","Equipment & Tools","Equipment & Tools",1,45,"Famed",60,false]
["Elucidator","Equipment & Tools","Equipment & Tools",1,25,"NA",0,false]
["Grav-flares","Equipment & Tools","Equipment & Tools",false,7,"NA",0,false]
["Infiltriol Enamel","Equipment & Tools","Equipment & Tools",false,10,"Distinguished",40,false]
["Lamp/ Glow-globe","Equipment & Tools","Equipment & Tools",0.5,1,"NA",0,false]
["Locus Seeker","Equipment & Tools","Equipment & Tools",false,30,"NA",0,false]
["Luminator Signal Flare Capsules","Equipment & Tools","Equipment & Tools",false,5,"NA",0,false]
["Magnoculars","Equipment & Tools","Equipment & Tools",0.5,3,"NA",0,false]
["Melta Bomb (2)","Equipment & Tools","Equipment & Tools",12,25,"NA",0,false]
["Multikey","Equipment & Tools","Equipment & Tools",false,15,"NA",0,false]
["Pict","Equipment & Tools","Equipment & Tools",1,5,"NA",0,false]
["Psy-Focus","Equipment & Tools","Equipment & Tools",false,15,"NA",0,false]
["Reductor","Equipment & Tools","Equipment & Tools",4,8,"NA",0,false]
["Restraints","Equipment & Tools","Equipment & Tools",4,10,"NA",0,false]
["Screamer","Equipment & Tools","Equipment & Tools",1.5,5,"NA",0,false]
["Siege Auspex","Equipment & Tools","Equipment & Tools",false,13,"NA",0,false]
["Stalker Flares","Equipment & Tools","Equipment & Tools",false,8,"NA",0,false]
["Stummer","Equipment & Tools","Equipment & Tools",2,5,"NA",0,false]
["Teleport Homer","Equipment & Tools","Equipment & Tools",0,10,"NA",0,false]
["Vivisection Gage","Equipment & Tools","Equipment & Tools",false,35,"Distinguished",40,false]
["Vox-Caster","Equipment & Tools","Equipment & Tools",0.5,10,"NA",0,false]
["Astartes Combat Shield","Force Field","Force Field",3,20,"Distinguished",40,"Force Field"]
["Astartes Storm Shield","Force Field","Force Field",10,35,"Distinguished",40,"Force Field"]
["Iron Halo","Force Field","Force Field",0.5,40,"Hero",80,"Force Field"]
["Rosarius","Force Field","Force Field",0.5,0,"NA",0,"Force Field"]
["Astartes Anti-Plant Grenade","Grenades and Missiles","Grenade",0.5,18,"NA",0,"Weapons"]
["Astartes Blind Grenade","Grenades and Missiles","Grenade",0.8,10,"NA",0,"Weapons"]
["Astartes Frag Grenade","Grenades and Missiles","Grenade",0.8,1,"NA",0,"Weapons"]
["Astartes Incendiary Grenade","Grenades and Missiles","Grenade",1,15,"NA",0,"Weapons"]
["Astartes Krak Grenade","Grenades and Missiles","Grenade",0.8,1,"NA",0,"Weapons"]
["Astartes Nova Grenade","Grenades and Missiles","Grenade",0.8,15,"NA",0,"Weapons"]
["Astartes Plasma Grenade","Grenades and Missiles","Grenade",2,20,"Distinguished",40,"Weapons"]
["Astartes Stasis Grenade","Grenades and Missiles","Grenade",1,0,"NA",0,"Weapons"]
["Astartes Stun Grenade","Grenades and Missiles","Grenade",0.8,10,"NA",0,"Weapons"]
["Concussion Grenade","Grenades and Missiles","Grenade",0.5,18,"NA",0,"Weapons"]
["Cryo Grenade","Grenades and Missiles","Grenade",0.5,18,"NA",0,"Weapons"]
["EMP Grenade","Grenades and Missiles","Grenade",0.5,30,"Respected",20,"Weapons"]
["Inhalation Grenade","Grenades and Missiles","Grenade",2,0,"NA",0,"Weapons"]
["Monoball Grenade","Grenades and Missiles","Grenade",0.5,50,"Distinguished",40,"Weapons"]
["Photon Flash Grenade","Grenades and Missiles","Grenade",0.5,5,"NA",0,"Weapons"]
["Vortex Grenade","Grenades and Missiles","Grenade",1,0,"NA",0,"Weapons"]
["Astartes Anti-Plant Missile","Grenades and Missiles","Missile",1,25,"NA",0,"Weapons"]
["Astartes Frag Missile","Grenades and Missiles","Missile",2,5,"NA",0,"Weapons"]
["Astartes Incendiary Missile","Grenades and Missiles","Missile",2,15,"NA",0,"Weapons"]
["Astartes Krak Missile","Grenades and Missiles","Missile",2,5,"NA",0,"Weapons"]
["Astartes Plasma Missile","Grenades and Missiles","Missile",3,25,"Distinguished",40,"Weapons"]
["Concussion Missile","Grenades and Missiles","Missile",1,20,"NA",0,"Weapons"]
["Leaper Mine","Grenades and Missiles","Placed Explosive",2,5,"NA",0,"Weapons"]
["Melta Bomb","Grenades and Missiles","Placed Explosive",4,12,"NA",0,"Weapons"]
["Honour: Aquila Token","Honours","Codex Astartes",false,0,"NA",0,false]
["Honour: Army Badge","Honours","Codex Astartes",false,0,"NA",0,false]
["Honour: Crux Terminatus","Honours","Codex Astartes",false,0,"NA",0,false]
["Honour: Imperial Laurel","Honours","Codex Astartes",false,0,"NA",0,false]
["Honour: Imperialis","Honours","Codex Astartes",false,0,"NA",0,false]
["Honour: Iron Halo","Honours","Codex Astartes",false,0,"NA",0,false]
["Honour: Iron Skull","Honours","Codex Astartes",false,0,"NA",0,false]
["Honour: Machina Opus","Honours","Codex Astartes",false,0,"NA",0,false]
["Honour: Marksman's Honour","Honours","Codex Astartes",false,0,"NA",0,false]
["Honour: Prime Helix","Honours","Codex Astartes",false,0,"NA",0,false]
["Honour: Purity Seal","Honours","Codex Astartes",false,0,"NA",0,false]
["Honour: Skull and Motto","Honours","Codex Astartes",false,0,"NA",0,false]
["Astartes Chainsword","Melee Weapons","Chain Weapons",10,5,"NA",0,"Weapons"]
["Astartes Force Staff","Melee Weapons","Force Weapons",5,25,"Respected",20,"Weapons"]
["Astartes Force Sword","Melee Weapons","Force Weapons",5,25,"Respected",20,"Weapons"]
["Breaching Augur","Melee Weapons","Other Melee Weapon",28,18,"NA",0,"Weapons"]
["Bulkhead Shears","Melee Weapons","Other Melee Weapon",10,17,"NA",0,"Weapons"]
["Improvised","Melee Weapons","Other Melee Weapon",false,0,"NA",0,"Weapons"]
["Primitive Weapon","Melee Weapons","Other Melee Weapon",false,0,"NA",0,"Weapons"]
["Astartes Chainfist","Melee Weapons","Power Weapons",48,40,"Famed",60,"Weapons"]
["Astartes Executioner Axe","Melee Weapons","Power Weapons",22,25,"Famed",60,"Weapons"]
["Astartes Lightning Claw","Melee Weapons","Power Weapons",30,"30/45","Distinguished",40,"Weapons"]
["Astartes Power Axe","Melee Weapons","Power Weapons",10,20,"Respected",20,"Weapons"]
["Astartes Power Claymore","Melee Weapons","Power Weapons",18,15,"Distinguished",40,"Weapons"]
["Astartes Power Falchion","Melee Weapons","Power Weapons",7,25,"Distinguished",40,"Weapons"]
["Astartes Power Fist","Melee Weapons","Power Weapons",25,30,"Distinguished",40,"Weapons"]
["Astartes Power Spear","Melee Weapons","Power Weapons",8,15,"Distinguished",40,"Weapons"]
["Astartes Power Sword","Melee Weapons","Power Weapons",5,20,"Respected",20,"Weapons"]
["Astartes Thunder Hammer","Melee Weapons","Power Weapons",18,30,"Distinguished",40,"Weapons"]
["Crozius Arcanum","Melee Weapons","Power Weapons",10,0,"NA",0,"Weapons"]
["Omnissian Axe (Astartes-Pattern)","Melee Weapons","Power Weapons",14,30,"Distinguished",40,"Weapons"]
["Astartes Combat Knife","Melee Weapons","Traditional Weapons",2,3,"NA",0,"Weapons"]
["Ceremonial Sword","Melee Weapons","Traditional Weapons",5,3,"NA",0,"Weapons"]
["Sacris Claymore","Melee Weapons","Traditional Weapons",10,3,"NA",0,"Weapons"]
["Psyber-Raven","Psyber Familiars","Psyber Familiars",false,20,"Famed",60,false]
["Astartes Bolt Pistol","Ranged Weapons","Bolt Weapons",5.5,5,"NA",0,"Weapons"]
["Astartes Bolter (Godwyn)","Ranged Weapons","Bolt Weapons",18,5,"NA",0,"Weapons"]
["Astartes Boltgun (Stalker)","Ranged Weapons","Bolt Weapons",17,15,"Respected",20,"Weapons"]
["Astartes Combi-Weapon","Ranged Weapons","Bolt Weapons",25,15,"Respected",20,"Weapons"]
["Astartes Heavy Bolter","Ranged Weapons","Bolt Weapons",68,20,"NA",0,"Weapons"]
["Astartes Storm Bolter","Ranged Weapons","Bolt Weapons",26,20,"Respected",20,"Weapons"]
["Bolter (Hesh)","Ranged Weapons","Bolt Weapons",15,0,"NA",0,"Weapons"]
["Guardian Bolt Pistol","Ranged Weapons","Bolt Weapons",5.5,0,"Distinguished",40,"Weapons"]
["Astartes Conversion Beamer","Ranged Weapons","Exotic Weapons",85,40,"Hero",80,"Weapons"]
["Astartes Digital Flamer","Ranged Weapons","Exotic Weapons",0.1,35,"Famed",60,"Weapons"]
["Astartes Digital Laser","Ranged Weapons","Exotic Weapons",0.1,35,"Famed",60,"Weapons"]
["Astartes Digital Melta","Ranged Weapons","Exotic Weapons",0.1,35,"Famed",60,"Weapons"]
["Astartes Sniper Rifle","Ranged Weapons","Exotic Weapons",4,20,"NA",0,"Weapons"]
["Astartes Webber","Ranged Weapons","Exotic Weapons",8,10,"NA",0,"Weapons"]
["Atomizer Cannon","Ranged Weapons","Exotic Weapons",80,50,"Famed",60,"Weapons"]
["Deathwatch Graviton Cannon","Ranged Weapons","Exotic Weapons",65,45,"Distinguished",40,"Weapons"]
["Mk IX Ultra Pattern Sniper Rifle","Ranged Weapons","Exotic Weapons",4,25,"NA",0,"Weapons"]
["Seismic Escalation Detonator","Ranged Weapons","Exotic Weapons",40,40,"NA",0,"Weapons"]
["Techxorcism Gun","Ranged Weapons","Exotic Weapons",false,30,"Respected",20,"Weapons"]
["Astartes Flamer","Ranged Weapons","Flame Weapons",15,10,"NA",0,"Weapons"]
["Astartes Hand Flamer","Ranged Weapons","Flame Weapons",6,10,"NA",0,"Weapons"]
["Astartes Heavy Flamer","Ranged Weapons","Flame Weapons",65,15,"NA",0,"Weapons"]
["Balefire Gun","Ranged Weapons","Flame Weapons",7,16,"Respected",20,"Weapons"]
["Immolation Rifle","Ranged Weapons","Flame Weapons",5,15,"NA",0,"Weapons"]
["Astartes Lascannon","Ranged Weapons","Las Weapons",75,30,"Respected",20,"Weapons"]
["Lasgun","Ranged Weapons","Las Weapons",4,0,"NA",0,"Weapons"]
["Laspistol","Ranged Weapons","Las Weapons",1.5,0,"NA",0,"Weapons"]
["Astartes Armoursbane Missile-Launcher","Ranged Weapons","Launchers",12,15,"NA",0,"Weapons"]
["Astartes Cyclone Missile Launcher","Ranged Weapons","Launchers",95,25,"Famed",60,"Weapons"]
["Astartes Missile Launcher (Soundstrike)","Ranged Weapons","Launchers",50,10,"NA",0,"Weapons"]
["Auxiliary Grenade Launcher","Ranged Weapons","Launchers",3,15,"Respected",20,"Weapons"]
["Astartes Infernus Pistol","Ranged Weapons","Melta Weapons",5,35,"Famed",60,"Weapons"]
["Astartes Meltagun (Vulkan)","Ranged Weapons","Melta Weapons",14,20,"Respected",20,"Weapons"]
["Astartes Multi-melta (Maxima)","Ranged Weapons","Melta Weapons",72,35,"Respected",20,"Weapons"]
["Conflaguration Infernus Pistol","Ranged Weapons","Melta Weapons",3,35,"Distinguished",40,"Weapons"]
["Conflaguration Meltagun","Ranged Weapons","Melta Weapons",14,35,"Distinguished",40,"Weapons"]
["Firestorm Multi-Melta","Ranged Weapons","Melta Weapons",70,65,"Distinguished",40,"Weapons"]
["Astartes Plasma Cannon","Ranged Weapons","Plasma Weapons",70,30,"Distinguished",40,"Weapons"]
["Astartes Plasma Gun (Ragefire)","Ranged Weapons","Plasma Weapons",27,20,"Respected",20,"Weapons"]
["Astartes Plasma Pistol","Ranged Weapons","Plasma Weapons",6,25,"Respected",20,"Weapons"]
["Barrage Plasma Gun","Ranged Weapons","Plasma Weapons",30,28,"Distinguished",40,"Weapons"]
["Barrage Plasma Pistol","Ranged Weapons","Plasma Weapons",7,32,"Famed",60,"Weapons"]
["Astartes Assault Cannon","Ranged Weapons","Solid Projectile Weapons",80,30,"Famed",60,"Weapons"]
["Astartes Assault Shotgun","Ranged Weapons","Solid Projectile Weapons",10,7,"NA",0,"Weapons"]
["Astartes Shotgun","Ranged Weapons","Solid Projectile Weapons",10,5,"NA",0,"Weapons"]
["Autogun","Ranged Weapons","Solid Projectile Weapons",3.5,0,"NA",0,"Weapons"]
["Autopistol","Ranged Weapons","Solid Projectile Weapons",2.5,0,"NA",0,"Weapons"]
["Armour of the Remorselss Crusader (Sword Profile)","Relics","Black Templars Relics",110,70,"Hero",80,"Weapons"]
["Chain of Zeal","Relics","Black Templars Relics",3,30,"Distinguished",40,false]
["Witchbane","Relics","Black Templars Relics",8,10,"Famed",60,"Weapons"]
["Chalice of Vision","Relics","Blood Angels Relics",5,70,"Hero",80,false]
["Octavio's Burden","Relics","Blood Angels Relics",18,25,"Distinguished",40,"Weapons"]
["Wings of Saronath","Relics","Blood Angels Relics",45,45,"Hero",80,false]
["Deathroar","Relics","Dark Angels Relics",7,70,"Hero",80,"Weapons"]
["Furious Vengeance","Relics","Dark Angels Relics",18,25,"Hero",80,"Weapons"]
["Adamantine Mantle","Relics","Deathwatch Relics",15,50,"Hero",80,false]
["Augury Malifica","Relics","Deathwatch Relics",1,20,"Hero",80,false]
["Deathwatch Relic Blade","Relics","Deathwatch Relics",25,50,"Hero",80,"Weapons"]
["Fist of Dragos","Relics","Deathwatch Relics",25,35,"Famed",60,"Weapons"]
["Plasma Gun 438","Relics","Deathwatch Relics",30,25,"Distinguished",40,"Weapons"]
["Redemption of St. Sulech","Relics","Deathwatch Relics",68,40,"Famed",60,"Weapons"]
["Remembrance Shield","Relics","Deathwatch Relics",3,30,"Famed",60,false]
["Salvation of Correus","Relics","Deathwatch Relics",2,40,"Hero",80,"Weapons"]
["Skapulan Bolter","Relics","Deathwatch Relics",16,75,"Hero",80,"Weapons"]
["Skull of Brantor","Relics","Deathwatch Relics",3,35,"Distinguished",40,false]
["The Corroded Falchion","Relics","Deathwatch Relics",8,30,"Hero",80,"Weapons"]
["The Krixian Chainglaive","Relics","Deathwatch Relics",18,35,"Famed",60,"Weapons"]
["The Pleician Tome","Relics","Deathwatch Relics",5,30,"Hero",80,false]
["Triflame Vambrace","Relics","Deathwatch Relics",13,45,"Famed",60,"Weapons"]
["Duty's End","Relics","Imperial Fists Relics",12,60,"Hero",80,false]
["Striker of Allerox","Relics","Imperial Fists Relics",4,30,"Famed",60,false]
["Blacksnow Charm","Relics","Space Wolves Relics",0.1,10,"Distinguished",40,false]
["Frost Blade","Relics","Space Wolves Relics",10,60,"Hero",80,"Weapons"]
["Teeth of the Blizzard","Relics","Space Wolves Relics",10,75,"Hero",80,"Weapons"]
["Skybolt","Relics","Storm Wardens Relics",15,50,"Hero",80,"Weapons"]
["The Levin Shield","Relics","Storm Wardens Relics",10,50,"Hero",80,false]
["Helm of Varthion","Relics","Ultramarines Relics",18,70,"Hero",80,false]
["Jaw of Bloodcharn","Relics","Ultramarines Relics",10,30,"Famed",60,"Weapons"]
["Urion's Doom","Relics","Ultramarines Relics",25,35,"Famed",60,"Weapons"]
["Servitor (Battle)","Servitors and Familiars","Servitors and Familiars",false,20,"Distinguished",40,false]
["Servitor (Monotask)","Servitors and Familiars","Servitors and Familiars",false,15,"Distinguished",40,false]
["Servo-skull","Servitors and Familiars","Servitors and Familiars",false,15,"Distinguished",40,false]
["Arm Weapon Mounting","Weapon Upgrades","Weapon Upgrades",1.5,10,"Distinguished",40,false]
["Astartes Melee Attachment (Chain)","Weapon Upgrades","Weapon Upgrades",8,9,"NA",0,false]
["Astartes Melee Attachment (Mono)","Weapon Upgrades","Weapon Upgrades",2,7,"NA",0,false]
["Deathwatch Suspensor","Weapon Upgrades","Weapon Upgrades","x1/2",25,"Respected",20,false]
["Dipole Mag-lock","Weapon Upgrades","Weapon Upgrades",false,5,"NA",0,false]
["Fire Selector","Weapon Upgrades","Weapon Upgrades",1,2,"NA",0,false]
["Motion Predictor","Weapon Upgrades","Weapon Upgrades",0.5,20,"Respected",20,false]
["Preysense Sight","Weapon Upgrades","Weapon Upgrades",0.5,10,"NA",0,false]
["Red-Dot Laser Sight","Weapon Upgrades","Weapon Upgrades",0.5,10,"NA",0,false]
["Silencer","Weapon Upgrades","Weapon Upgrades",0.5,3,"NA",0,false]
["Telescopic Sight","Weapon Upgrades","Weapon Upgrades",1,6,"NA",0,false]
["Tripod","Weapon Upgrades","Weapon Upgrades",false,3,"NA",0,false]
["Vox-Operated","Weapon Upgrades","Weapon Upgrades",false,5,"NA",0,false]

{"sheet":"weapons","index":16,"n_rows":113,"n_cols":21,"rows_kept":113,"hidden":true}
["Name","Class","Range","RoF","Dmg","Type","Pen","Clip","Rld","Special","Die Number","Die","Modifier","RoF","Dmg","Type","Pen","Special","Die Number","Die","Modifier"]
["Armour of the Remorselss Crusader (Sword Profile)","Melee","-","-","1d10+8","R",6,"-","NA","Sanctified",1,10,8,"-","1d10+8","R",6,"Sanctified",1,10,8]
["Astartes Anti-Plant Grenade","Thrown","SBx3","S/-/-","3d10","E",0,"-","-","Blast (3)",3,10,0,"S/-/-","3d10","E",0,"Blast (3)",3,10,0]
["Astartes Anti-Plant Missile","-","-","-","5d10","E",0,"-","-","Blast (5)",5,10,0,"-","5d10+10","E",0,"Blast (5)",5,10,10]
["Astartes Armoursbane Missile-Launcher","Heavy","200m","S/-/-","-","-",0,1,"2 Full","-",false,false,false,"S/-/-","-","-",0,"-",false,false,false]
["Astartes Assault Cannon","Mounted","150m","-/-/10","3d10+6","I",6,200,"3 Full","Tearing",3,10,6,"-/-/10","2d10+12","I",6,"Devastating (1), Tearing",2,10,12]
["Astartes Assault Shotgun","Basic","30m","S/3/5","2d10+4","I",0,20,"Full","Reliable, Scatter",2,10,4,"S/3/5","1d10+10","I",4,"Reliable, Scatter",1,10,10]
["Astartes Blind Grenade","Thrown","SBx3","S/-/- - ","-","-",0,"-","-","Smoke",false,false,false,"S/-/-","-","-",0,"Smoke",false,false,false]
["Astartes Bolt Pistol","Pistol","30m","S/3/-","2d10+5","X",5,14,"Full","Tearing",2,10,5,"S/2/-","1d10+9","X",4,"Tearing",1,10,9]
["Astartes Bolter (Godwyn)","Basic","100m","S/2/4","2d10+5","X",5,28,"Full","Tearing",2,10,5,"S/3/-","1d10+9","X",4,"Tearing",1,10,9]
["Astartes Boltgun (Stalker)","Basic","200m","S/-/-","2d10+5","X",5,24,"Full","Accurate, Tearing",2,10,5,"S/-/-","1d10+9","X",4,"Accurate, Tearing",1,10,9]
["Astartes Chainfist","Mounted","-","-","2d10","E",10,"-","-","Power Field, Tearing",2,10,0,"-","2d10","E",10,"Power Field, Tearing, Unwieldy",2,10,0]
["Astartes Chainsword","Melee","-","-","1d10+3","R",4,"-","-","Balanced, Tearing",1,10,3,"-","1d10+3","R",3,"Balanced, Tearing",1,10,3]
["Astartes Combat Knife","Melee","-","-","1d10+2","R",2,"-","-","-",1,10,2,"-","1d10","R",2,"-",1,10,0]
["Astartes Combi-Weapon","Basic","100m","S/2/4","2d10+5","X",5,28,"Full","Tearing",2,10,5,"S/4/-","1d10+9","X",4,"Tearing",1,10,9]
["Astartes Conversion Beamer","Heavy","100m","S/-/-","Varies","Varies","Varies",4,"2 Full","-",false,false,false,"S/-/-","Varies","Varies","Varies","-",false,false,false]
["Astartes Cyclone Missile Launcher","Mounted","300m","S/2/-","-","-",0,12,"3 Full","-",false,false,false,"S/2/-","-","-",0,"-",false,false,false]
["Astartes Digital Flamer","Pistol","4m","S/-/-","2d10+2","E",3,1,"Special","Flame",2,10,2,"S/-/-","2d10+2","E",3,"Flame",2,10,2]
["Astartes Digital Laser","Pistol","4m","S/-/-","1d10+4","E",7,1,"Special","Reliable",1,10,2,"S/-/-","1d10+4","E",7,"Reliable",1,10,4]
["Astartes Digital Melta","Pistol","4m","S/-/-","2d10+5","E",12,1,"Special","-",2,10,4,"S/-/-","2d10+5","E",12,"-",2,10,5]
["Astartes Executioner Axe","Melee","-","-","2d10+8","E",6,"-","-","Power Field, Unwieldy, Felling (1)",2,10,8,"-","1d10+13","E",8,"Power Field, Unwieldy, Felling (1)",1,10,13]
["Astartes Flamer","Basic","20m","S/-/-","2d10+2","E",3,6,"2 Full","Flame",2,10,2,"S/-/-","1d10+9","E",4,"Flame",1,10,9]
["Astartes Force Staff","Melee","-","-","1d10+1","I",0,"-","-","Balanced, Special",1,10,1,"-","1d10+1","I",0,"Balanced, Special",1,10,1]
["Astartes Force Sword","Melee","-","-","1d10+2","R",2,"-","-","Balanced, Special",1,10,2,"-","1d10+2","R",2,"Balanced, Special",1,10,2]
["Astartes Frag Grenade","Thrown","SBx3","S/-/-","2d10","X",0,"-","-","Blast (5)",2,10,0,"S/-/-","2d10+2","X",0,"Blast (4)",2,10,2]
["Astartes Frag Missile","-","-","-","2d10","X",4,"-","-","Blast (8), Devastating (1)",2,10,0,"-","2d10","X",4,"Blast (5), Devastating (1)",2,10,0]
["Astartes Hand Flamer","Pistol","10m","S/-/-","2d10+2","E",3,4,"2 Full","Flame",2,10,2,"S/-/-","1d10+7","E",4,"Flame",1,10,7]
["Astartes Heavy Bolter","Heavy","150m","-/-/10","2d10+10","X",6,60,"Full","Tearing",2,10,10,"-/-/6","1d10+12","X",5,"Tearing",1,10,12]
["Astartes Heavy Flamer","Heavy","30m","S/-/-","2d10+6","E",6,10,"2 Full","Flame",2,10,6,"S/-/-","1d10+12","E",6,"Flame",1,10,12]
["Astartes Incendiary Grenade","Thrown","SBx3","S/-/-","1d10+4","E",0,"-","-","Blast (3)",1,10,4,"S/-/-","1d10+4","E",0,"Blast (3)",1,10,4]
["Astartes Incendiary Missile","-","-","-","1d10+3","E",0,"-","-","Blast (5)",1,10,3,"-","1d10+3","E",0,"Blast (5)",1,10,3]
["Astartes Infernus Pistol","Pistol","10m","S/-/-","2d10+8","E",13,4,"Full","-",2,10,8,"S/-/-","2d10+14","E",12,"-",2,10,14]
["Astartes Krak Grenade","Thrown","SBx3","S/-/-","3d10+4","X",6,"-","-","-",3,10,4,"S/-/-","3d10+4","X",6,"-",3,10,4]
["Astartes Krak Missile","-","-","-","4d10+6","X",10,"-","-","Blast (1)",4,10,6,"-","3d10+10","X",8,"Blast (1)",3,10,10]
["Astartes Lascannon","Heavy","300m","S/-/-","6d10+10","E",10,6,"2 Full","-",6,10,10,"S/-/-","5d10+10","E",10,"Proven (3)",5,10,10]
["Astartes Lightning Claw","Melee","-","-","1d10+6","E",8,"-","-","Power Field, Special, Tearing",1,10,6,"-","1d10+6","E",8,"Power Field, Proven (4)",1,10,6]
["Astartes Meltagun (Vulkan)","Basic","20m","S/-/-","2d10+8","E",13,6,"2 Full","-",2,10,8,"S/-/-","-","-",0,"-",null,10]
["Astartes Missile Launcher (Soundstrike)","Heavy","250m","S/-/-","-","-",0,8,"Full","-",false,false,false,"S/-/-","-","-",0,"-",false,false,false]
["Astartes Multi-melta (Maxima)","Heavy","60m","S/-/-","4d10+6","E",13,12,"2 Full","Blast (1)",4,10,6,"S/-/-","2d10+16","E",12,"Blast (1)",2,10,16]
["Astartes Nova Grenade","Thrown","SBx3","S/-/-","1d10","E",0,"-","-","Blast(3)",1,10,0,"S/-/-","1d10","E",0,"Blast (3)",1,10,0]
["Astartes Plasma Cannon","Heavy","150m","S/-/-","2d10+11","E",10,16,"5 Full","Blast (1), Volatile",2,10,11,"S/-/-","2d10+12","E",10,"Blast (3), Volatile",2,10,12]
["Astartes Plasma Grenade","Thrown","SBx3","S/-/-","1d10+12","E",8,"-","-","Blast (1), Special, Volatile",1,10,12,"S/-/-","1d10+12","E",8,"Blast (1), Special, Volatile",1,10,12]
["Astartes Plasma Gun (Ragefire)","Basic","100m","S/2/-","1d10+9","E",8,40,"4 Full","Volatile",1,10,9,"S/2/-","1d10+12","E",10,"Volatile",1,10,12]
["Astartes Plasma Missile","-","-","-","2d10+12","E",12,"-","-","Blast (3), Special, Volatile",2,10,12,"-","2d10+12","E",12,"Blast (3), Special, Volatile",2,10,12]
["Astartes Plasma Pistol","Pistol","30m","S/2/-","1d10+8","E",8,12,"3 Full","Volatile",1,10,8,"S/2/-","1d10+10","E",8,"Volatile",1,10,10]
["Astartes Power Axe","Melee","-","-","1d10+8","E",6,"-","-","Power Field, Unbalanced",1,10,8,"-","1d10+8","E",7,"Power Field, Unbalanced",1,10,8]
["Astartes Power Claymore","Melee","-","-","2d10+6","E",6,"-","-","Power Field, Unwieldy, Devastating (1)",2,10,6,"-","1d10+11","E",8,"Power Field, Unwiedly, Devastating (1)",1,10,11]
["Astartes Power Falchion","Melee","-","-","1d10+4","E",5,"-","-","Power Field, Razoe Sharp",1,10,4,"-","1d10+4","E",6,"Power Field, Razoe Sharp",1,10,4]
["Astartes Power Fist","Melee","-","-","2d10","E",9,"-","-","Power Field, Unwieldy",2,10,0,"-","2d10","E",9,"Power Field, Unwieldy",2,10,0]
["Astartes Power Spear","Melee","-","-","1d10+6","E",7,"-","-","Power Field",1,10,6,"-","1d10+6","E",7,"Power Field",1,10,6]
["Astartes Power Sword","Melee","-","-","1d10+6","E",6,"-","-","Balanced, Power Field",1,10,6,"-","1d10+6","E",6,"Balanced, Power Field",1,10,6]
["Astartes Shotgun","Basic","30m","S/2/-","2d10+3","I",0,18,"Full","Reliable, Scatter",2,10,3,"S/2/-","1d10+9","I",4,"Reliable, Scatter",1,10,9]
["Astartes Sniper Rifle","Basic","200m","S/-/-","1d10","R",0,6,"2 Full","Accurate, Felling (1), Toxic",1,10,5,"S/-/-","1d10","R",0,"Accurate, Felling (1), Toxic",1,10,0]
["Astartes Stasis Grenade","Thrown","SBx3","S/-/-","-","-",0,"-","-","-",false,false,false,"S/-/-","-","-",0,"-",false,false,false]
["Astartes Storm Bolter","Basic","100m","S/2/4","2d10+5","X",5,60,"2 Full","Full Storm, Tearing",2,10,5,"S/4/-","1d10+9","X",4,"Full Storm, Tearing",1,10,9]
["Astartes Stun Grenade","Thrown","SBx3","S/-/-","-","-",0,"-","-","Blast (5)",false,false,false,"S/-/-","-","-",0,"Blast (5)",false,false,false]
["Astartes Thunder Hammer","Melee","-","-","2d10+5","E",8,"-","-","Power Field, Concussive, Unwieldy",2,10,5,"-","2d10+5","E",9,"Power Field, Concussive, Unwieldy",2,10,5]
["Astartes Webber","Basic","80m","S/-/-","-","-",0,5,"Full","Blast (5), Snare",false,false,false,"S/-/-","-","-",0,"Blast (5), Snare",false,false,false]
["Atomizer Cannon","Heavy","50m","S/-/-","4d10+4","E",8,25,"3 Full","Blast (5), Devastating (4), Volatile",4,10,4,"S/-/-","2d10+14","E",8,"Blast (5), Devastating (4), Volatile",2,10,14]
["Autogun","Basic","90m","S/3/10","1d10+3","I",0,30,"2 Full","-",1,10,3,"S/3/-","1d10+3","I",0,"-",1,10,3]
["Autopistol","Pistol","30m","S/-/6","1d10+2","I",0,18,"Full","-",1,10,2,"S/2/-","1d10+3","I",0,"-",1,10,3]
["Auxiliary Grenade Launcher","-","45m","S/-/-","-","-",0,4,"2 Full","-",false,false,false,"S/-/-","-","-",0,"-",false,false,false]
["Balefire Gun","Basic","20m","S/-/-","2d10+2","E",3,6,"2 Full","Flame, Toxic",2,10,2,"S/-/-","1d10+9","E",4,"Flame, Toxic",1,10,9]
["Barrage Plasma Gun","Basic","120m","S/3/5","1d10+7","E",8,30,"4 Full","Overheats, Volatile",1,10,7,"S/3/5","1d10+9","E",10,"Overheats, Volatile",1,10,9]
["Barrage Plasma Pistol","Pistol","40m","S/3/-","1d10+6","E",8,9,"3 Full","Overheats, Volatile",1,10,6,"S/3/-","1d10+8","E",8,"Overheats, Volatile",1,10,8]
["Bolter (Hesh)","Basic","50m","S/2/4","2d10+5","X",5,28,"Full","Tearing, Accurate, Reliable",2,10,5,"S/3/-","1d10+9","X",4,"Tearing, Accurate, Reliable",1,10,9]
["Breaching Augur","Melee","-","-","4d10+3","R",7,"-","-","Tearing, Unwieldy, Power Field",4,10,3,"-","2d10+11","R",7,"Tearing, Unwieldy, Power Field",2,10,11]
["Bulkhead Shears","Melee","-","-","4d10+5","R",6,"-","-","Tearing, Unwieldy",4,10,5,"-","2d10+13","R",6,"Tearing, Unwieldy",2,10,13]
["Ceremonial Sword","Melee","-","-","1d10+3","R",2,"-","-","Balanced",1,10,3,"-","1d10+3","R",2,"Balanced",1,10,3]
["Concussion Grenade","Thrown","SBx3","-","4d10","I",3,"-","-","Concussive, Blast (3)",4,10,0,"S/-/-","4d10","I",3,"Concussive, Blast (3)",4,10,0]
["Concussion Missile","-","-","-","6d10","I",5,"-","-","Concussive, Blast (5)",6,10,0,"-","6d10","I",5,"Concussive, Blast (5)",6,10,0]
["Conflaguration Infernus Pistol","Pistol","10m","S/-/-","2d10+10","E",15,2,"Full","-",2,10,10,"S/-/-","2d10+14","E",14,"-",2,10,14]
["Conflaguration Meltagun","Basic","20m","S/-/-","2d10+10","E",15,4,"2 Full","-",2,10,10,"S/-/-","2d10+14","E",14,"-",2,10,14]
["Crozius Arcanum","Melee","-","-","1d10+7","E",7,"-","-","Balanced, Power Field",1,10,7,"-","1d10+7","E",7,"Balanced, Power Field",1,10,7]
["Cryo Grenade","Thrown","SBx3","S/-/-","Special","Special",3,"-","-","Blast (3)",false,false,false,"S/-/-","Special","Special",3,"Blast (3)",false,false,false]
["Deathroar","Pistol","40m","S/-/-","2d10+13","E",10,10,"3 Full","Blast(1), Felling (1), Volatile",2,10,13,"S/-/-","2d10+13","E",10,"Blast(1), Felling (1), Volatile",2,10,13]
["Deathwatch Graviton Cannon","Heavy","45m","S/-/-","Special","-",0,5,"3 Full","Blast (5)",false,false,false,"S/-/-","Special","-",5,"Blast (5)",null,10]
["Deathwatch Relic Blade","Melee","-","-","2d10+7","E",9,"-","NA","Power Field, Special",2,10,7,"-","2d10+7","E",9,"Power Field, Special",2,10,7]
["EMP Grenade","Thrown","SBx3","S/-/-","-","-",0,"-","-","Haywire (3)",false,false,false,"S/-/-","-","-",0,"Haywire (3)",false,false,false]
["Firestorm Multi-Melta","Heavy","100m","S/2/-","5d10+5","E",15,6,"2 Full","Blast (2), Recharge, Volatile",5,10,5,"S/2/-","2d10+20","E",14,"Blast (2), Recharge, Volatile",2,10,20]
["Fist of Dragos","Melee","-","-","2d10+4","E",9,"-","NA","Power Field, Unwieldy",2,10,4,"-","2d10+4","E",9,"Power Field, Unwieldy",2,10,4]
["Frost Blade","Melee","-","-","1d10+11","E",9,"-","NA","Balanced, Power Field, Tearing",1,10,11,"-","1d10+11","E",9,"Balanced, Power Field, Tearing",1,10,11]
["Furious Vengeance","Basic","100m","S/2/4","2d10+5","X",8,28,"Full","Tearing, Felling (1)",2,10,5,"S/2/4","2d10+5","X",8,"Tearing, Felling (1)",2,10,5]
["Guardian Bolt Pistol","Pistol","30m","S/3/-","2d10+5","X",5,14,"Full","Tearing, Accurate, Reliable",2,10,5,"S/2/-","1d10+9","X",4,"Tearing, Accurate, Reliable",1,10,9]
["Immolation Rifle","Basic","25m","S/-/-","2d10+5","E",1,5,"Full","Flame",2,10,5,"S/-/-","1d10+12","E",2,"Flame",1,10,12]
["Improvised","Melee","-","-","1d10-2","I",0,"-","-","Primitive, Unbalanced",1,10,-2,"-","1d10-2","I",0,"Primitive, Ubalanced",1,10,-2]
["Inhalation Grenade","Thrown","SBx3","S/-/-","Special","Special",0,"-","-","Blast (5)",false,false,false,"S/-/-","Special","Special",0,"Blast (5)",false,false,false]
["Jaw of Bloodcharn","Melee","-","-","1d10+3","R",4,"-","NA","Balanced, Tearing",1,10,3,"-","1d10+3","R",4,"Balanced, Tearing",1,10,3]
["Lasgun","Basic","100m","S/3/-","1d10+3","E",0,60,"Full","Reliable",1,10,3,"S/3/-","1d10+3","E",0,"Reliable",1,10,3]
["Laspistol","Pistol","30m","S/-/-","1d10+2","E",0,30,"Full","Reliable",1,10,2,"S/-/-","1d10+3","E",0,"Reliable",1,10,3]
["Leaper Mine","Placed Explosive","2m","S/-/-","4d10+5","I",3,"-","-","Blast",4,10,5,"S/-/-","3d10+9","I",3,"Blast",3,10,9]
["Melta Bomb","Placed Explosive","5m","S/-/-","6d10+7","E",15,"-","-","Blast (5)",6,10,7,"S/-/-","5d10+7","E",12,"Blast (5)",5,10,7]
["Mk IX Ultra Pattern Sniper Rifle","Basic","250m","S/-/-","1d10+2","R",0,5,"Full","Accurate, Felling (1), Toxic",1,10,2,"S/-/-","1d10+4","R",2,"Accurate, Felling (1), Toxic",1,10,4]
["Monoball Grenade","Thrown","SBx3","S/-/-","5d10+5","R",6,"-","-","Blast (3), Tearing",5,10,5,"S/-/-","4d10+8","R",8,"Blast (3), Tearing",4,10,8]
["Octavio's Burden","Basic","100m","S/2/4","2d10+5","X",5,28,"Full","Tearing",2,10,5,"S/2/4","2d10+5","X",5,"Tearing",2,10,5]
["Omnissian Axe (Astartes-Pattern)","Melee","-","-","2d10+6","E",6,"-","-","Power Field, Unbalanced",2,10,6,"-","1d10+11","E",6,"Power Field, Unwieldy",1,10,11]
["Photon Flash Grenade","Thrown","SBx3","S/-/-","Special","Special",0,"-","-","-",false,false,false,"S/-/-","Special","Special",0,false,false,false,false]
["Plasma Gun 438","Basic","120m","S/2/-","1d10+12","E",9,40,"4 Full","Volatile",1,10,12,"S/2/-","1d10+12","E",9,"Volatile",1,10,12]
["Primitive Weapon","Melee","-","-","1d10","I",0,"-","-","Primitive",1,10,0,"-","1d10","I",0,"Primitive",1,10,0]
["Redemption of St. Sulech","Heavy","160m","-/-/12","2d10+12","X",6,60,"Full","Tearing",2,10,12,"-/-/12","2d10+12","X",6,"Tearing",2,10,12]
["Sacris Claymore","Melee","-","-","2d10+2","R",2,"-","-","Unbalanced",2,10,2,"-","1d10+2","R",2,"Unbalanced",1,10,2]
["Salvation of Correus","Melee","-","-","1d10+3","R",2,"-","NA","Devastating (2)",1,10,3,"-","1d10+3","R",2,"Devastating (2)",1,10,3]
["Seismic Escalation Detonator","Heavy","100m","S/-/-","4d10+10 per round","I",0,"Special","3 Full","Blast (10)",4,10,10,"S/-/-","3d10+14 per round","I",0,"Blast (10)",3,10,14]
["Skapulan Bolter","Basic","120m","S/2/4","2d10+9","X",7,28,"Full","Accurate, Tearing, Special",2,10,9,"S/2/4","2d10+9","X",7,"Accurate, Tearing, Special",2,10,9]
["Skybolt","Melee","-","-","1d10+4","E",8,"-","NA","Power Field, Felling (2)",1,10,4,"-","1d10+4","E",8,"Power Field, Felling (2)",1,10,4]
["Techxorcism Gun","Basic","80m","S/3/-","1d10+4","E",4,30,"Full","Shocking, Special",1,10,4,"S/3/-","1d10+4","E",4,"Shocking, Special",1,10,4]
["Teeth of the Blizzard","Melee","-","-","1d10+12","E",9,"-","NA","Balanced, Power Field, Tearing",1,10,12,"-","1d10+12","E",9,"Balanced, Power Field, Tearing",1,10,12]
["The Corroded Falchion","Melee","-","-","1d10+5","R",3,"-","NA","Balanced, Devastating (1), Toxic",1,10,5,"-","1d10+5","R",3,"Balanced, Devastating (1), Toxic",1,10,5]
["The Krixian Chainglaive","Melee","-","-","1d10+8","R",4,"-","NA","Tearing",1,10,8,"-","1d10+8","R",4,"Tearing",1,10,8]
["Triflame Vambrace","Basic","30m","S/-/-","2d10+4","E",5,12,"3 Full","Flame",2,10,4,"S/-/-","2d10+4","E",5,"Flame",2,10,4]
["Urion's Doom","Basic","120m","S/2/4","2d10+5","X",5,60,"2 Full","Storm, Tearing",2,10,5,"S/2/4","2d10+5","X",5,"Storm, Tearing",2,10,5]
["Vortex Grenade","Thrown","SBx3","S/-/-","Special","Special",0,"-","-","-",false,false,false,"S/-/-","Special","Special",0,false,false,false,false]
["Witchbane","Melee","-","-","1d10+5","R",4,"-","-","Balanced, Tearing",1,10,5,"-","1d10+5","R",4,"Balanced, Tearing",1,10,5]

{"sheet":"armour","index":17,"n_rows":19,"n_cols":15,"rows_kept":19,"hidden":true}
["Name","Locations Covered","AP","Head AP","Body AP","RA AP","LA AP","RL AP","LL AP","Head AP","Body AP","RA AP","LA AP","RL AP","LL AP"]
["Astartes Scout Armour","Body, Arms",6,null,6,6,6,{"$nulls":3},6,6,6]
["Carapace Armour","All",6,6,6,6,6,6,6,6,6,6,6,6,6]
["Deathwatch Scout Armour","Arms, Body, Legs",6,6,6,6,6,6,6,6,6,6,6,6,6]
["Flak Armour","All",4,4,4,4,4,4,4,4,4,4,4,4,4]
["Primitive Armour","Varies","Varies","Varies","Varies","Varies","Varies","Varies","Varies","Varies","Varies","Varies","Varies","Varies","Varies"]
["Astartes Artificer Armour","All",12,12,12,12,12,12,12,12,12,12,12,12,12]
["Astartes Terminator Armour","All",14,14,14,14,14,14,14,14,14,14,14,14,14]
["Mk1 \"Thunder\" Armour","All","4 / 6 / 8",6,8,6,6,4,4,6,8,6,6,4,4]
["Mk2 \"Crusade\" Armour","All","7 / 9",7,9,7,7,7,7,7,9,7,7,7,7]
["Mk3 \"Iron\" Armour","All","9(6) / 10(6)",9,10,9,9,9,9,6,6,6,6,6,6]
["Mk4 \"Maximus\" Armour","All","7 / 9",7,9,7,7,7,7,7,9,7,7,7,7]
["Mk5 \"Heresy\" Armour","All","8 / 9",8,9,8,8,8,8,8,9,8,8,8,8]
["Mk6 \"Corvus\" Armour","All","8 / 9",8,9,8,8,8,8,8,9,8,8,8,8]
["Mk7 \"Aquila\" Armour","All","8 / 10",8,10,8,8,8,8,8,10,8,8,8,8]
["Mk8 \"Errant\" Armour","All","8 / 11",8,11,8,8,8,8,8,11,8,8,8,8]
["Diagnostor Helmet","Head",8,8,0,0,0,0,0,8,0,0,0,0,0]
["Fenris-Pattern Wolf Helm","Head",8,8,0,0,0,0,0,8,0,0,0,0,0]
["Skull Helm","Head",9,9,0,0,0,0,0,9,0,0,0,0,0]

{"sheet":"force_fld","index":18,"n_rows":30,"n_cols":12,"rows_kept":30,"hidden":true}
["Name","Protection Rating","Overload Roll",null,"Ammo","Bolt","Flame","Plasma","Melta","Las","SP","Exotic"]
["Astartes Combat Shield",25,"1 - 10",null,"Astartes Backpack Ammo Supply","Clip 250","Clip 75","Clip 100","Clip 100","Clip 100","Clip 250"]
["Astartes Storm Shield",55,"1 - 10",null,"Breaching Rounds",{"$nulls":5},"Type X, Range -50%"]
["Iron Halo",50,1,null,"Dragonfire Shells","Dmg +2, Ag Test to avoid fire dmg"]
["Rosarius",50,1,null,"Hellfire Rounds","Ignore natural armour, Righteous Fury 9/10, Tearing; Hvy Bolter ROF S/-/-, Blast (3)"]
[{"$nulls":4},"Ignis Rounds",{"$nulls":5},"Type E, Ag Test to avoid fire dmg"]
[{"$nulls":4},"Implosion Shells","+1d5 Ag Dmg"]
[{"$nulls":4},"Kraken Rounds","Pen 8, Range +50%"]
[{"$nulls":4},"Metal Storm Rounds","Pen -2, Dmg -2, Blast (2)"]
[{"$nulls":4},"Penetrator Rounds",{"$nulls":5},"Pen +5, shotguns lose Scatter"]
[{"$nulls":4},"Razor-Web",{"$nulls":6},"-20 to escape, 2d10 dmg Pen 8"]
[{"$nulls":4},"Shredder Rounds",{"$nulls":5},"Pen +1, Tearing"]
[{"$nulls":4},"Slug Rounds",{"$nulls":5},"Lose Scatter, gain Tearing and Felling (1)"]
[{"$nulls":4},"Stalker Rounds","Dmg -2, -30 Awareness Test at half distance"]
[{"$nulls":4},"Vengeance Rounds","Felling (1), Pen 9, chance of premature detonation"]
[{"$nulls":4},"Witch Bolts","-1 Psy Rating for 1d10 rounds, Warp Instability WP check"]
[]
[{"$nulls":4},"Arm Weapon Mounting","-30% range"]
[{"$nulls":4},"Astartes Melee Attachment (Chain)"]
[{"$nulls":4},"Astartes Melee Attachment (Mono)"]
[{"$nulls":4},"Deathwatch Suspensor","Auto-stabilised Trait"]
[{"$nulls":4},"Dipole Mag-lock","Quick Draw Talent"]
[{"$nulls":4},"Fire Selector"]
[{"$nulls":4},"Motion Predictor","+10 BS semi- or full-auto"]
[{"$nulls":4},"Preysense Sight","No penalties in darkness, +20 Per Test at night"]
[{"$nulls":4},"Red-Dot Laser Sight","+10 BS single shot"]
[{"$nulls":4},"Silencer","-20 Awareness Test at half distance"]
[{"$nulls":4},"Telescopic Sight","Ignore penalties for long and extreme range, requires Full Action to Aim"]
[{"$nulls":4},"Tripod"]
[{"$nulls":4},"Vox-Operated"]

{"sheet":"result","index":19,"n_rows":309,"n_cols":5,"rows_kept":309,"hidden":true}
["Table","Lower","Upper","Question","Result"]
[1,1,4,"1: Why Was The Chapter Founded?","Strategic Prognostication"]
[1,5,6,"1: Why Was The Chapter Founded?","Counter"]
[1,7,8,"1: Why Was The Chapter Founded?","Standing Force"]
[1,9,{"$f":"IF(B5<=10,10,100)","v":10},"1: Why Was The Chapter Founded?","Crusade"]
[2,1,1,"2: When Was The Chapter Founded?","31st Millennium (the Chapter claims to be a Second Founding Chapter, although little or no evidence exists to support the belief )"]
[2,2,5,"2: When Was The Chapter Founded?","32nd Millennium (in the glorious Age of Rebirth)"]
[2,6,10,"2: When Was The Chapter Founded?","33rd Millennium (at the height of the time of the Beheading)"]
[2,11,20,"2: When Was The Chapter Founded?","34th Millennium (alongside the honoured dead during the Year of Ghosts)"]
[2,21,30,"2: When Was The Chapter Founded?","35th Millennium (just prior to the Howling)"]
[2,31,40,"2: When Was The Chapter Founded?","36th Millennium (at the time of the Urcouncil of Nova-Terra)"]
[2,41,50,"2: When Was The Chapter Founded?","37th Millennium (soon after the culmination of the Reign of Blood)"]
[2,51,60,"2: When Was The Chapter Founded?","38th Millennium (just prior to the Great Cull of 020.M37)"]
[2,61,70,"2: When Was The Chapter Founded?","39th Millennium (half a millennia after the defeat of the Apostle of the Blind King)"]
[2,71,80,"2: When Was The Chapter Founded?","40th Millennium (as the Imperium slides into the age of Waning)"]
[2,81,95,"2: When Was The Chapter Founded?","41st Millennium (the Twenty-Sixth and last known Founding)"]
[2,96,{"$f":"IF(B17<=10,10,100)","v":100},"2: When Was The Chapter Founded?","Unknown (the Chapter has been so ravaged by war that its archives have been lost and the bearers of its histories slain. The Chapter may have recovered, but its histories are lost and it must forge new ones)"]
[3,1,50,"3: Progenitor","Ultramarines"]
[3,51,65,"3: Progenitor","Blood Angels"]
[3,66,80,"3: Progenitor","Dark Angels"]
[3,81,85,"3: Progenitor","Imperial Fists"]
[3,86,90,"3: Progenitor","White Scars"]
[3,91,94,"3: Progenitor","Raven Guard"]
[3,95,98,"3: Progenitor","Iron Hands"]
[3,99,99,"3: Progenitor","Space Wolves"]
[3,100,{"$f":"IF(B26<=10,10,100)","v":100},"3: Progenitor","Salamanders"]
[4,1,5,"4: Gene-stock Purity","Pure: The new Chapter is a direct descendent of its Progenitor. It is likely to maintain close contact with its Progenitor and many brother Successors, and follows the traditions of its peers closely. Characters drawn from such Chapters follow all of the rules for those of their Progenitor."]
[4,6,7,"4: Gene-stock Purity","A New Generation: Attempts have been made to “breed out” real or perceived flaws in the Progenitor’s gene-stock, introducing some divergence. Such Chapters often go on to define their own traditions and write their own histories, looking forward to the future more than back to the past. Some links may be maintained with the Progenitor Chapter, but it is just as likely that the new Chapter strikes out entirely on its own. Characters drawn from this Chapter follow all of the rules for those drawn from its Progenitor, but are not tied to the Progenitor’s Chapter Demeanour. Instead of using the Progenitor’s Chapter Demeanour, choose or roll on Table 1-5: Codex Demeanours to randomly select one of the new Codex Demeanours."]
[4,8,9,"4: Gene-stock Purity","Altered Stock: For whatever reason, the Chapter’s gene-seed has subtly altered, causing some zygotes to become deficient. While some links are maintained with the Progenitor, the Battle-Brothers of the Chapter may be shunned, for they appear subtly different to their brethren. Characters drawn from this Chapter follow the normal rules for the Progenitor, but must roll on Table 1-7: Gene-Seed Deficiencies."]
[4,10,{"$f":"IF(B30<=10,10,100)","v":10},"4: Gene-stock Purity","Flawed: A major flaw has been introduced, marking the Chapter apart from its brother Successors. Chapters suffering some kind of flaw are often forced to forge their own destiny, either embracing their fate or raging against it. Some go on to earn glory despite their flaw, while others are consumed by it, burning brightly, if all too briefly. Characters drawn from this Chapter follow the usual rules for the Progenitor, but have a 50/50 chance of either using the Chapter Demeanour or rolling on Table 1-5: Codex Demeanours. In addition, they must roll on Table 1-8: Chapter Flaws."]
[5,1,1,"5: Codex Demeanours","Swift as the Wind"]
[5,2,2,"5: Codex Demeanours","Cleanse and Purify"]
[5,3,3,"5: Codex Demeanours","No Mercy, No Respite"]
[5,4,4,"5: Codex Demeanours","Purity Above All"]
[5,5,5,"5: Codex Demeanours","Scions of Mars"]
[5,6,6,"5: Codex Demeanours","See, But Don’t be Seen"]
[5,7,7,"5: Codex Demeanours","Suffer Not the Alien to Live"]
[5,8,8,"5: Codex Demeanours","Suffer Not the Work of Heretics"]
[5,9,9,"5: Codex Demeanours","Brothers in Battle"]
[5,10,{"$f":"IF(B40<=10,10,100)","v":10},"5: Codex Demeanours","Uphold the Honour of the Emperor"]
[6,"Ultramarines","Ultramarines","6:Chance of Gene-seed Mutation",10]
[6,"Blood Angels","Blood Angels","6:Chance of Gene-seed Mutation",50]
[6,"Dark Angels","Dark Angels","6:Chance of Gene-seed Mutation",10]
[6,"Imperial Fists","Imperial Fists","6:Chance of Gene-seed Mutation",10]
[6,"White Scars","White Scars","6:Chance of Gene-seed Mutation",20]
[6,"Raven Guard","Raven Guard","6:Chance of Gene-seed Mutation",20]
[6,"Iron Hands","Iron Hands","6:Chance of Gene-seed Mutation",20]
[6,"Space Wolves","Space Wolves","6:Chance of Gene-seed Mutation",75]
[6,"Salamanders","Salamanders","6:Chance of Gene-seed Mutation",90]
[7,1,1,"7: Gene-seed Deficiencies","Hyper-stimulated Omophagea: Having tasted the flesh of the foe once, the Chapter’s Battle-Brothers develop an addiction to the processes allowed by the Omophagea. A player character confronted with the opportunity to partake of the flesh of a fallen enemy must pass a Challenging (+0) Willpower Test or do so immediately, whether he wants to or not."]
[7,2,2,"7: Gene-seed Deficiencies","Oversensitive Occulobe: The organ that allows the Space Marines to see in low light conditions has become overly sensitised, working exceptionally well in the dark but suffering in full light conditions. The character can see in total dark as if it were merely low light, and low light as if it were full light. However, should he remove his helmet in full light conditions he will suffer –10 to all Awareness Tests."]
[7,3,3,"7: Gene-seed Deficiencies","Mutated Catalepsean Node: The implant that allows the Battle-Brother to enter a half-sleep in which he can remain alert for danger has become dangerously mutated. The Space Marine is unable to sleep normally, and stays awake for days, even weeks on end without effect. However, when sleep does come, sometimes with little or no warning, it is wont to last for many days on end."]
[7,4,4,"7: Gene-seed Deficiencies","Oolitic Secretions: The Chapter’s oolitic kidney function is unbalanced in such a way that the Battle-Brother’s skin is turned an unusual colour due to its secretions. The Space Sharks (for example) have grey skin, while the Salamanders’ is the colour of volcanic rock. A whole range of other colours is possible, and the more extreme might be viewed by some as a seriously disturbing mutation."]
[7,5,5,"7: Gene-seed Deficiencies","Disturbing Voice: Due to a malfunction in or related to the function of the Betcher’s gland, the Chapter’s brethren exhibit unusual vocal characteristics. Some cannot speak above a sibilant whisper for example, while others have deep, booming voices or speak with an otherworldly cant. Allies might find the effect disturbing, while enemies are likely to find it truly terrifying. All Space Marines with this deficiency have the Disturbing Voice Talent."]
[7,6,8,"7: Gene-seed Deficiencies","Lost Zygote: One of the Chapter’s zygotes has entirely ceased to function. Choose one of the Implants described on page 36 of the DEATHWATCH Rulebook. The in game benefits of this Implant no longer apply. In some cases the player should agree with the GM exactly what effect this has on the character, as the effects of some implants are wrapped up in other character abilities, Skills and Talents."]
[7,9,9,"7: Gene-seed Deficiencies","Doomed: A Chapter that loses the ability to replicate either the Black Carapace or Progenoid zygotes is ultimately doomed. Without the former the future generations of Space Marines will not be able to interface with their power armour, and without the latter there will be no future generations at all. Battle-Brothers with this mutation are unaffected themselves, but know that unless their Chapter’s Apothecaries can affect a cure, they are the very last of their line."]
[7,10,{"$f":"IF(B57<=10,10,100)","v":10},"7: Gene-seed Deficiencies","Multiple Instabilities: Roll d3 more times on this table, re-rolling multiples of the same result (including this one)."]
[8,1,2,"8: Chapter Flaw","We Stand Alone: For a variety of potential reasons, the Chapter’s Battle-Brothers are either distrusted by other Imperial forces, or they themselves shun contact with others. Such brethren rarely serve in the Deathwatch, but those who are able to overcome this distrust or prove themselves worthy of others’ regard earn much honour in the process."]
[8,3,4,"8: Chapter Flaw","Pride in the Colours: While all Chapters take great pride in their badge and livery, some take this pride to such an extreme that they regard anything that hides them as a form of cowardice. They wear their colours proudly and make use of back banners the better to announce their presence on the field of battle. Such Battle-Brothers may baulk at the Deathwatch’s tradition of painting over its members armour when the Apocryphon Oath is taken. Some have even refused to do so, serving only a short time with the Deathwatch before returning to their Chapters in bitterness. Others have, in time, overcome their hubris and earned a place in the annals of the Long Vigil."]
[8,5,6,"8: Chapter Flaw","Faith in Suspicion: There are some Chapters that hold many other arms of the Imperium in great contempt, whether sanctioned psykers, bureaucrats, officers of the Ecclesiarchy or even the Inquisition. Perhaps there has been strife between the groups, or else the Chapter simply holds itself in such high esteem that all others are deserving only of contempt—or perhaps they genuinely have something to hide. Select a single Imperial institution (see the Pillars of the Imperium box on page 117 of the DEATHWATCH Rulebook), apart from Space Marines. The Chapter holds this particular institution in total contempt and its brethren utterly refuse to work with or alongside it."]
[8,7,8,"8: Chapter Flaw","Eye to Eye: The Chapter sees no honour in any other form of combat than man to man, eye to eye. It eschews many other aspects of war, and always seeks to deliver the killing blow in person, at the very speartip of battle. Battle-Brothers from the Chapter are temperamentally or doctrinally ill-disposed towards other tactics, and are often overcome with the desire to witness in person the death of their foes. Some indulge in gristly rituals to prove their measure in close combat such as the taking of heads or ripping out the foe’s still-beating heart before his very eyes."]
[8,9,{"$f":"IF(B62<=10,10,100)","v":10},"8: Chapter Flaw","Chapter Cult: Every Chapter venerates the Emperor, its Progenitor’s Primarch and its own heroes according to its own traditions, some of which are wildly at odds with the tenets of the Imperial Creed. This particular Chapter has developed ritual practices so extreme or exotic that even fellow Space Marines baulk at the site of them. Such practices range from gristly sanguinary rites to dark victory celebrations, and are perhaps best left to the imagination of the player! A Battle-Brother serving in the Deathwatch may have to conceal the worst excesses of his Chapter’s cult, even from the closest members of his Kill-team, and practice them in seclusion lest he cause grave offence or disgust."]
[9,1,8,"9: Missing or Inactive Zygotes","Catalepsean Node"]
[9,9,17,"9: Missing or Inactive Zygotes","Preomnor"]
[9,18,26,"9: Missing or Inactive Zygotes","Omophagea"]
[9,27,35,"9: Missing or Inactive Zygotes","Occulobe"]
[9,36,44,"9: Missing or Inactive Zygotes","Lyman’s Ear"]
[9,45,53,"9: Missing or Inactive Zygotes","Sus-an Membrane"]
[9,54,62,"9: Missing or Inactive Zygotes","Oolitic Kidney"]
[9,63,71,"9: Missing or Inactive Zygotes","Neuroglottis"]
[9,72,90,"9: Missing or Inactive Zygotes","Mucranoid"]
[9,91,89,"9: Missing or Inactive Zygotes","Betcher’s Gland"]
[9,90,98,"9: Missing or Inactive Zygotes","Melanchromic Organ"]
[9,99,{"$f":"IF(B74<=10,10,100)","v":100},"9: Missing or Inactive Zygotes","Roll Twice on this Chart"]
[10,1,10,"10: Chapter Characteristic Modifiers","The Chapter steadfastly practices daily Bolter drills combined with prayers to the God-Emperor. Space Marines of this Chapter gain +5 Ballistic Skill and +5 Willpower."]
[10,11,20,"10: Chapter Characteristic Modifiers","Warriors of this Chapter undergo a more stringent hypno-conditioning than those of other Chapters. Space Marines of this Chapter gain +5 Willpower and +5 Intelligence."]
[10,21,30,"10: Chapter Characteristic Modifiers","Equally famed for their skill with both blade and gun, Space Marines from this Chapter are highly sought after by the Deathwatch. Space Marines of this Chapter gain +5 Ballistic Skill and +5 Weapon Skill."]
[10,31,40,"10: Chapter Characteristic Modifiers","This Chapter’s gene-seed favours strength and cunning. Space Marines of this Chapter gain +5 Perception and +5 Strength."]
[10,41,50,"10: Chapter Characteristic Modifiers","Adeptus Astartes from this Chapter possess a rugged and flexible combat doctrine. Space Marines of this Chapter gain +2 Wounds and +5 to any one characteristic of the player’s choice."]
[10,51,60,"10: Chapter Characteristic Modifiers","Duty unto death is a fitting motto for Space Marines from this Chapter. Often they will go on when others have perished. Space Marines of this Chapter gain +5 Toughness and +5 Willpower."]
[10,61,70,"10: Chapter Characteristic Modifiers","Lightning raids that inspire their fellows to greater deeds are the trademark of this Chapter. Space Marines of this Chapter gain +5 Agility and +5 Fellowship."]
[10,71,80,"10: Chapter Characteristic Modifiers","The warrior-scholars from this Chapter have often noticed clues that their more zealous comrades have missed. Space Marines of this Chapter gain +5 Perception and +5 Intelligence."]
[10,81,90,"10: Chapter Characteristic Modifiers","Members of this Chapter are famed far and wide for both their skill with the blade as well as their leadership under fire. Space Marines of this Chapter gain +5 Weapon Skill and +5 Fellowship."]
[10,91,{"$f":"IF(B84<=10,10,100)","v":100},"10: Chapter Characteristic Modifiers","This Chapter favours fluid tactics or possesses a particularly pure gene-seed. Space Marines of this Chapter gain +5 to two characteristics of the player’s choice."]
[11,1,20,"11: Figures of Legend","A Battle-Brother seconded from a previous generation Successor or even the First Founding Legion that provided the new Chapter’s gene-seed. Roll again on this table to determine what type of warrior he was, rerolling if you get this result again."]
[11,21,50,"11: Figures of Legend","Chapter Master"]
[11,51,60,"11: Figures of Legend","Chief Librarian"]
[11,61,70,"11: Figures of Legend","Master of Sanctity"]
[11,71,73,"11: Figures of Legend","Master of the Forge"]
[11,74,74,"11: Figures of Legend","Master of the Fleet"]
[11,75,75,"11: Figures of Legend","Chief Apothecary"]
[11,76,85,"11: Figures of Legend","Company Captain (roll d10 to determine which company)."]
[11,86,89,"11: Figures of Legend","Squad Sergeant (roll d10 twice to determine company and squad)."]
[11,90,99,"11: Figures of Legend","Battle-Brother (roll d10 twice to determine company and squad)."]
[11,100,{"$f":"IF(B95<=10,10,100)","v":100},"11: Figures of Legend","A specialist of your choice (Librarian, Chaplain, Techmarine, driver, pilot, etc)."]
[12,1,25,"12: Deeds of Legend","The figure is remembered as the bane of the Orks, to such an extent that his name is known to the vile greenskins even to this day."]
[12,26,50,"12: Deeds of Legend","The individual was a stalwart enemy of the servants of Chaos, and slew a Daemon Prince."]
[12,51,70,"12: Deeds of Legend","The hero led a glorious campaign against a rebel army, defeating the foe and bringing an entire sector back into the light of the Emperor."]
[12,71,85,"12: Deeds of Legend","The figure led an action against an Eldar craftworld, boarding it and inflicting grievous casualties before withdrawing. He and his Chapter are especially hated by the pernicious Eldar, for whom the event is still fresh and raw."]
[12,86,90,"12: Deeds of Legend","The hero was lost to his Chapter in a warp accident, yet his descendents have cause to believe he lives still and may one day return to them in glory."]
[12,91,95,"12: Deeds of Legend","The hero was the first to face some newly discovered alien race, and ultimately responsible for its total destruction. Centuries later, only the Chapter remembers the name of the race, so utterly was it and its works cast down."]
[12,96,{"$f":"IF(B102<=10,10,100)","v":100},"12: Deeds of Legend","The hero led his Chapter in many glorious campaigns, slaying hundreds of the enemy’s greatest champions. In the end, he was brought down by treachery within the fold of the Imperium, slain by an assassin’s turbo-penetrator round on the field of battle. Just why he was targeted was never discovered, and the Chapter harbours a special hatred for the servants of the Oficio Assassinorum to this day."]
[13,1,30,"13: Chapter Home World Category","Hive world"]
[13,31,60,"13: Chapter Home World Category","Feral world"]
[13,61,70,"13: Chapter Home World Category","Medieval world"]
[13,71,80,"13: Chapter Home World Category","Civilised world"]
[13,81,90,"13: Chapter Home World Category","Uninhabited world"]
[13,91,{"$f":"IF(B108<=10,10,100)","v":100},"13: Chapter Home World Category","Fleet based"]
[14,1,25,"14: Chapter Home World Terrain","Jungle"]
[14,26,50,"14: Chapter Home World Terrain","Desert"]
[14,51,60,"14: Chapter Home World Terrain","Ice"]
[14,61,65,"14: Chapter Home World Terrain","Ocean"]
[14,66,75,"14: Chapter Home World Terrain","Wasteland"]
[14,76,80,"14: Chapter Home World Terrain","Urban"]
[14,81,85,"14: Chapter Home World Terrain","Dead"]
[14,86,89,"14: Chapter Home World Terrain","Airless"]
[14,90,{"$f":"IF(B117<=10,10,100)","v":100},"14: Chapter Home World Terrain","Temperate"]
[15,1,1,"15: Home World Relationship","Direct Rule"]
[15,2,4,"15: Home World Relationship","Stewardship"]
[15,5,{"$f":"IF(B120<=10,10,100)","v":10},"15: Home World Relationship","Distant Rule"]
[16,1,7,"16: Ultramarines Successor Chapter Organisation","Codex Chapter"]
[16,8,9,"16: Ultramarines Successor Chapter Organisation","Divergent Chapter"]
[16,10,{"$f":"IF(B123<=10,10,100)","v":10},"16: Ultramarines Successor Chapter Organisation","Unique Organisation (note that an Ultramarines Successor straying this far from the Codex Astartes is likely to be estranged from its Progenitor and shunned by its brother (Successor Chapters)"]
[17,1,5,"17: Other Successor Chapter Organisation","Codex Chapter"]
[17,6,8,"17: Other Successor Chapter Organisation","Divergent Chapter"]
[17,9,{"$f":"IF(B126<=10,10,100)","v":10},"17: Other Successor Chapter Organisation","Unique Organisation"]
[18,1,1,"18: Combat Doctrine","Close Combat"]
[18,2,2,"18: Combat Doctrine","Ranged Combat"]
[18,3,3,"18: Combat Doctrine","Armoured Assault"]
[18,4,4,"18: Combat Doctrine","Stealth"]
[18,5,5,"18: Combat Doctrine","Lightning Strike"]
[18,6,6,"18: Combat Doctrine","Drop Pod"]
[18,7,7,"18: Combat Doctrine","Thunderhawk Assault"]
[18,8,8,"18: Combat Doctrine","Siege"]
[18,9,9,"18: Combat Doctrine","Shock and Awe"]
[18,10,{"$f":"IF(B136<=10,10,100)","v":10},"18: Combat Doctrine","Terror"]
[19,1,30,"19: Solo Mode Abilities","The Chapter strictly follows the guidelines for combat set down by its parent Chapter. Choose one Solo Mode Ability from an existing Chapter."]
[19,31,45,"19: Solo Mode Abilities","This chapter is highly skilled in certain areas of expertise. Choose any two skills. At Rank 1, your Chapter may re-roll failed Tests with these skills (once per attempt). At Rank 4, your Chapter gains a +10 to all Skill Tests using those skills. At Rank 8, your Chapter gains a bonus degree of success on any successful Skill Test using those skills."]
[19,46,60,"19: Solo Mode Abilities","One particular characteristic stands out prominently for this Chapter. Choose any one Characteristic. At Rank 1 your chapter may re-roll failed Tests using this Characteristic. (such as all Perception-based Tests). At Rank 4, your Chapter gains a +10 bonus to this test. At Rank 8, your Chapter gains a bonus degree of success on this test."]
[19,61,85,"19: Solo Mode Abilities","Quick reaction is the hallmark of this Chapter. While in Solo Mode, the Battle-Brother is considered to have the Lightning Reflexes Talent. At Rank 3, the Battle-Brother receives a +10 to all Dodge tests. At Rank 5, the Battle-Brother is considered to have the Rapid Reaction Talent. At Rank 7, once per game session the Battle-Brother may automatically pass any one Agility-Based test (for Opposed Tests, the Battle-Brother is considered to have rolled a 01)."]
[19,86,{"$f":"IF(B141<=10,10,100)","v":100},"19: Solo Mode Abilities","This Chapter has been trained to spot minute disturbances of the warp pressing in on realspace. This attunement to the empyrean grants the character the Psyniscience Skill as a Trained Skill. The Battle-Brother may also re-roll any failed Willpower Tests to resist a psychic power."]
[20,1,30,"20: Squad Mode Attack Patterns","The Chapter strictly follows the guidelines for combat set down by its parent Chapter. Choose one Squad Mode Attack Pattern Ability from an existing Chapter."]
[20,31,45,"20: Squad Mode Attack Patterns","Siege-Breaker\nAction: Full Action, Cost: 3, Sustained: Yes. While this ability is in effect, the Battle-Brother and those within Support Range of him may re-roll Damage rolls against enemies in cover. The second Damage roll must be accepted."]
[20,46,60,"20: Squad Mode Attack Patterns","Tactical Finesse\nAction: Full Action, Cost 3. Sustained: Yes. While this ability is in effect, the Battle-Brother and those within Support Range of him may make one Melee or Ranged attack as a Half Action (the Ranged Attack may only be made using the single shot rate of fire), and may then make a Half Move as a Free Action. A character benefiting from this ability may disengage from an opponent in melee without penalty."]
[20,61,85,"20: Squad Mode Attack Patterns","Storm of Hell\nAction: Full Action, Cost: 3, Sustained: Yes. While this ability is in effect, The Battle-Brother and those within Support Range of him gain the Furious Assault Talent and the Frenzy Talent. At Rank 4, activating this ability is a Half Action."]
[20,86,{"$f":"IF(B146<=10,10,100)","v":100},"20: Squad Mode Attack Patterns","Oath of Vengeance\nAction: Reaction, cost 1, Sustained: No. When any member of the Kill-Team within Support Range suffers Damage, this character receives a +4 bonus to the next Damage roll against the attacker. At Rank 5, this ability may be Sustained (the Damage bonus is received for as long as the ability is sustained)."]
[21,1,30,"21: Squad Mode Defensive Patterns","The Chapter strictly follows the guidelines for combat set down by its parent Chapter. Choose one Squad Mode Defensive Stance Ability from an existing Chapter."]
[21,31,45,"21: Squad Mode Defensive Patterns","Courage Under Fire\nAction: Free Action, Cost: 1, Sustained: No. The Battle-Brother inspires those under his command to press on in the face of danger. When this ability is used, the Battle-Brother and any within Support Range of him may immediately recover from being Pinned. At Rank 4, those under the effect of this ability may also make a Half-Move as a Free Action."]
[21,46,60,"21: Squad Mode Defensive Patterns","Only in Death...\nAction: Free Action, Cost: 3, Sustained: Yes. Space Marines from this Chapter are venerated amongst the Imperium for their ability to fight on through even the most grievous wounds. While this ability is active, the Battle-Brother and any within Support Range of him ignore the effects of any critical damage that would not kill them until this ability is no longer active. Once this ability ends, they suffer the full effects of any critical damage they received. This ability cannot be improved."]
[21,61,85,"21: Squad Mode Defensive Patterns","Swift Advance\nAction: Reaction, Cost: 2, Sustained: Yes. Members of this Chapter have the skill and training necessary to move quickly through even the most punishing onslaughts of gunfire. While this ability is active, the Battle-Brother and any within Support Range who successfully dodge a Ranged attack may spend their Reaction to make a Full Move. At Rank 4, they may also reload one weapon provided it does not take longer than a Half or Full Action to do so."]
[21,86,{"$f":"IF(B151<=10,10,100)","v":100},"21: Squad Mode Defensive Patterns","Knowledge is Power\nAction: Half Action, Cost: 3, Sustained: Yes. With knowledge of secret and forbidden lore, the Space Marines of this Chapter are able to more easily avoid sorcery and witchcraft. While under the effect of this ability, the Battle-Brother and any within Support Range of him receive a +10 bonus to any Tests made to resist the effects of a psychic power (this can include attempts to Dodge). At Rank 4, this bonus increases to +20."]
[22,1,20,"21: Squad Mode Defensive Patterns","Apothecary"]
[22,21,40,"21: Squad Mode Defensive Patterns","Assault Marine"]
[22,41,60,"21: Squad Mode Defensive Patterns","Devastator Marine"]
[22,61,80,"21: Squad Mode Defensive Patterns","Techmarine"]
[22,81,97,"21: Squad Mode Defensive Patterns","Librarian"]
[22,98,{"$f":"IF(B157<=10,10,100)","v":100},"21: Squad Mode Defensive Patterns","Roll Twice on this Chart or choose something truly unusual (i.e., the Chapter has no Scouts, the Chapter’s Veterans are not formed"]
[23,1,10,"22: Specialty Restrictions","Traditional Weapon: The Chapter favours one specific weapon over all others. Choose one specific weapon to serve as the Chapter’s traditional weapon. Examples: Power Sword, Bolt Pistol, Melta Gun"]
[23,11,20,"22: Specialty Restrictions","Totemic Charm: This Chapter has strong beliefs in the icons of either the Emperor or their Primarch. A Battle-Brother from this Chapter would never be caught without such an icon on their person. Example: Chapter Heraldry on a necklace, Imperial Aquilla tattooed over the right eye."]
[23,21,30,"22: Specialty Restrictions","Modified Jump-Pack: Primarily seen in Chapter’s that favor the Assault Combat Doctrine, Battle-Brother’s from this Chapter modify their Jump-Packs (with a Tech-Marine’s help of course) to provide a more glorious sight to their allies and a more terrifying one to their enemies. Examples: Jump-Pack’s created in different shapes such as angel wings."]
[23,31,40,"22: Specialty Restrictions","Beastial Companion: More common among those Chapter’s whose origins come from Feral Worlds, this Chapter prides itself on raising hunting animals to assist in battle. Examples: Fenrisian Wolf, hunting birds."]
[23,41,50,"22: Specialty Restrictions","Rare Weaponry: Whether through the blessing of the Adeptus Mechanicus or sheer good fortune, this Chapter has a large stock of weaponry that is considered rare amongst the other Chapters. It is seen as a symbol of honour to wield one of these weapons in battle. Examples: Astartes Assault Cannon, Digital Weapons."]
[23,51,60,"22: Specialty Restrictions","Blessed Wargear: It is common for members of this Chapter to have their Wargear blessed by a Chaplain before battle. Doing so puts the Battle-Brother’s mind at ease and more focused on the task at hand."]
[23,61,70,"22: Specialty Restrictions","Special Mount: While other Chapter’s may keep animals as companions, this Chapter uses them for what they were intended for—transportation. Examples: Fenrisian Wolf, Carnodon, very angry Grox."]
[23,71,80,"22: Specialty Restrictions","Special Vehicle: This Chapter prefers to ride into battle in more modern conveyances. While the traditional Space Marine vehicle is the Rhino, other Chapters may use more rare vehicles as primary transport. Examples: Modified Rhino, Land Raider, or Land Speeder"]
[23,81,90,"22: Specialty Restrictions","Preferred Fighting Style: The Chapter has a specific way in which it prefers to go about killing the enemy in the name of the God Emperor of Mankind. Examples: Bolt Pistol and Chainsword, dual Power Swords, special Bolter pattern or ammunition"]
[23,91,{"$f":"IF(B167<=10,10,100)","v":100},"22: Specialty Restrictions","Modified Weaponry: When the Chapter’s forges produce a weapon, they produce them in a style that is specific to their Chapter. Examples: Power Sabre, Bolt Pistol with weighted butt for clubbing."]
[24,1,40,"23: Special Equipment","Revere the Primarch"]
[24,41,65,"23: Special Equipment","The Emperor Above All"]
[24,66,75,"23: Special Equipment","Honour the Ancestors"]
[24,76,80,"23: Special Equipment","Death Cult"]
[24,81,85,"23: Special Equipment","Totem Creature"]
[24,86,90,"23: Special Equipment","Purity of Man"]
[24,91,95,"23: Special Equipment","Steel Over Flesh"]
[24,96,{"$f":"IF(B175<=10,10,100)","v":100},"23: Special Equipment","Esoteric Beliefs"]
[25,1,1,"24: Chapter Beliefs","Endangered: The Chapter numbers only a handful of Companies or less having suffered devastating losses in combat, accident, or dramatic genetic instability. If recovery is even possible it will take many decades, making every Battle-Brother (and his Progenoids) an invaluable resource."]
[25,2,4,"24: Chapter Beliefs","Under Strength: The Chapter is recovering from a defeat or accident that occurred several decades ago, or has recently suffered heavy, but not irrecoverable losses. It is probably at a minimum of half strength, and should return to nominal strength within a decade."]
[25,5,9,"24: Chapter Beliefs","Nominal: The Chapter can field ten full companies, each with ten squads. In all likelihood most every squad consist of ten brethren and some specialised appointments may be empty, but the Chapter is regarded as fully fit for battle."]
[25,10,{"$f":"IF(B179<=10,10,100)","v":10},"24: Chapter Beliefs","Over Strength: Some Chapters maintain more than the prescribed ten companies, though it is rare for more than a handful more to be fielded and even then only temporarily. It may be that the Emperor’s Tarot has predicted terrible losses ahead, or that the Chapter simply regards its numbers as optimal and cares little for the dictates of the Codex Astartes."]
[26,1,5,"25: Chapter Status","Administratum"]
[26,6,15,"25: Chapter Status","Adeptus Arbites"]
[26,16,30,"25: Chapter Status","One other Adeptus Astartes Chapter (choose any one)"]
[26,31,35,"25: Chapter Status","Adeptus Astra Telepathica"]
[26,36,45,"25: Chapter Status","Adeptus Mechanicus"]
[26,46,50,"25: Chapter Status","Adepta Sororitas"]
[26,51,55,"25: Chapter Status","Adeptus Titanicus"]
[26,56,58,"25: Chapter Status","Astropaths"]
[26,59,60,"25: Chapter Status","Chartist Captains"]
[26,61,65,"25: Chapter Status","Ecclesiarchy"]
[26,66,75,"25: Chapter Status","Imperial Guard raised from a specific world"]
[26,76,79,"25: Chapter Status","Imperial Navy"]
[26,80,85,"25: Chapter Status","Inquisition"]
[26,86,88,"25: Chapter Status","Navigators"]
[26,89,90,"26: Chapter Friends","Officio Assassinorum"]
[26,91,93,"26: Chapter Friends","Planetary Defence Force of a specific world (choose any one and create a name for that force)"]
[26,94,98,"26: Chapter Friends","A Rogue Trader dynasty"]
[26,99,99,"26: Chapter Friends","Schola Progenium"]
[26,100,{"$f":"IF(B198<=10,10,100)","v":100},"26: Chapter Friends","Scholastica Psykanarot"]
[27,1,2,"27: Chapter Enemies","Roll on Table 1–26: Chapter Friends to determine the Chapter’s Enemy."]
[27,3,31,"27: Chapter Enemies","The Orks (alternatively, you may select a particular Waaagh! or Warboss)"]
[27,32,42,"27: Chapter Enemies","The Eldar (alternatively, you may select a particular Craftworld or leader)"]
[27,43,51,"27: Chapter Enemies","The Tyranids (alternatively, you may select a particular Hive Fleet)"]
[27,52,68,"27: Chapter Enemies","Chaos Space Marines (you should choose a particular warband, Chapter, or Traitor Legion)"]
[27,69,79,"27: Chapter Enemies","A particular Daemon, Daemon Prince or Disciple of Chaos"]
[27,80,87,"27: Chapter Enemies","A particular Chaos-aligned group (i.e., Traitor Titan Legion, Chaos pirates, renegade Imperial Guard, etc.)"]
[27,88,96,"27: Chapter Enemies","The Dark Eldar (alternatively, you may select a particular Kabal or leader)."]
[27,97,98,"27: Chapter Enemies","The Tau (alternatively, you may select a particular Tau force or leader)"]
[27,99,{"$f":"IF(B208<=10,10,100)","v":100},"27: Chapter Enemies","Other (choose one force or group, such as aliens or heretics or a specific cult)"]
[28,1,1,"27: Chapter Name Adjectives","Argent"]
[28,2,4,"27: Chapter Name Adjectives","Black"]
[28,5,6,"27: Chapter Name Adjectives","Shadow"]
[28,7,8,"27: Chapter Name Adjectives","Bloody"]
[28,9,10,"27: Chapter Name Adjectives","Brazen"]
[28,11,11,"27: Chapter Name Adjectives","Brothers"]
[28,12,13,"27: Chapter Name Adjectives","Celestial"]
[28,14,16,"27: Chapter Name Adjectives","Crimson"]
[28,17,20,"27: Chapter Name Adjectives","Dark"]
[28,21,23,"27: Chapter Name Adjectives","Death"]
[28,24,25,"27: Chapter Name Adjectives","Doom"]
[28,26,29,"27: Chapter Name Adjectives","Emperor’s"]
[28,30,31,"27: Chapter Name Adjectives","Fiery"]
[28,32,33,"27: Chapter Name Adjectives","Flesh"]
[28,34,37,"27: Chapter Name Adjectives","Golden"]
[28,38,39,"27: Chapter Name Adjectives","Guardian"]
[28,40,41,"27: Chapter Name Adjectives","Halo"]
[28,42,43,"27: Chapter Name Adjectives","Honoured"]
[28,44,46,"27: Chapter Name Adjectives","Imperial"]
[28,47,50,"27: Chapter Name Adjectives","Iron"]
[28,51,52,"27: Chapter Name Adjectives","Mailed"]
[28,53,54,"27: Chapter Name Adjectives","Millennial"]
[28,55,58,"27: Chapter Name Adjectives","Night"]
[28,59,60,"27: Chapter Name Adjectives","Omega"]
[28,61,62,"27: Chapter Name Adjectives","Obsidian"]
[28,63,66,"27: Chapter Name Adjectives","Red"]
[28,67,69,"27: Chapter Name Adjectives","Sable"]
[28,70,74,"27: Chapter Name Adjectives","Silver"]
[28,75,78,"27: Chapter Name Adjectives","Space"]
[28,79,83,"27: Chapter Name Adjectives","Star"]
[28,84,88,"27: Chapter Name Adjectives","Steel"]
[28,89,91,"27: Chapter Name Adjectives","Storm"]
[28,92,93,"27: Chapter Name Adjectives","Thunder"]
[28,94,94,"27: Chapter Name Adjectives","Ultimate"]
[28,95,95,"27: Chapter Name Adjectives","Ultra"]
[28,96,98,"27: Chapter Name Adjectives","War"]
[28,99,{"$f":"IF(B245<=10,10,100)","v":100},"27: Chapter Name Adjectives","White"]
[29,1,3,"29: Chapter Name Nouns","Angels"]
[29,4,5,"29: Chapter Name Nouns","Bearers"]
[29,6,7,"29: Chapter Name Nouns","Blood"]
[29,8,11,"29: Chapter Name Nouns","Brothers"]
[29,12,13,"29: Chapter Name Nouns","Champions"]
[29,14,15,"29: Chapter Name Nouns","Consuls"]
[29,16,17,"29: Chapter Name Nouns","Crusaders"]
[29,18,19,"29: Chapter Name Nouns","Death"]
[29,20,21,"29: Chapter Name Nouns","Destroyers"]
[29,22,23,"29: Chapter Name Nouns","Devourers"]
[29,24,25,"29: Chapter Name Nouns","Dragons"]
[29,26,27,"29: Chapter Name Nouns","Eagles"]
[29,28,30,"29: Chapter Name Nouns","Fists"]
[29,31,32,"29: Chapter Name Nouns","Falcons"]
[29,33,33,"29: Chapter Name Nouns","Fire"]
[29,34,34,"29: Chapter Name Nouns","Fury"]
[29,35,35,"29: Chapter Name Nouns","Griffons"]
[29,36,37,"29: Chapter Name Nouns","Guard"]
[29,38,39,"29: Chapter Name Nouns","Hands"]
[29,40,40,"29: Chapter Name Nouns","Hawks"]
[29,41,41,"29: Chapter Name Nouns","Helms"]
[29,42,43,"29: Chapter Name Nouns","Hunters"]
[29,44,44,"29: Chapter Name Nouns","Inferno"]
[29,45,45,"29: Chapter Name Nouns","Jaguars"]
[29,46,47,"29: Chapter Name Nouns","Knights"]
[29,48,48,"29: Chapter Name Nouns","Lions"]
[29,49,50,"29: Chapter Name Nouns","Lords"]
[29,51,52,"29: Chapter Name Nouns","Marauders"]
[29,53,53,"29: Chapter Name Nouns","Nightmare"]
[29,54,55,"29: Chapter Name Nouns","Panthers"]
[29,56,57,"29: Chapter Name Nouns","Paladins"]
[29,58,58,"29: Chapter Name Nouns","Questors"]
[29,59,59,"29: Chapter Name Nouns","Rampagers"]
[29,60,61,"29: Chapter Name Nouns","Scorpions"]
[29,62,63,"29: Chapter Name Nouns","Sentinels"]
[29,64,65,"29: Chapter Name Nouns","Skulls"]
[29,66,67,"29: Chapter Name Nouns","Souls"]
[29,68,70,"29: Chapter Name Nouns","Sons"]
[29,71,71,"29: Chapter Name Nouns","Spectres"]
[29,72,73,"29: Chapter Name Nouns","Swords"]
[29,74,75,"29: Chapter Name Nouns","Talons"]
[29,76,77,"29: Chapter Name Nouns","Tearers"]
[29,78,79,"29: Chapter Name Nouns","Templars"]
[29,80,80,"29: Chapter Name Nouns","Tigers"]
[29,81,81,"29: Chapter Name Nouns","Ultima"]
[29,82,83,"29: Chapter Name Nouns","Vengeance"]
[29,84,85,"29: Chapter Name Nouns","Valedictors"]
[29,86,87,"29: Chapter Name Nouns","Wardens"]
[29,88,90,"29: Chapter Name Nouns","Warriors"]
[29,91,92,"29: Chapter Name Nouns","Wings"]
[29,93,94,"29: Chapter Name Nouns","Wolves"]
[29,95,95,"29: Chapter Name Nouns","Zephyrs"]
[29,96,98,"29: Chapter Name Nouns","The name of the Chapter’s home world"]
[29,99,{"$f":"IF(B299<=10,10,100)","v":100},"29: Chapter Name Nouns","The name of a Chapter hero"]
[30,1,10,"30: Custom Chapter Advance Tables","Strength of Arms"]
[30,11,20,"30: Custom Chapter Advance Tables","Death from Afar"]
[30,21,30,"30: Custom Chapter Advance Tables","Knowledge is Power"]
[30,31,40,"30: Custom Chapter Advance Tables","Command without Doubt"]
[30,41,50,"30: Custom Chapter Advance Tables","Behold our Wrath"]
[30,51,60,"30: Custom Chapter Advance Tables","Secret Lore"]
[30,61,70,"30: Custom Chapter Advance Tables","No Respite to the Enemy"]
[30,71,80,"30: Custom Chapter Advance Tables","Honoured Wargear"]
[30,81,90,"30: Custom Chapter Advance Tables","Daemon Bane"]
[30,91,{"$f":"IF(B309<=10,10,100)","v":100},"30: Custom Chapter Advance Tables","Xenos Bane"]

{"sheet":"d","index":20,"n_rows":31,"n_cols":2,"rows_kept":31,"hidden":true}
["Table","d"]
[1,10]
[2,100]
[3,100]
[4,10]
[5,10]
[6,100]
[7,10]
[8,10]
[9,100]
[10,100]
[11,100]
[12,100]
[13,100]
[14,100]
[15,10]
[16,10]
[17,10]
[18,10]
[19,100]
[20,100]
[21,100]
[22,100]
[23,100]
[24,100]
[25,10]
[26,100]
[27,100]
[28,100]
[29,100]
[30,100]

{"sheet":"Issues","index":21,"n_rows":356,"n_cols":5,"rows_kept":356,"hidden":true}
["ID","Version","Issue","Action","Version"]
[1,"04r8_20110607","Skill groups not checked on alt print","Fixed","04r8_20110608"]
[2,"04r8_20110607","Techmarine ability (Blessed by Omnissiah) should add Mechanicus Implants, Electro Graft Use and Mechadendrite Use","Fixed","04r8_20110608"]
[3,"04r8_20110607","Electro Graft Use should be removed from Deathwatch Advances","Already fixed","04r8_20110608"]
[4,"04r8_20110607","Power Fist and Thunderhammer increase Strength multiplier by 1","Fixed","04r8_20110608"]
[5,"04r8_20110607","Amulet of Might add +2 to Strength","Fixed","04r8_20110608"]
[6,"04r8_20110607","Techamrine starting Cybernetic choice not showing","Fixed","04r8_20110608"]
[7,"04r9_20110608","Space Marine Adv. Demolition cost incorrect","Fixed","04r10_20110610"]
[8,"04r11_20110613","Adv Spec Equip selection not working","Fixed","04r12_20110615"]
[9,"05r3_20120608","Bonus to AGI from Corvus PA History"]
[10,null,"Show benefit from Chapter Trapping"]
[11,"05r420120621","First Founding Chapters","Ongoing"]
[12,null,"Custom chapters - q 13, 14, and 17?"]
[13,null,"Save character","fixed","05r06_20131216"]
[14]
[15]
[16]
[17]
[18]
[19]
[20]
[21]
[22]
[23]
[24]
[25]
[26]
[27]
[28]
[29]
[30]
[31]
[32]
[33]
[34]
[35]
[36]
[37]
[38]
[39]
[40]
[41]
[42]
[43]
[44]
[45]
[46]
[47]
[48]
[49]
[50]
[51]
[52]
[53]
[54]
[55]
[56]
[57]
[58]
[59]
[60]
[61]
[62]
[63]
[64]
[65]
[66]
[67]
[68]
[69]
[70]
[71]
[72]
[73]
[74]
[75]
[76]
[77]
[78]
[79]
[80]
[81]
[82]
[83]
[84]
[85]
[86]
[87]
[88]
[89]
[90]
[91]
[92]
[93]
[94]
[95]
[96]
[97]
[98]
[99]
[100]
[101]
[102]
[103]
[104]
[105]
[106]
[107]
[108]
[109]
[110]
[111]
[112]
[113]
[114]
[115]
[116]
[117]
[118]
[119]
[120]
[121]
[122]
[123]
[124]
[125]
[126]
[127]
[128]
[129]
[130]
[131]
[132]
[133]
[134]
[135]
[136]
[137]
[138]
[139]
[140]
[141]
[142]
[143]
[144]
[145]
[146]
[147]
[148]
[149]
[150]
[151]
[152]
[153]
[154]
[155]
[156]
[157]
[158]
[159]
[160]
[161]
[162]
[163]
[164]
[165]
[166]
[167]
[168]
[169]
[170]
[171]
[172]
[173]
[174]
[175]
[176]
[177]
[178]
[179]
[180]
[181]
[182]
[183]
[184]
[185]
[186]
[187]
[188]
[189]
[190]
[191]
[192]
[193]
[194]
[195]
[196]
[197]
[198]
[199]
[200]
[201]
[202]
[203]
[204]
[205]
[206]
[207]
[208]
[209]
[210]
[211]
[212]
[213]
[214]
[215]
[216]
[217]
[218]
[219]
[220]
[221]
[222]
[223]
[224]
[225]
[226]
[227]
[228]
[229]
[230]
[231]
[232]
[233]
[234]
[235]
[236]
[237]
[238]
[239]
[240]
[241]
[242]
[243]
[244]
[245]
[246]
[247]
[248]
[249]
[250]
[251]
[252]
[253]
[254]
[255]
[256]
[257]
[258]
[259]
[260]
[261]
[262]
[263]
[264]
[265]
[266]
[267]
[268]
[269]
[270]
[271]
[272]
[273]
[274]
[275]
[276]
[277]
[278]
[279]
[280]
[281]
[282]
[283]
[284]
[285]
[286]
[287]
[288]
[289]
[290]
[291]
[292]
[293]
[294]
[295]
[296]
[297]
[298]
[299]
[300]
[301]
[302]
[303]
[304]
[305]
[306]
[307]
[308]
[309]
[310]
[311]
[312]
[313]
[314]
[315]
[316]
[317]
[318]
[319]
[320]
[321]
[322]
[323]
[324]
[325]
[326]
[327]
[328]
[329]
[330]
[331]
[332]
[333]
[334]
[335]
[336]
[337]
[338]
[339]
[340]
[341]
[342]
[343]
[344]
[345]
[346]
[347]
[348]
[349]
[350]
[351]
[352]
[353]
[354]
[355]

{"sheet":"Content","index":22,"n_rows":18,"n_cols":3,"rows_kept":18,"hidden":true}
["Book","Element","Status"]
["Core Rules","Chapters"]
[null,"Speciallties"]
[null,"Wargear"]
[]
[]
[]
["Rites of Battle"]
["The Emperor Protects"]
["Mark of the Xenos"]
["The Achilus Crusade"]
["First Founding","Chapters"]
["The Jericho Reach"]
["Rising Tempest"]
["Honour the Chapter"]
["The Outer Reach"]
["Ark of Lost Souls"]
["The Emperor's Chosen"]